jmeter-dev mailing list archives

Site index · List index
Message view « Date » · « Thread »
Top « Date » · « Thread »
From Apache Jenkins Server <jenk...@builds.apache.org>
Subject Build failed in Jenkins: JMeter » JMeter-trunk #138
Date Mon, 23 Nov 2020 10:11:30 GMT
See <https://ci-builds.apache.org/job/JMeter/job/JMeter-trunk/138/display/redirect?page=changes>

Changes:

[Bruno Demion] prepare new version 5.4 (change version to 5.4)


------------------------------------------
[...truncated 293.82 KB...]
        at org.apache.jmeter.protocol.http.control.TestCacheManagerBase.testCacheHttpClientBug51932(TestCacheManagerBase.java:348)
        at org.junit.platform.commons.util.ReflectionUtils.invokeMethod(ReflectionUtils.java:688)
        at org.junit.jupiter.engine.execution.MethodInvocation.proceed(MethodInvocation.java:60)
        at org.junit.jupiter.engine.execution.InvocationInterceptorChain$ValidatingInvocation.proceed(InvocationInterceptorChain.java:131)
        at org.junit.jupiter.engine.extension.TimeoutInvocation.proceed(TimeoutInvocation.java:46)
        at org.junit.jupiter.engine.extension.TimeoutExtension.intercept(TimeoutExtension.java:149)
        at org.junit.jupiter.engine.extension.TimeoutExtension.interceptTestableMethod(TimeoutExtension.java:140)
        at org.junit.jupiter.engine.extension.TimeoutExtension.interceptTestMethod(TimeoutExtension.java:84)
        at org.junit.jupiter.engine.execution.ExecutableInvoker$ReflectiveInterceptorCall.lambda$ofVoidMethod$0(ExecutableInvoker.java:115)
        at org.junit.jupiter.engine.execution.ExecutableInvoker.lambda$invoke$0(ExecutableInvoker.java:105)
        at org.junit.jupiter.engine.execution.InvocationInterceptorChain$InterceptedInvocation.proceed(InvocationInterceptorChain.java:106)
        at org.junit.jupiter.engine.execution.InvocationInterceptorChain.proceed(InvocationInterceptorChain.java:64)
        at org.junit.jupiter.engine.execution.InvocationInterceptorChain.chainAndInvoke(InvocationInterceptorChain.java:45)
        at org.junit.jupiter.engine.execution.InvocationInterceptorChain.invoke(InvocationInterceptorChain.java:37)
        at org.junit.jupiter.engine.execution.ExecutableInvoker.invoke(ExecutableInvoker.java:104)
        at org.junit.jupiter.engine.execution.ExecutableInvoker.invoke(ExecutableInvoker.java:98)
        at org.junit.jupiter.engine.descriptor.TestMethodTestDescriptor.lambda$invokeTestMethod$6(TestMethodTestDescriptor.java:210)
        at org.junit.platform.engine.support.hierarchical.ThrowableCollector.execute(ThrowableCollector.java:73)
        at org.junit.jupiter.engine.descriptor.TestMethodTestDescriptor.invokeTestMethod(TestMethodTestDescriptor.java:206)
        at org.junit.jupiter.engine.descriptor.TestMethodTestDescriptor.execute(TestMethodTestDescriptor.java:131)
        at org.junit.jupiter.engine.descriptor.TestMethodTestDescriptor.execute(TestMethodTestDescriptor.java:65)
        at org.junit.platform.engine.support.hierarchical.NodeTestTask.lambda$executeRecursively$5(NodeTestTask.java:139)
        at org.junit.platform.engine.support.hierarchical.ThrowableCollector.execute(ThrowableCollector.java:73)
        at org.junit.platform.engine.support.hierarchical.NodeTestTask.lambda$executeRecursively$7(NodeTestTask.java:129)
        at org.junit.platform.engine.support.hierarchical.Node.around(Node.java:137)
        at org.junit.platform.engine.support.hierarchical.NodeTestTask.lambda$executeRecursively$8(NodeTestTask.java:127)
        at org.junit.platform.engine.support.hierarchical.ThrowableCollector.execute(ThrowableCollector.java:73)
        at org.junit.platform.engine.support.hierarchical.NodeTestTask.executeRecursively(NodeTestTask.java:126)
        at org.junit.platform.engine.support.hierarchical.NodeTestTask.execute(NodeTestTask.java:84)

          1.8sec,   21 completed,   0 failed,   0 skipped, org.apache.jmeter.gui.action.ParseCurlCommandActionTest
          2.3sec, org.apache.jmeter.protocol.http.control.TestCacheManagerUrlConnection
> testExpires()
          2.3sec, org.apache.jmeter.protocol.http.control.TestCacheManagerUrlConnection
> testExpiresBug59962()
          2.3sec, org.apache.jmeter.protocol.http.control.TestCacheManagerUrlConnection
> testPrivateCache()
          3.0sec, org.apache.jmeter.protocol.http.proxy.TestHttpRequestHdr
> testPostMultipartFileUpload()
          3.4sec, org.apache.jmeter.protocol.http.sampler.TestHTTPHC4Impl
> testNotifyFirstSampleAfterLoopRestartWhenThreadIterationIsSameUser()
          3.4sec, org.apache.jmeter.protocol.http.sampler.TestHTTPHC4Impl
> testNotifyFirstSampleAfterLoopRestartWhenThreadIterationIsANewUser()
          3.4sec,    2 completed,   0 failed,   0 skipped, org.apache.jmeter.protocol.http.sampler.TestHTTPHC4Impl
          2.8sec, org.apache.jmeter.protocol.http.control.TestCacheManagerHC4
> testExpiresBug59962()
          3.0sec, org.apache.jmeter.protocol.http.control.TestCacheManagerHC4
> testExpires()
          3.3sec, org.apache.jmeter.protocol.http.proxy.TestHttpRequestHdr
> testGetRequestEncodingsIPv6()
          3.3sec, org.apache.jmeter.protocol.http.proxy.TestHttpRequestHdr
> testGetRequestEncodings()
          2.9sec, org.apache.jmeter.protocol.http.control.TestCacheManagerUrlConnection
> testPrivateCacheExpireNoMaxAge()
          3.4sec, org.apache.jmeter.protocol.http.proxy.TestHttpRequestHdr
> testPostRequestEncodings()
          1.7sec,   18 completed,   0 failed,   0 skipped, org.apache.jmeter.protocol.http.modifier.TestAnchorModifier
          3.4sec, org.apache.jmeter.protocol.http.proxy.TestHttpRequestHdr
> testEncodedArguments()
          3.5sec, org.apache.jmeter.protocol.http.proxy.TestHttpRequestHdr
> testPostMultipartFormData()
          3.5sec, org.apache.jmeter.protocol.http.proxy.TestHttpRequestHdr
> testEncodedArgumentsIPv6()
          0.0sec,   17 completed,   0 failed,   0 skipped, org.apache.jmeter.protocol.http.modifier.TestURLRewritingModifier
          0.0sec,    7 completed,   0 failed,   0 skipped, org.apache.jmeter.protocol.http.visualizers.RequestViewHTTPTest
          3.5sec, org.apache.jmeter.protocol.http.proxy.TestHttpRequestHdr
> testRepeatedArguments()
          3.6sec,   10 completed,   0 failed,   0 skipped, org.apache.jmeter.protocol.http.proxy.TestHttpRequestHdr
          0.3sec,    7 completed,   0 failed,   0 skipped, org.apache.jmeter.protocol.http.proxy.TestProxyControl
          0.2sec,    1 completed,   0 failed,   0 skipped, org.apache.jmeter.protocol.http.sampler.PackageTest
          0.0sec,    2 completed,   0 failed,   0 skipped, org.apache.jmeter.protocol.http.sampler.PutWriterTest
          0.0sec,    2 completed,   0 failed,   0 skipped, org.apache.jmeter.protocol.http.sampler.TestHttpWebdav
          2.9sec, org.apache.jmeter.protocol.http.control.TestCacheManagerHC4
> testPrivateCacheExpireNoMaxAge()

> Task :src:dist-check:batchBug56243
Creating summariser <summary>
Created the tree successfully using <https://ci-builds.apache.org/job/JMeter/job/JMeter-trunk/ws/bin/testfiles/Bug56243.jmx>
Starting standalone test @ Mon Nov 23 10:10:34 UTC 2020 (1606126234263)
Waiting for possible Shutdown/StopTestNow/HeapDump/ThreadDump message on port 4445
summary +      1 in 00:00:00 =    4.5/s Avg:    10 Min:    10 Max:    10 Err:     0 (0.00%)
Active: 1 Started: 1 Finished: 0
summary +      8 in 00:00:00 =  160.0/s Avg:     0 Min:     0 Max:     1 Err:     0 (0.00%)
Active: 0 Started: 1 Finished: 1
summary =      9 in 00:00:00 =   32.7/s Avg:     1 Min:     0 Max:    10 Err:     0 (0.00%)
Tidying up ...    @ Mon Nov 23 10:10:35 UTC 2020 (1606126235449)
... end of run
No errors present in the logfile <https://ci-builds.apache.org/job/JMeter/job/JMeter-trunk/ws/bin/Bug56243.log>
(the file is empty)

> Task :src:protocol:http:test
          4.7sec, org.apache.jmeter.protocol.http.control.TestCacheManagerUrlConnection
> testPrivateCacheNoMaxAgeNoExpire()
          5.1sec, org.apache.jmeter.protocol.http.control.TestCacheManagerUrlConnection
> testNoCacheControlNoMaxAgeNoExpire()
FAILURE   5.5sec,   25 completed,   2 failed,   0 skipped, org.apache.jmeter.protocol.http.control.TestCacheManagerUrlConnection
          5.1sec, org.apache.jmeter.protocol.http.control.TestCacheManagerHC4
> testNoCacheControlNoMaxAgeNoExpire()
          5.0sec, org.apache.jmeter.protocol.http.control.TestCacheManagerHC4
> testPrivateCacheNoMaxAgeNoExpire()
FAILURE   7.5sec,   26 completed,   1 failed,   0 skipped, org.apache.jmeter.protocol.http.control.TestCacheManagerHC4

> Task :src:protocol:http:spotbugsTest
20 SpotBugs violations were found. See the report at: file://<https://ci-builds.apache.org/job/JMeter/job/JMeter-trunk/ws/src/protocol/http/build/reports/spotbugs/test.xml>

org.gradle.api.GradleException: 20 SpotBugs violations were found. See the report at: file://<https://ci-builds.apache.org/job/JMeter/job/JMeter-trunk/ws/src/protocol/http/build/reports/spotbugs/test.xml>
	at com.github.spotbugs.snom.internal.SpotBugsRunnerForWorker$SpotBugsExecutor.execute(SpotBugsRunnerForWorker.java:115)
	at org.gradle.workers.internal.DefaultWorkerServer.execute(DefaultWorkerServer.java:63)
	at org.gradle.workers.internal.AbstractClassLoaderWorker$1.create(AbstractClassLoaderWorker.java:49)
	at org.gradle.workers.internal.AbstractClassLoaderWorker$1.create(AbstractClassLoaderWorker.java:43)
	at org.gradle.internal.classloader.ClassLoaderUtils.executeInClassloader(ClassLoaderUtils.java:97)
	at org.gradle.workers.internal.AbstractClassLoaderWorker.executeInClassLoader(AbstractClassLoaderWorker.java:43)
	at org.gradle.workers.internal.IsolatedClassloaderWorker.run(IsolatedClassloaderWorker.java:49)
	at org.gradle.workers.internal.IsolatedClassloaderWorker.run(IsolatedClassloaderWorker.java:30)
	at org.gradle.workers.internal.WorkerDaemonServer.run(WorkerDaemonServer.java:85)
	at org.gradle.workers.internal.WorkerDaemonServer.run(WorkerDaemonServer.java:55)
	at org.gradle.process.internal.worker.request.WorkerAction$1.call(WorkerAction.java:138)
	at org.gradle.process.internal.worker.child.WorkerLogEventListener.withWorkerLoggingProtocol(WorkerLogEventListener.java:41)
	at org.gradle.process.internal.worker.request.WorkerAction.run(WorkerAction.java:135)
	at sun.reflect.NativeMethodAccessorImpl.invoke0(Native Method)
	at sun.reflect.NativeMethodAccessorImpl.invoke(NativeMethodAccessorImpl.java:62)
	at sun.reflect.DelegatingMethodAccessorImpl.invoke(DelegatingMethodAccessorImpl.java:43)
	at java.lang.reflect.Method.invoke(Method.java:498)
	at org.gradle.internal.dispatch.ReflectionDispatch.dispatch(ReflectionDispatch.java:36)
	at org.gradle.internal.dispatch.ReflectionDispatch.dispatch(ReflectionDispatch.java:24)
	at org.gradle.internal.remote.internal.hub.MessageHubBackedObjectConnection$DispatchWrapper.dispatch(MessageHubBackedObjectConnection.java:182)
	at org.gradle.internal.remote.internal.hub.MessageHubBackedObjectConnection$DispatchWrapper.dispatch(MessageHubBackedObjectConnection.java:164)
	at org.gradle.internal.remote.internal.hub.MessageHub$Handler.run(MessageHub.java:414)
	at org.gradle.internal.concurrent.ExecutorPolicy$CatchAndRecordFailures.onExecute(ExecutorPolicy.java:64)
	at org.gradle.internal.concurrent.ManagedExecutorImpl$1.run(ManagedExecutorImpl.java:48)
	at java.util.concurrent.ThreadPoolExecutor.runWorker(ThreadPoolExecutor.java:1149)
	at java.util.concurrent.ThreadPoolExecutor$Worker.run(ThreadPoolExecutor.java:624)
	at org.gradle.internal.concurrent.ThreadFactoryImpl$ManagedThreadRunnable.run(ThreadFactoryImpl.java:56)
	at java.lang.Thread.run(Thread.java:748)

> Task :src:dist-check:spotbugsTest
12 SpotBugs violations were found. See the report at: file://<https://ci-builds.apache.org/job/JMeter/job/JMeter-trunk/ws/src/dist-check/build/reports/spotbugs/test.xml>

org.gradle.api.GradleException: 12 SpotBugs violations were found. See the report at: file://<https://ci-builds.apache.org/job/JMeter/job/JMeter-trunk/ws/src/dist-check/build/reports/spotbugs/test.xml>
	at com.github.spotbugs.snom.internal.SpotBugsRunnerForWorker$SpotBugsExecutor.execute(SpotBugsRunnerForWorker.java:115)
	at org.gradle.workers.internal.DefaultWorkerServer.execute(DefaultWorkerServer.java:63)
	at org.gradle.workers.internal.AbstractClassLoaderWorker$1.create(AbstractClassLoaderWorker.java:49)
	at org.gradle.workers.internal.AbstractClassLoaderWorker$1.create(AbstractClassLoaderWorker.java:43)
	at org.gradle.internal.classloader.ClassLoaderUtils.executeInClassloader(ClassLoaderUtils.java:97)
	at org.gradle.workers.internal.AbstractClassLoaderWorker.executeInClassLoader(AbstractClassLoaderWorker.java:43)
	at org.gradle.workers.internal.IsolatedClassloaderWorker.run(IsolatedClassloaderWorker.java:49)
	at org.gradle.workers.internal.IsolatedClassloaderWorker.run(IsolatedClassloaderWorker.java:30)
	at org.gradle.workers.internal.WorkerDaemonServer.run(WorkerDaemonServer.java:85)
	at org.gradle.workers.internal.WorkerDaemonServer.run(WorkerDaemonServer.java:55)
	at org.gradle.process.internal.worker.request.WorkerAction$1.call(WorkerAction.java:138)
	at org.gradle.process.internal.worker.child.WorkerLogEventListener.withWorkerLoggingProtocol(WorkerLogEventListener.java:41)
	at org.gradle.process.internal.worker.request.WorkerAction.run(WorkerAction.java:135)
	at sun.reflect.NativeMethodAccessorImpl.invoke0(Native Method)
	at sun.reflect.NativeMethodAccessorImpl.invoke(NativeMethodAccessorImpl.java:62)
	at sun.reflect.DelegatingMethodAccessorImpl.invoke(DelegatingMethodAccessorImpl.java:43)
	at java.lang.reflect.Method.invoke(Method.java:498)
	at org.gradle.internal.dispatch.ReflectionDispatch.dispatch(ReflectionDispatch.java:36)
	at org.gradle.internal.dispatch.ReflectionDispatch.dispatch(ReflectionDispatch.java:24)
	at org.gradle.internal.remote.internal.hub.MessageHubBackedObjectConnection$DispatchWrapper.dispatch(MessageHubBackedObjectConnection.java:182)
	at org.gradle.internal.remote.internal.hub.MessageHubBackedObjectConnection$DispatchWrapper.dispatch(MessageHubBackedObjectConnection.java:164)
	at org.gradle.internal.remote.internal.hub.MessageHub$Handler.run(MessageHub.java:414)
	at org.gradle.internal.concurrent.ExecutorPolicy$CatchAndRecordFailures.onExecute(ExecutorPolicy.java:64)
	at org.gradle.internal.concurrent.ManagedExecutorImpl$1.run(ManagedExecutorImpl.java:48)
	at java.util.concurrent.ThreadPoolExecutor.runWorker(ThreadPoolExecutor.java:1149)
	at java.util.concurrent.ThreadPoolExecutor$Worker.run(ThreadPoolExecutor.java:624)
	at org.gradle.internal.concurrent.ThreadFactoryImpl$ManagedThreadRunnable.run(ThreadFactoryImpl.java:56)
	at java.lang.Thread.run(Thread.java:748)

> Task :src:dist-check:batchBug56811
Creating summariser <summary>
Created the tree successfully using <https://ci-builds.apache.org/job/JMeter/job/JMeter-trunk/ws/bin/testfiles/Bug56811.jmx>
Starting standalone test @ Mon Nov 23 10:10:39 UTC 2020 (1606126239096)
Waiting for possible Shutdown/StopTestNow/HeapDump/ThreadDump message on port 4445
summary =      9 in 00:00:00 =   19.5/s Avg:     4 Min:     0 Max:     7 Err:     3 (33.33%)
Tidying up ...    @ Mon Nov 23 10:10:40 UTC 2020 (1606126240109)
... end of run
No errors present in the logfile <https://ci-builds.apache.org/job/JMeter/job/JMeter-trunk/ws/bin/Bug56811.log>
(the file is empty)

> Task :src:protocol:http:test
          3.6sec,   16 completed,   0 failed,   0 skipped, org.apache.jmeter.protocol.http.sampler.ParallelResourcesAndIpSource
          0.3sec,    8 completed,   0 failed,   0 skipped, org.apache.jmeter.protocol.http.sampler.TestDecompression
          0.0sec,    8 completed,   0 failed,   0 skipped, org.apache.jmeter.protocol.http.sampler.PostWriterTest
          0.0sec,   18 completed,   0 failed,   0 skipped, org.apache.jmeter.protocol.http.sampler.TestHTTPSamplers
          0.4sec,    1 completed,   0 failed,   0 skipped, org.apache.jmeter.protocol.http.sampler.TestSerializedHTTPSampler
          0.0sec,    1 completed,   0 failed,   0 skipped, org.apache.jmeter.protocol.http.control.TestAuthorization
          0.0sec,    1 completed,   0 failed,   0 skipped, org.apache.jmeter.protocol.http.control.gui.TestHttpTestSampleGui
          0.1sec,    4 completed,   0 failed,   0 skipped, org.apache.jmeter.protocol.http.control.TestCookieManagerThreadIteration
          0.0sec,    2 completed,   0 failed,   0 skipped, org.apache.jmeter.protocol.http.control.TestAuthManagerThreadIteration
          0.1sec,    5 completed,   0 failed,   0 skipped, org.apache.jmeter.protocol.http.control.TestCacheManagerThreadIteration
          0.0sec,    6 completed,   0 failed,   0 skipped, org.apache.jmeter.protocol.http.control.TestAuthManager
          0.1sec,   33 completed,   0 failed,   0 skipped, org.apache.jmeter.protocol.http.control.TestHC4CookieManager

> Task :src:dist-check:batchBug62239
Creating summariser <summary>
Created the tree successfully using <https://ci-builds.apache.org/job/JMeter/job/JMeter-trunk/ws/bin/testfiles/Bug62239.jmx>
Starting standalone test @ Mon Nov 23 10:10:42 UTC 2020 (1606126242895)
Waiting for possible Shutdown/StopTestNow/HeapDump/ThreadDump message on port 4445
summary =    108 in 00:00:00 =  251.2/s Avg:     0 Min:     0 Max:     2 Err:     0 (0.00%)
Tidying up ...    @ Mon Nov 23 10:10:43 UTC 2020 (1606126243491)
... end of run
No errors present in the logfile <https://ci-builds.apache.org/job/JMeter/job/JMeter-trunk/ws/bin/Bug62239.log>
(the file is empty)

> Task :src:protocol:http:test
          6.1sec, org.apache.jmeter.protocol.http.control.DnsManagerTest
> badDnsInCustomResolverShouldFailHttpSampler(String, WireMockServer)[1], [1]
HttpClient4
WARNING   6.1sec,    2 completed,   0 failed,   1 skipped, org.apache.jmeter.protocol.http.control.DnsManagerTest
          0.0sec,    6 completed,   0 failed,   0 skipped, org.apache.jmeter.protocol.http.parser.TestHtmlParsingUtils
          0.2sec,    4 completed,   0 failed,   0 skipped, org.apache.jmeter.protocol.http.parser.TestCssParser
          0.0sec,    2 completed,   0 failed,   0 skipped, org.apache.jmeter.protocol.http.parser.TestBaseParser
          0.0sec,    2 completed,   0 failed,   0 skipped, org.apache.jmeter.protocol.http.config.UrlConfigTest
          0.0sec,    3 completed,   0 failed,   0 skipped, org.apache.jmeter.protocol.http.config.MultipartUrlConfigTest
          0.0sec,    6 completed,   0 failed,   0 skipped, org.apache.jmeter.protocol.http.util.accesslog.TestLogFilter
          0.0sec,    4 completed,   0 failed,   0 skipped, org.apache.jmeter.protocol.http.util.accesslog.TestTCLogParser
          0.0sec,    3 completed,   0 failed,   0 skipped, org.apache.jmeter.protocol.http.util.accesslog.TestSessionFilter
          0.0sec,    5 completed,   0 failed,   0 skipped, org.apache.jmeter.protocol.http.util.TestHTTPFileArgs
          0.1sec,   20 completed,   0 failed,   0 skipped, org.apache.jmeter.protocol.http.util.TestGraphQLRequestParamUtils
          0.0sec,    3 completed,   0 failed,   0 skipped, org.apache.jmeter.protocol.http.util.TestHTTPArgument
          0.0sec,    3 completed,   0 failed,   0 skipped, org.apache.jmeter.protocol.http.util.TestHTTPFileArg
          0.2sec,    1 completed,   0 failed,   0 skipped, org.apache.jmeter.resources.ResourceKeyUsageTestHttp
          0.0sec,    2 completed,   0 failed,   0 skipped, org.apache.jmeter.testelement.TestHeaderManager
          0.1sec,   57 completed,   0 failed,   0 skipped, org.apache.jmeter.curl.BasicCurlParserTest
          0.0sec,    7 completed,   0 failed,   0 skipped, org.apache.jmeter.protocol.http.visualizers.RequestViewHTTPTest
          0.3sec,   53 completed,   0 failed,   0 skipped, org.apache.jmeter.protocol.http.sampler.TestHTTPSamplersAgainstHttpMirrorServer
WARNING   0.0sec,    2 completed,   0 failed,   2 skipped, org.apache.jmeter.protocol.http.sampler.SamplingNamingTest
          0.9sec,    9 completed,   0 failed,   0 skipped, org.apache.jmeter.protocol.http.control.TestHTTPMirrorThread
          0.4sec,  103 completed,   0 failed,   0 skipped, org.apache.jmeter.protocol.http.parser.TestHTMLParser
          0.0sec,   46 completed,   0 failed,   0 skipped, org.apache.jmeter.protocol.http.parser.TestBug60842HtmlParser
          0.3sec,   58 completed,   0 failed,   0 skipped, org.apache.jmeter.protocol.http.util.HTTPUtilsSpec
FAILURE  24.8sec,  642 completed,   3 failed,   3 skipped,
Gradle Test Run :src:protocol:http:test

642 tests completed, 3 failed, 3 skipped

> Task :src:protocol:http:test FAILED

> Task :src:dist-check:batchFTP_TESTS
Creating summariser <summary>
Created the tree successfully using <https://ci-builds.apache.org/job/JMeter/job/JMeter-trunk/ws/bin/testfiles/FTP_TESTS.jmx>
Starting standalone test @ Mon Nov 23 10:10:45 UTC 2020 (1606126245843)
Waiting for possible Shutdown/StopTestNow/HeapDump/ThreadDump message on port 4445
summary =      6 in 00:00:03 =    1.9/s Avg:   320 Min:     8 Max:  1656 Err:     0 (0.00%)
Tidying up ...    @ Mon Nov 23 10:10:49 UTC 2020 (1606126249849)
... end of run
No errors present in the logfile <https://ci-builds.apache.org/job/JMeter/job/JMeter-trunk/ws/bin/FTP_TESTS.log>
(the file is empty)

> Task :src:dist:javadocAggregate
9 warnings
checksum-dependency elapsed time: 12105ms, configurations processed: 390 (add -PchecksumTimingsPrint
to print detailed timings)

FAILURE: Build failed with an exception.

* What went wrong:
Execution failed for task ':src:protocol:http:test'.
> There were failing tests. See the report at: file://<https://ci-builds.apache.org/job/JMeter/job/JMeter-trunk/ws/src/protocol/http/build/reports/tests/test/index.html>

* Try:
Run with --stacktrace option to get the stack trace. Run with --info or --debug option to
get more log output. Run with --scan to get full insights.

* Get more help at https://help.gradle.org

Deprecated Gradle features were used in this build, making it incompatible with Gradle 7.0.
Use '--warning-mode all' to show the individual deprecation warnings.
See https://docs.gradle.org/6.7/userguide/command_line_interface.html#sec:command_line_warnings

BUILD FAILED in 3m 41s
335 actionable tasks: 221 executed, 114 up-to-date

See the profiling report at: file://<https://ci-builds.apache.org/job/JMeter/job/JMeter-trunk/ws/build/reports/profile/profile-2020-11-23-10-07-38.html>
A fine-grained performance profile is available: use the --scan option.
Build step 'Invoke Gradle script' changed build result to FAILURE
Build step 'Invoke Gradle script' marked build as failure
Xvfb stopping
Archiving artifacts
[Fast Archiver] Compressed 33.74 MB of artifacts by 14.2% relative to #137
Recording test results

Mime
View raw message