jmeter-dev mailing list archives

Site index · List index
Message view « Date » · « Thread »
Top « Date » · « Thread »
From Apache Jenkins Server <jenk...@builds.apache.org>
Subject Build failed in Jenkins: JMeter » JMeter Ubuntu #88
Date Mon, 23 Nov 2020 08:54:34 GMT
See <https://ci-builds.apache.org/job/JMeter/job/JMeter%20Ubuntu/88/display/redirect?page=changes>

Changes:

[Bruno Demion] prepare new version 5.4


------------------------------------------
[...truncated 169.06 KB...]
          0.0sec,   27 completed,   0 failed,   0 skipped, org.apache.jmeter.assertions.jmespath.TestJMESPathAssertion
WARNING   0.1sec,    5 completed,   0 failed,   1 skipped, org.apache.jmeter.control.RunTimeSpec
          0.1sec,    4 completed,   0 failed,   0 skipped, org.apache.jmeter.control.RandomOrderControllerSpec
          0.1sec,    8 completed,   0 failed,   0 skipped, org.apache.jmeter.control.ThroughputControllerSpec
          0.2sec,    3 completed,   0 failed,   0 skipped, org.apache.jmeter.visualizers.backend.influxdb.InfluxdbBackendListenerClientSpec
          0.1sec,    6 completed,   0 failed,   0 skipped, org.apache.jmeter.visualizers.backend.influxdb.InfluxDBRawBackendListenerClientSpec
          0.2sec,    7 completed,   0 failed,   0 skipped, org.apache.jmeter.visualizers.backend.graphite.PickleGraphiteMetricsSenderSpec
          0.0sec,    5 completed,   0 failed,   0 skipped, org.apache.jmeter.visualizers.backend.graphite.TextGraphiteMetricsSenderSpec
          0.1sec,   43 completed,   0 failed,   0 skipped, org.apache.jmeter.extractor.BoundaryExtractorSpec
          0.0sec,    4 completed,   0 failed,   0 skipped, org.apache.jmeter.extractor.JoddExtractorSpec
WARNING   0.7sec,    9 completed,   0 failed,   1 skipped, org.apache.jmeter.extractor.json.render.RenderAsJsonRendererSpec
WARNING   0.1sec,    9 completed,   0 failed,   1 skipped, org.apache.jmeter.extractor.json.render.RenderAsJmesPathRendererSpec
          0.2sec,    5 completed,   0 failed,   0 skipped, org.apache.jmeter.assertions.gui.AssertionGuiSpec
          0.1sec,    7 completed,   0 failed,   0 skipped, org.apache.jmeter.assertions.CompareAssertionSpec
          0.0sec,    7 completed,   0 failed,   0 skipped, org.apache.jmeter.assertions.MD5HexAssertionSpec
          0.0sec,    6 completed,   0 failed,   0 skipped, org.apache.jmeter.timers.UniformRandomTimerSpec
WARNING  17.4sec,  505 completed,   0 failed,   4 skipped, Gradle
Test Run :src:components:test

> Task :src:components:check

> Task :src:core:test
          0.5sec,    4 completed,   0 failed,   0 skipped, org.apache.jmeter.report.processor.Top5ErrorsBySamplerConsumerSpec
          0.0sec,    4 completed,   0 failed,   0 skipped, org.apache.jmeter.report.processor.ListResultDataSpec
          0.1sec,    2 completed,   0 failed,   0 skipped, org.apache.jmeter.report.processor.graph.impl.ResponseTimePercentilesOverTimeGraphConsumerSpec
          0.0sec,    3 completed,   0 failed,   0 skipped, org.apache.jmeter.report.processor.FieldSampleComparatorSpec
          0.0sec,    5 completed,   0 failed,   0 skipped, org.apache.jmeter.report.processor.Top5ErrorsSummaryDataSpec
          0.0sec,    1 completed,   0 failed,   0 skipped, org.apache.jmeter.report.processor.ApdexSummaryConsumerSpec
WARNING   0.0sec,    1 completed,   0 failed,   1 skipped, org.apache.jmeter.gui.HtmlReportGUISpec
          0.0sec,    4 completed,   0 failed,   0 skipped, org.apache.jmeter.engine.util.FunctionParserSpec
          0.1sec,   23 completed,   0 failed,   0 skipped, org.apache.jmeter.services.FileServerSpec
          0.0sec,    3 completed,   0 failed,   0 skipped, org.apache.jmeter.util.keystore.JmeterKeyStoreSpec
WARNING  20.1sec,  279 completed,   0 failed,   1 skipped, Gradle
Test Run :src:core:test

> Task :src:core:check
> Task :src:components:jar
> Task :src:examples:test NO-SOURCE
> Task :src:generator:test NO-SOURCE
> Task :src:examples:check
> Task :src:generator:check
> Task :src:components:testJar
> Task :src:functions:compileJava
> Task :src:functions:compileGroovy NO-SOURCE
> Task :src:functions:classes
> Task :src:functions:jar
> Task :src:functions:compileTestJava

> Task :src:protocol:http:compileJava
Note: <https://ci-builds.apache.org/job/JMeter/job/JMeter%20Ubuntu/ws/src/protocol/http/src/main/java/org/apache/jmeter/protocol/http/sampler/HTTPHC4Impl.java>
uses unchecked or unsafe operations.
Note: Recompile with -Xlint:unchecked for details.

> Task :src:protocol:http:compileGroovy NO-SOURCE
> Task :src:protocol:http:classes
> Task :src:dist:compileJava NO-SOURCE
> Task :src:dist:classes UP-TO-DATE
> Task :src:dist:spotbugsMain SKIPPED
> Task :src:dist:compileTestJava NO-SOURCE
> Task :src:dist:testClasses UP-TO-DATE
> Task :src:dist:spotbugsTest SKIPPED
> Task :src:dist:jar UP-TO-DATE
> Task :src:functions:compileTestGroovy
> Task :src:functions:testClasses
> Task :src:functions:testJar UP-TO-DATE
> Task :src:functions:spotbugsMain SKIPPED
> Task :src:functions:spotbugsTest SKIPPED
> Task :src:protocol:http:jar
> Task :src:dist:test NO-SOURCE
> Task :src:dist-check:compileJava NO-SOURCE
> Task :src:dist-check:compileGroovy NO-SOURCE
> Task :src:dist-check:classes UP-TO-DATE
> Task :src:dist-check:spotbugsMain SKIPPED
> Task :src:dist:verifyReleaseDependencies FAILED
> Task :src:protocol:http:compileTestJava

> Task :src:functions:test

Gradle Test Executor 17 STANDARD_OUT
    Setting JMeterHome: <https://ci-builds.apache.org/job/JMeter/job/JMeter%20Ubuntu/ws/src/functions/../../.>
    Initializing Properties: ../.././bin/jmeter.properties
    JMeterVersion=5.3.1-SNAPSHOT a5a8f27
    java.version=1.8.0_252
    java.vm.name=OpenJDK 64-Bit Server VM
    java.vendor=Oracle Corporation
    java.home=/usr/local/asfpackages/java/openjdk-8u252-b09/jre
    file.encoding=ISO-8859-1
    default encoding=ISO-8859-1
    user.home=/home/jenkins
    user.dir=<https://ci-builds.apache.org/job/JMeter/job/JMeter%20Ubuntu/ws/src/functions>
    user.language=en
    user.region=null
    user.country=US
    user.variant=
    Locale=en_US
    java.class.version=52.0
    java.awt.headless=true
    os.name=Linux
    os.version=4.15.0-74-generic
    os.arch=amd64
          0.1sec,    1 completed,   0 failed,   0 skipped, org.apache.jmeter.resources.ResourceKeyUsageTestFunctions
          0.4sec,    2 completed,   0 failed,   0 skipped, org.apache.jmeter.functions.EvalFunctionTest
          0.0sec,    5 completed,   0 failed,   0 skipped, org.apache.jmeter.functions.TestMachineIPName
          0.1sec,    6 completed,   0 failed,   0 skipped, org.apache.jmeter.functions.CSVReadFunctionTest
          0.0sec,   22 completed,   0 failed,   0 skipped, org.apache.jmeter.functions.TestRegexFunction
          0.0sec,    1 completed,   0 failed,   0 skipped, org.apache.jmeter.functions.SumFunctionTest
          0.0sec,    6 completed,   0 failed,   0 skipped, org.apache.jmeter.functions.TestEscapeOroRegexpChars
          0.2sec,    5 completed,   0 failed,   0 skipped, org.apache.jmeter.functions.TestJavascriptFunctionWithRhino
          0.0sec,    2 completed,   0 failed,   0 skipped, org.apache.jmeter.functions.RandomFunctionTest
WARNING   0.6sec,    6 completed,   0 failed,   5 skipped, org.apache.jmeter.functions.XPathConcurrencyTest
          0.0sec,    1 completed,   0 failed,   0 skipped, org.apache.jmeter.functions.VariableTest
          0.0sec,    2 completed,   0 failed,   0 skipped, org.apache.jmeter.functions.TestSamplerNameFunction
          0.1sec,    7 completed,   0 failed,   0 skipped, org.apache.jmeter.functions.TestFileRowColContainer
          0.0sec,    5 completed,   0 failed,   0 skipped, org.apache.jmeter.functions.TestFileToString
          0.0sec,    5 completed,   0 failed,   0 skipped, org.apache.jmeter.functions.TestIsPropDefined
          0.0sec,    5 completed,   0 failed,   0 skipped, org.apache.jmeter.functions.StringFromFileFunctionTest
          0.0sec,   18 completed,   0 failed,   0 skipped, org.apache.jmeter.functions.TestSimpleFunctions
          0.0sec,    4 completed,   0 failed,   0 skipped, org.apache.jmeter.functions.TestRandomFromMultipleVars
          0.0sec,    1 completed,   0 failed,   0 skipped, org.apache.jmeter.functions.SplitFunctionTest
          0.0sec,    6 completed,   0 failed,   0 skipped, org.apache.jmeter.functions.TestIsVarDefined
          0.0sec,    9 completed,   0 failed,   0 skipped, org.apache.jmeter.functions.TestDigestFunction
          0.1sec,    6 completed,   0 failed,   0 skipped, org.apache.jmeter.functions.TestJexl2Function
          1.0sec,    7 completed,   0 failed,   0 skipped, org.apache.jmeter.functions.TestGroovyFunction
          0.0sec,   15 completed,   0 failed,   0 skipped, org.apache.jmeter.functions.TestTimeFunction
          0.0sec,    3 completed,   0 failed,   0 skipped, org.apache.jmeter.functions.TestSetProperty
          0.2sec,   12 completed,   0 failed,   0 skipped, org.apache.jmeter.functions.TestTimeShiftFunction
          0.0sec,   15 completed,   0 failed,   0 skipped, org.apache.jmeter.functions.TestStringtoFile
          0.0sec,    3 completed,   0 failed,   0 skipped, org.apache.jmeter.functions.TestUrlEncodeDecode
          0.0sec,    8 completed,   0 failed,   0 skipped, org.apache.jmeter.functions.TestChangeCase
          0.0sec,    8 completed,   0 failed,   0 skipped, org.apache.jmeter.functions.TestDateTimeConvertFunction
          0.3sec,    5 completed,   0 failed,   0 skipped, org.apache.jmeter.functions.TestJavascriptFunction
          0.0sec,   14 completed,   0 failed,   0 skipped, org.apache.jmeter.functions.TestTimeRandomDateFunction
          0.1sec,    6 completed,   0 failed,   0 skipped, org.apache.jmeter.functions.TestJexl3Function
          0.2sec,   10 completed,   0 failed,   0 skipped, org.apache.jmeter.functions.PackageTest
          0.1sec,   22 completed,   0 failed,   0 skipped, org.apache.jmeter.functions.ChangeCaseSpec
WARNING   0.0sec,    0 completed,   0 failed,   0 skipped, org.apache.jmeter.functions.gui.FunctionHelperSpec
          0.2sec,    2 completed,   0 failed,   0 skipped, org.apache.jmeter.functions.IterationCounterSpec
WARNING   7.1sec,  255 completed,   0 failed,   5 skipped, Gradle
Test Run :src:functions:test
checksum-dependency elapsed time: 105124ms, configurations processed: 258
    SHA-512 computation time: 2655ms (goes in parallel, it might exceed wall-clock time),
files processed: 31, processed: 9MiB, skipped: 2937MiB
    PGP signature resolution time: 2263ms (wall-clock), resolution requests: 153, signatures
resolved: 248
    PGP key resolution time: 71662ms (wall-clock), resolution requests: 153, download time:
1703ms (goes in parallel, it might exceed wall-clock time), keys downloaded: 1
        PGP signature verification time: 145403ms (goes in parallel, it might exceed wall-clock
time), files processed: 750, processed: 769MiB, skipped: 2153MiB

Build jmeter FAILURE reason:                                
    Execution failed for task ':src:dist:verifyReleaseDependencies':
        External dependencies differ (you could update src/dist/src/dist/expected_release_jars.csv
if you add -PupdateExpectedJars):
          55496539 => 55628122 bytes (+131583 bytes)
        
        -  208475 commons-dbcp2-2.7.0.jar
        +  207774 commons-dbcp2-2.8.0.jar
        -  133109 commons-pool2-2.8.1.jar
        +  134858 commons-pool2-2.9.0.jar
        - 4474164 neo4j-java-driver-4.0.1.jar
        + 4580832 neo4j-java-driver-4.2.0.jar
        - 1298390 rhino-1.7.12.jar
        + 1315838 rhino-1.7.13.jar
        -  621071 xstream-1.4.11.1.jar
        +  627490 xstream-1.4.14.jar
            at Build_gradle$verifyReleaseDependencies$2$1.execute(build.gradle.kts:228)
            at Build_gradle$verifyReleaseDependencies$2$1.execute(build.gradle.kts:24)
            at org.gradle.api.internal.AbstractTask$TaskActionWrapper.execute(AbstractTask.java:731)
            at org.gradle.api.internal.AbstractTask$TaskActionWrapper.execute(AbstractTask.java:704)
            at org.gradle.api.internal.tasks.execution.ExecuteActionsTaskExecuter$3.run(ExecuteActionsTaskExecuter.java:555)
            at org.gradle.internal.operations.DefaultBuildOperationRunner$1.execute(DefaultBuildOperationRunner.java:29)
            at org.gradle.internal.operations.DefaultBuildOperationRunner$1.execute(DefaultBuildOperationRunner.java:26)
            at org.gradle.internal.operations.DefaultBuildOperationRunner$3.execute(DefaultBuildOperationRunner.java:75)
            at org.gradle.internal.operations.DefaultBuildOperationRunner$3.execute(DefaultBuildOperationRunner.java:68)
            at org.gradle.internal.operations.DefaultBuildOperationRunner.execute(DefaultBuildOperationRunner.java:153)
            at org.gradle.internal.operations.DefaultBuildOperationRunner.execute(DefaultBuildOperationRunner.java:68)
            at org.gradle.internal.operations.DefaultBuildOperationRunner.run(DefaultBuildOperationRunner.java:56)
            at org.gradle.internal.operations.DefaultBuildOperationExecutor.lambda$run$1(DefaultBuildOperationExecutor.java:71)
            at org.gradle.internal.operations.UnmanagedBuildOperationWrapper.runWithUnmanagedSupport(UnmanagedBuildOperationWrapper.java:45)
            at org.gradle.internal.operations.DefaultBuildOperationExecutor.run(DefaultBuildOperationExecutor.java:71)
            at org.gradle.api.internal.tasks.execution.ExecuteActionsTaskExecuter.executeAction(ExecuteActionsTaskExecuter.java:540)
            at org.gradle.api.internal.tasks.execution.ExecuteActionsTaskExecuter.executeActions(ExecuteActionsTaskExecuter.java:523)
            at org.gradle.api.internal.tasks.execution.ExecuteActionsTaskExecuter.access$300(ExecuteActionsTaskExecuter.java:108)
            at org.gradle.api.internal.tasks.execution.ExecuteActionsTaskExecuter$TaskExecution.executeWithPreviousOutputFiles(ExecuteActionsTaskExecuter.java:271)
            at org.gradle.api.internal.tasks.execution.ExecuteActionsTaskExecuter$TaskExecution.execute(ExecuteActionsTaskExecuter.java:260)
            at org.gradle.internal.execution.steps.ExecuteStep.lambda$execute$1(ExecuteStep.java:34)
            at org.gradle.internal.execution.steps.ExecuteStep.execute(ExecuteStep.java:34)
            at org.gradle.internal.execution.steps.ExecuteStep.execute(ExecuteStep.java:26)
            at org.gradle.internal.execution.steps.CleanupOutputsStep.execute(CleanupOutputsStep.java:67)
            at org.gradle.internal.execution.steps.CleanupOutputsStep.execute(CleanupOutputsStep.java:36)
            at org.gradle.internal.execution.steps.ResolveInputChangesStep.execute(ResolveInputChangesStep.java:49)
            at org.gradle.internal.execution.steps.ResolveInputChangesStep.execute(ResolveInputChangesStep.java:34)
            at org.gradle.internal.execution.steps.CancelExecutionStep.execute(CancelExecutionStep.java:43)
            at org.gradle.internal.execution.steps.TimeoutStep.executeWithoutTimeout(TimeoutStep.java:73)
            at org.gradle.internal.execution.steps.TimeoutStep.execute(TimeoutStep.java:54)
            at org.gradle.internal.execution.steps.CreateOutputsStep.execute(CreateOutputsStep.java:44)
            at org.gradle.internal.execution.steps.SnapshotOutputsStep.execute(SnapshotOutputsStep.java:54)
            at org.gradle.internal.execution.steps.SnapshotOutputsStep.execute(SnapshotOutputsStep.java:38)
            at org.gradle.internal.execution.steps.BroadcastChangingOutputsStep.execute(BroadcastChangingOutputsStep.java:42)
            at org.gradle.internal.execution.steps.CacheStep.executeWithoutCache(CacheStep.java:159)
            at org.gradle.internal.execution.steps.CacheStep.execute(CacheStep.java:72)
            at org.gradle.internal.execution.steps.CacheStep.execute(CacheStep.java:43)
            at org.gradle.internal.execution.steps.StoreExecutionStateStep.execute(StoreExecutionStateStep.java:44)
            at org.gradle.internal.execution.steps.StoreExecutionStateStep.execute(StoreExecutionStateStep.java:33)
            at org.gradle.internal.execution.steps.RecordOutputsStep.execute(RecordOutputsStep.java:38)
            at org.gradle.internal.execution.steps.RecordOutputsStep.execute(RecordOutputsStep.java:24)
            at org.gradle.internal.execution.steps.SkipUpToDateStep.executeBecause(SkipUpToDateStep.java:92)
            at org.gradle.internal.execution.steps.SkipUpToDateStep.lambda$execute$0(SkipUpToDateStep.java:85)
            at org.gradle.internal.execution.steps.SkipUpToDateStep.execute(SkipUpToDateStep.java:55)
            at org.gradle.internal.execution.steps.SkipUpToDateStep.execute(SkipUpToDateStep.java:39)
            at org.gradle.internal.execution.steps.ResolveChangesStep.execute(ResolveChangesStep.java:76)
            at org.gradle.internal.execution.steps.ResolveChangesStep.execute(ResolveChangesStep.java:37)
            at org.gradle.internal.execution.steps.legacy.MarkSnapshottingInputsFinishedStep.execute(MarkSnapshottingInputsFinishedStep.java:36)
            at org.gradle.internal.execution.steps.legacy.MarkSnapshottingInputsFinishedStep.execute(MarkSnapshottingInputsFinishedStep.java:26)
            at org.gradle.internal.execution.steps.ResolveCachingStateStep.execute(ResolveCachingStateStep.java:94)
            at org.gradle.internal.execution.steps.ResolveCachingStateStep.execute(ResolveCachingStateStep.java:49)
            at org.gradle.internal.execution.steps.CaptureStateBeforeExecutionStep.execute(CaptureStateBeforeExecutionStep.java:79)
            at org.gradle.internal.execution.steps.CaptureStateBeforeExecutionStep.execute(CaptureStateBeforeExecutionStep.java:53)
            at org.gradle.internal.execution.steps.ValidateStep.execute(ValidateStep.java:74)
            at org.gradle.internal.execution.steps.SkipEmptyWorkStep.lambda$execute$2(SkipEmptyWorkStep.java:78)
            at org.gradle.internal.execution.steps.SkipEmptyWorkStep.execute(SkipEmptyWorkStep.java:78)
            at org.gradle.internal.execution.steps.SkipEmptyWorkStep.execute(SkipEmptyWorkStep.java:34)
            at org.gradle.internal.execution.steps.legacy.MarkSnapshottingInputsStartedStep.execute(MarkSnapshottingInputsStartedStep.java:39)
            at org.gradle.internal.execution.steps.LoadExecutionStateStep.execute(LoadExecutionStateStep.java:40)
            at org.gradle.internal.execution.steps.LoadExecutionStateStep.execute(LoadExecutionStateStep.java:28)


FAILURE: Build failed with an exception.

* What went wrong:
Execution failed for task ':src:dist:verifyReleaseDependencies'.
> External dependencies differ (you could update src/dist/src/dist/expected_release_jars.csv
if you add -PupdateExpectedJars):
    55496539 => 55628122 bytes (+131583 bytes)
  
  -  208475 commons-dbcp2-2.7.0.jar
  +  207774 commons-dbcp2-2.8.0.jar
  -  133109 commons-pool2-2.8.1.jar
  +  134858 commons-pool2-2.9.0.jar
  - 4474164 neo4j-java-driver-4.0.1.jar
  + 4580832 neo4j-java-driver-4.2.0.jar
  - 1298390 rhino-1.7.12.jar
  + 1315838 rhino-1.7.13.jar
  -  621071 xstream-1.4.11.1.jar
  +  627490 xstream-1.4.14.jar

* Try:
Run with --stacktrace option to get the stack trace. Run with --info or --debug option to
get more log output. Run with --scan to get full insights.

* Get more help at https://help.gradle.org

Deprecated Gradle features were used in this build, making it incompatible with Gradle 7.0.
Use '--warning-mode all' to show the individual deprecation warnings.
See https://docs.gradle.org/6.7/userguide/command_line_interface.html#sec:command_line_warnings

BUILD FAILED in 3m 16s
225 actionable tasks: 174 executed, 51 up-to-date
Build step 'Invoke Gradle script' changed build result to FAILURE
Build step 'Invoke Gradle script' marked build as failure

Mime
View raw message