jmeter-dev mailing list archives

Site index · List index
Message view « Date » · « Thread »
Top « Date » · « Thread »
From Apache Jenkins Server <jenk...@builds.apache.org>
Subject Build failed in Jenkins: JMeter » JMeter-trunk #41
Date Thu, 20 Aug 2020 16:12:41 GMT
See <https://ci-builds.apache.org/job/JMeter/job/JMeter-trunk/41/display/redirect?page=changes>

Changes:

[Felix Schumacher] Correct typos in README.me


------------------------------------------
[...truncated 115.34 KB...]
                at org.gradle.internal.execution.steps.CleanupOutputsStep.execute(CleanupOutputsStep.java:67)
                at org.gradle.internal.execution.steps.CleanupOutputsStep.execute(CleanupOutputsStep.java:36)
                at org.gradle.internal.execution.steps.ResolveInputChangesStep.execute(ResolveInputChangesStep.java:49)
                at org.gradle.internal.execution.steps.ResolveInputChangesStep.execute(ResolveInputChangesStep.java:34)
                at org.gradle.internal.execution.steps.CancelExecutionStep.execute(CancelExecutionStep.java:43)
                at org.gradle.internal.execution.steps.TimeoutStep.executeWithoutTimeout(TimeoutStep.java:73)
                at org.gradle.internal.execution.steps.TimeoutStep.execute(TimeoutStep.java:54)
                at org.gradle.internal.execution.steps.CatchExceptionStep.execute(CatchExceptionStep.java:34)
                at org.gradle.internal.execution.steps.CreateOutputsStep.execute(CreateOutputsStep.java:44)
                at org.gradle.internal.execution.steps.SnapshotOutputsStep.execute(SnapshotOutputsStep.java:54)
                at org.gradle.internal.execution.steps.SnapshotOutputsStep.execute(SnapshotOutputsStep.java:38)
                at org.gradle.internal.execution.steps.BroadcastChangingOutputsStep.execute(BroadcastChangingOutputsStep.java:49)
                at org.gradle.internal.execution.steps.CacheStep.executeWithoutCache(CacheStep.java:159)
                at org.gradle.internal.execution.steps.CacheStep.executeAndStoreInCache(CacheStep.java:135)
                at org.gradle.internal.execution.steps.CacheStep.lambda$executeWithCache$2(CacheStep.java:112)
                at java.util.Optional.orElseGet(Optional.java:267)
                at org.gradle.internal.execution.steps.CacheStep.lambda$executeWithCache$3(CacheStep.java:112)
                at org.gradle.internal.Try$Success.map(Try.java:162)
                at org.gradle.internal.execution.steps.CacheStep.executeWithCache(CacheStep.java:81)
                at org.gradle.internal.execution.steps.CacheStep.execute(CacheStep.java:71)
                at org.gradle.internal.execution.steps.CacheStep.execute(CacheStep.java:43)
                at org.gradle.internal.execution.steps.StoreExecutionStateStep.execute(StoreExecutionStateStep.java:44)
                at org.gradle.internal.execution.steps.StoreExecutionStateStep.execute(StoreExecutionStateStep.java:33)
                at org.gradle.internal.execution.steps.RecordOutputsStep.execute(RecordOutputsStep.java:38)
                at org.gradle.internal.execution.steps.RecordOutputsStep.execute(RecordOutputsStep.java:24)
                at org.gradle.internal.execution.steps.SkipUpToDateStep.executeBecause(SkipUpToDateStep.java:92)
                at org.gradle.internal.execution.steps.SkipUpToDateStep.lambda$execute$0(SkipUpToDateStep.java:85)
                at java.util.Optional.map(Optional.java:215)
                at org.gradle.internal.execution.steps.SkipUpToDateStep.execute(SkipUpToDateStep.java:55)
                at org.gradle.internal.execution.steps.SkipUpToDateStep.execute(SkipUpToDateStep.java:39)
                at org.gradle.internal.execution.steps.ResolveChangesStep.execute(ResolveChangesStep.java:76)
                at org.gradle.internal.execution.steps.ResolveChangesStep.execute(ResolveChangesStep.java:37)
                at org.gradle.internal.execution.steps.legacy.MarkSnapshottingInputsFinishedStep.execute(MarkSnapshottingInputsFinishedStep.java:36)
                at org.gradle.internal.execution.steps.legacy.MarkSnapshottingInputsFinishedStep.execute(MarkSnapshottingInputsFinishedStep.java:26)
                at org.gradle.internal.execution.steps.ResolveCachingStateStep.execute(ResolveCachingStateStep.java:94)
                at org.gradle.internal.execution.steps.ResolveCachingStateStep.execute(ResolveCachingStateStep.java:49)
                at org.gradle.internal.execution.steps.CaptureStateBeforeExecutionStep.execute(CaptureStateBeforeExecutionStep.java:79)
                at org.gradle.internal.execution.steps.CaptureStateBeforeExecutionStep.execute(CaptureStateBeforeExecutionStep.java:53)
                at org.gradle.internal.execution.steps.ValidateStep.execute(ValidateStep.java:74)
                at org.gradle.internal.execution.steps.SkipEmptyWorkStep.lambda$execute$2(SkipEmptyWorkStep.java:78)
                at java.util.Optional.orElseGet(Optional.java:267)
                at org.gradle.internal.execution.steps.SkipEmptyWorkStep.execute(SkipEmptyWorkStep.java:78)
                at org.gradle.internal.execution.steps.SkipEmptyWorkStep.execute(SkipEmptyWorkStep.java:34)
                at org.gradle.internal.execution.steps.legacy.MarkSnapshottingInputsStartedStep.execute(MarkSnapshottingInputsStartedStep.java:39)
                at org.gradle.internal.execution.steps.LoadExecutionStateStep.execute(LoadExecutionStateStep.java:40)
                at org.gradle.internal.execution.steps.LoadExecutionStateStep.execute(LoadExecutionStateStep.java:28)
            java.lang.NoSuchMethodError: org.gradle.process.internal.worker.WorkerProcessFactory.singleRequestWorker(Ljava/lang/Class;Ljava/lang/Class;)Lorg/gradle/process/internal/worker/SingleRequestWorkerProcessBuilder;
                at com.github.spotbugs.internal.spotbugs.SpotBugsWorkerManager.createWorkerProcess(SpotBugsWorkerManager.java:19)
                at com.github.spotbugs.internal.spotbugs.SpotBugsWorkerManager.runWorker(SpotBugsWorkerManager.java:14)
                at com.github.spotbugs.SpotBugsTask.run(SpotBugsTask.java:270)
                at org.gradle.internal.reflect.JavaMethod.invoke(JavaMethod.java:104)
                at org.gradle.api.internal.project.taskfactory.StandardTaskAction.doExecute(StandardTaskAction.java:58)
                at org.gradle.api.internal.project.taskfactory.StandardTaskAction.execute(StandardTaskAction.java:51)
                at org.gradle.api.internal.project.taskfactory.StandardTaskAction.execute(StandardTaskAction.java:29)
                at org.gradle.api.internal.tasks.execution.ExecuteActionsTaskExecuter$3.run(ExecuteActionsTaskExecuter.java:570)
                at org.gradle.internal.operations.DefaultBuildOperationExecutor$RunnableBuildOperationWorker.execute(DefaultBuildOperationExecutor.java:395)
                at org.gradle.internal.operations.DefaultBuildOperationExecutor$RunnableBuildOperationWorker.execute(DefaultBuildOperationExecutor.java:387)
                at org.gradle.internal.operations.DefaultBuildOperationExecutor$1.execute(DefaultBuildOperationExecutor.java:157)
                at org.gradle.internal.operations.DefaultBuildOperationExecutor.execute(DefaultBuildOperationExecutor.java:242)
                at org.gradle.internal.operations.DefaultBuildOperationExecutor.execute(DefaultBuildOperationExecutor.java:150)
                at org.gradle.internal.operations.DefaultBuildOperationExecutor.run(DefaultBuildOperationExecutor.java:84)
                at org.gradle.internal.operations.DelegatingBuildOperationExecutor.run(DelegatingBuildOperationExecutor.java:31)
                at org.gradle.api.internal.tasks.execution.ExecuteActionsTaskExecuter.executeAction(ExecuteActionsTaskExecuter.java:555)
                at org.gradle.api.internal.tasks.execution.ExecuteActionsTaskExecuter.executeActions(ExecuteActionsTaskExecuter.java:538)
                at org.gradle.api.internal.tasks.execution.ExecuteActionsTaskExecuter.access$300(ExecuteActionsTaskExecuter.java:109)
                at org.gradle.api.internal.tasks.execution.ExecuteActionsTaskExecuter$TaskExecution.executeWithPreviousOutputFiles(ExecuteActionsTaskExecuter.java:279)
                at org.gradle.api.internal.tasks.execution.ExecuteActionsTaskExecuter$TaskExecution.execute(ExecuteActionsTaskExecuter.java:268)
                at org.gradle.internal.execution.steps.ExecuteStep.lambda$execute$1(ExecuteStep.java:33)
                at java.util.Optional.orElseGet(Optional.java:267)
                at org.gradle.internal.execution.steps.ExecuteStep.execute(ExecuteStep.java:33)
                at org.gradle.internal.execution.steps.ExecuteStep.execute(ExecuteStep.java:26)
                at org.gradle.internal.execution.steps.CleanupOutputsStep.execute(CleanupOutputsStep.java:67)
                at org.gradle.internal.execution.steps.CleanupOutputsStep.execute(CleanupOutputsStep.java:36)
                at org.gradle.internal.execution.steps.ResolveInputChangesStep.execute(ResolveInputChangesStep.java:49)
                at org.gradle.internal.execution.steps.ResolveInputChangesStep.execute(ResolveInputChangesStep.java:34)
                at org.gradle.internal.execution.steps.CancelExecutionStep.execute(CancelExecutionStep.java:43)
                at org.gradle.internal.execution.steps.TimeoutStep.executeWithoutTimeout(TimeoutStep.java:73)
                at org.gradle.internal.execution.steps.TimeoutStep.execute(TimeoutStep.java:54)
                at org.gradle.internal.execution.steps.CatchExceptionStep.execute(CatchExceptionStep.java:34)
                at org.gradle.internal.execution.steps.CreateOutputsStep.execute(CreateOutputsStep.java:44)
                at org.gradle.internal.execution.steps.SnapshotOutputsStep.execute(SnapshotOutputsStep.java:54)
                at org.gradle.internal.execution.steps.SnapshotOutputsStep.execute(SnapshotOutputsStep.java:38)
                at org.gradle.internal.execution.steps.BroadcastChangingOutputsStep.execute(BroadcastChangingOutputsStep.java:49)
                at org.gradle.internal.execution.steps.CacheStep.executeWithoutCache(CacheStep.java:159)
                at org.gradle.internal.execution.steps.CacheStep.executeAndStoreInCache(CacheStep.java:135)
                at org.gradle.internal.execution.steps.CacheStep.lambda$executeWithCache$2(CacheStep.java:112)
                at java.util.Optional.orElseGet(Optional.java:267)
                at org.gradle.internal.execution.steps.CacheStep.lambda$executeWithCache$3(CacheStep.java:112)
                at org.gradle.internal.Try$Success.map(Try.java:162)
                at org.gradle.internal.execution.steps.CacheStep.executeWithCache(CacheStep.java:81)
                at org.gradle.internal.execution.steps.CacheStep.execute(CacheStep.java:71)
                at org.gradle.internal.execution.steps.CacheStep.execute(CacheStep.java:43)
                at org.gradle.internal.execution.steps.StoreExecutionStateStep.execute(StoreExecutionStateStep.java:44)
                at org.gradle.internal.execution.steps.StoreExecutionStateStep.execute(StoreExecutionStateStep.java:33)
                at org.gradle.internal.execution.steps.RecordOutputsStep.execute(RecordOutputsStep.java:38)
                at org.gradle.internal.execution.steps.RecordOutputsStep.execute(RecordOutputsStep.java:24)
                at org.gradle.internal.execution.steps.SkipUpToDateStep.executeBecause(SkipUpToDateStep.java:92)
                at org.gradle.internal.execution.steps.SkipUpToDateStep.lambda$execute$0(SkipUpToDateStep.java:85)
                at java.util.Optional.map(Optional.java:215)
                at org.gradle.internal.execution.steps.SkipUpToDateStep.execute(SkipUpToDateStep.java:55)
                at org.gradle.internal.execution.steps.SkipUpToDateStep.execute(SkipUpToDateStep.java:39)
                at org.gradle.internal.execution.steps.ResolveChangesStep.execute(ResolveChangesStep.java:76)
                at org.gradle.internal.execution.steps.ResolveChangesStep.execute(ResolveChangesStep.java:37)
                at org.gradle.internal.execution.steps.legacy.MarkSnapshottingInputsFinishedStep.execute(MarkSnapshottingInputsFinishedStep.java:36)
                at org.gradle.internal.execution.steps.legacy.MarkSnapshottingInputsFinishedStep.execute(MarkSnapshottingInputsFinishedStep.java:26)
                at org.gradle.internal.execution.steps.ResolveCachingStateStep.execute(ResolveCachingStateStep.java:94)
                at org.gradle.internal.execution.steps.ResolveCachingStateStep.execute(ResolveCachingStateStep.java:49)
                at org.gradle.internal.execution.steps.CaptureStateBeforeExecutionStep.execute(CaptureStateBeforeExecutionStep.java:79)
                at org.gradle.internal.execution.steps.CaptureStateBeforeExecutionStep.execute(CaptureStateBeforeExecutionStep.java:53)
                at org.gradle.internal.execution.steps.ValidateStep.execute(ValidateStep.java:74)
                at org.gradle.internal.execution.steps.SkipEmptyWorkStep.lambda$execute$2(SkipEmptyWorkStep.java:78)
                at java.util.Optional.orElseGet(Optional.java:267)
                at org.gradle.internal.execution.steps.SkipEmptyWorkStep.execute(SkipEmptyWorkStep.java:78)
                at org.gradle.internal.execution.steps.SkipEmptyWorkStep.execute(SkipEmptyWorkStep.java:34)
                at org.gradle.internal.execution.steps.legacy.MarkSnapshottingInputsStartedStep.execute(MarkSnapshottingInputsStartedStep.java:39)
                at org.gradle.internal.execution.steps.LoadExecutionStateStep.execute(LoadExecutionStateStep.java:40)
                at org.gradle.internal.execution.steps.LoadExecutionStateStep.execute(LoadExecutionStateStep.java:28)
            java.lang.NoSuchMethodError: org.gradle.process.internal.worker.WorkerProcessFactory.singleRequestWorker(Ljava/lang/Class;Ljava/lang/Class;)Lorg/gradle/process/internal/worker/SingleRequestWorkerProcessBuilder;
                at com.github.spotbugs.internal.spotbugs.SpotBugsWorkerManager.createWorkerProcess(SpotBugsWorkerManager.java:19)
                at com.github.spotbugs.internal.spotbugs.SpotBugsWorkerManager.runWorker(SpotBugsWorkerManager.java:14)
                at com.github.spotbugs.SpotBugsTask.run(SpotBugsTask.java:270)
                at org.gradle.internal.reflect.JavaMethod.invoke(JavaMethod.java:104)
                at org.gradle.api.internal.project.taskfactory.StandardTaskAction.doExecute(StandardTaskAction.java:58)
                at org.gradle.api.internal.project.taskfactory.StandardTaskAction.execute(StandardTaskAction.java:51)
                at org.gradle.api.internal.project.taskfactory.StandardTaskAction.execute(StandardTaskAction.java:29)
                at org.gradle.api.internal.tasks.execution.ExecuteActionsTaskExecuter$3.run(ExecuteActionsTaskExecuter.java:570)
                at org.gradle.internal.operations.DefaultBuildOperationExecutor$RunnableBuildOperationWorker.execute(DefaultBuildOperationExecutor.java:395)
                at org.gradle.internal.operations.DefaultBuildOperationExecutor$RunnableBuildOperationWorker.execute(DefaultBuildOperationExecutor.java:387)
                at org.gradle.internal.operations.DefaultBuildOperationExecutor$1.execute(DefaultBuildOperationExecutor.java:157)
                at org.gradle.internal.operations.DefaultBuildOperationExecutor.execute(DefaultBuildOperationExecutor.java:242)
                at org.gradle.internal.operations.DefaultBuildOperationExecutor.execute(DefaultBuildOperationExecutor.java:150)
                at org.gradle.internal.operations.DefaultBuildOperationExecutor.run(DefaultBuildOperationExecutor.java:84)
                at org.gradle.internal.operations.DelegatingBuildOperationExecutor.run(DelegatingBuildOperationExecutor.java:31)
                at org.gradle.api.internal.tasks.execution.ExecuteActionsTaskExecuter.executeAction(ExecuteActionsTaskExecuter.java:555)
                at org.gradle.api.internal.tasks.execution.ExecuteActionsTaskExecuter.executeActions(ExecuteActionsTaskExecuter.java:538)
                at org.gradle.api.internal.tasks.execution.ExecuteActionsTaskExecuter.access$300(ExecuteActionsTaskExecuter.java:109)
                at org.gradle.api.internal.tasks.execution.ExecuteActionsTaskExecuter$TaskExecution.executeWithPreviousOutputFiles(ExecuteActionsTaskExecuter.java:279)
                at org.gradle.api.internal.tasks.execution.ExecuteActionsTaskExecuter$TaskExecution.execute(ExecuteActionsTaskExecuter.java:268)
                at org.gradle.internal.execution.steps.ExecuteStep.lambda$execute$1(ExecuteStep.java:33)
                at java.util.Optional.orElseGet(Optional.java:267)
                at org.gradle.internal.execution.steps.ExecuteStep.execute(ExecuteStep.java:33)
                at org.gradle.internal.execution.steps.ExecuteStep.execute(ExecuteStep.java:26)
                at org.gradle.internal.execution.steps.CleanupOutputsStep.execute(CleanupOutputsStep.java:67)
                at org.gradle.internal.execution.steps.CleanupOutputsStep.execute(CleanupOutputsStep.java:36)
                at org.gradle.internal.execution.steps.ResolveInputChangesStep.execute(ResolveInputChangesStep.java:49)
                at org.gradle.internal.execution.steps.ResolveInputChangesStep.execute(ResolveInputChangesStep.java:34)
                at org.gradle.internal.execution.steps.CancelExecutionStep.execute(CancelExecutionStep.java:43)
                at org.gradle.internal.execution.steps.TimeoutStep.executeWithoutTimeout(TimeoutStep.java:73)
                at org.gradle.internal.execution.steps.TimeoutStep.execute(TimeoutStep.java:54)
                at org.gradle.internal.execution.steps.CatchExceptionStep.execute(CatchExceptionStep.java:34)
                at org.gradle.internal.execution.steps.CreateOutputsStep.execute(CreateOutputsStep.java:44)
                at org.gradle.internal.execution.steps.SnapshotOutputsStep.execute(SnapshotOutputsStep.java:54)
                at org.gradle.internal.execution.steps.SnapshotOutputsStep.execute(SnapshotOutputsStep.java:38)
                at org.gradle.internal.execution.steps.BroadcastChangingOutputsStep.execute(BroadcastChangingOutputsStep.java:49)
                at org.gradle.internal.execution.steps.CacheStep.executeWithoutCache(CacheStep.java:159)
                at org.gradle.internal.execution.steps.CacheStep.executeAndStoreInCache(CacheStep.java:135)
                at org.gradle.internal.execution.steps.CacheStep.lambda$executeWithCache$2(CacheStep.java:112)
                at java.util.Optional.orElseGet(Optional.java:267)
                at org.gradle.internal.execution.steps.CacheStep.lambda$executeWithCache$3(CacheStep.java:112)
                at org.gradle.internal.Try$Success.map(Try.java:162)
                at org.gradle.internal.execution.steps.CacheStep.executeWithCache(CacheStep.java:81)
                at org.gradle.internal.execution.steps.CacheStep.execute(CacheStep.java:71)
                at org.gradle.internal.execution.steps.CacheStep.execute(CacheStep.java:43)
                at org.gradle.internal.execution.steps.StoreExecutionStateStep.execute(StoreExecutionStateStep.java:44)
                at org.gradle.internal.execution.steps.StoreExecutionStateStep.execute(StoreExecutionStateStep.java:33)
                at org.gradle.internal.execution.steps.RecordOutputsStep.execute(RecordOutputsStep.java:38)
                at org.gradle.internal.execution.steps.RecordOutputsStep.execute(RecordOutputsStep.java:24)
                at org.gradle.internal.execution.steps.SkipUpToDateStep.executeBecause(SkipUpToDateStep.java:92)
                at org.gradle.internal.execution.steps.SkipUpToDateStep.lambda$execute$0(SkipUpToDateStep.java:85)
                at java.util.Optional.map(Optional.java:215)
                at org.gradle.internal.execution.steps.SkipUpToDateStep.execute(SkipUpToDateStep.java:55)
                at org.gradle.internal.execution.steps.SkipUpToDateStep.execute(SkipUpToDateStep.java:39)
                at org.gradle.internal.execution.steps.ResolveChangesStep.execute(ResolveChangesStep.java:76)
                at org.gradle.internal.execution.steps.ResolveChangesStep.execute(ResolveChangesStep.java:37)
                at org.gradle.internal.execution.steps.legacy.MarkSnapshottingInputsFinishedStep.execute(MarkSnapshottingInputsFinishedStep.java:36)
                at org.gradle.internal.execution.steps.legacy.MarkSnapshottingInputsFinishedStep.execute(MarkSnapshottingInputsFinishedStep.java:26)
                at org.gradle.internal.execution.steps.ResolveCachingStateStep.execute(ResolveCachingStateStep.java:94)
                at org.gradle.internal.execution.steps.ResolveCachingStateStep.execute(ResolveCachingStateStep.java:49)
                at org.gradle.internal.execution.steps.CaptureStateBeforeExecutionStep.execute(CaptureStateBeforeExecutionStep.java:79)
                at org.gradle.internal.execution.steps.CaptureStateBeforeExecutionStep.execute(CaptureStateBeforeExecutionStep.java:53)
                at org.gradle.internal.execution.steps.ValidateStep.execute(ValidateStep.java:74)
                at org.gradle.internal.execution.steps.SkipEmptyWorkStep.lambda$execute$2(SkipEmptyWorkStep.java:78)
                at java.util.Optional.orElseGet(Optional.java:267)
                at org.gradle.internal.execution.steps.SkipEmptyWorkStep.execute(SkipEmptyWorkStep.java:78)
                at org.gradle.internal.execution.steps.SkipEmptyWorkStep.execute(SkipEmptyWorkStep.java:34)
                at org.gradle.internal.execution.steps.legacy.MarkSnapshottingInputsStartedStep.execute(MarkSnapshottingInputsStartedStep.java:39)
                at org.gradle.internal.execution.steps.LoadExecutionStateStep.execute(LoadExecutionStateStep.java:40)
                at org.gradle.internal.execution.steps.LoadExecutionStateStep.execute(LoadExecutionStateStep.java:28)


FAILURE: Build completed with 4 failures.

1: Task failed with an exception.
-----------
* What went wrong:
Execution failed for task ':src:bshclient:spotbugsMain'.
> org.gradle.process.internal.worker.WorkerProcessFactory.singleRequestWorker(Ljava/lang/Class;Ljava/lang/Class;)Lorg/gradle/process/internal/worker/SingleRequestWorkerProcessBuilder;

* Try:
Run with --stacktrace option to get the stack trace. Run with --info or --debug option to
get more log output. Run with --scan to get full insights.
==============================================================================

2: Task failed with an exception.
-----------
* What went wrong:
Execution failed for task ':src:testkit:spotbugsMain'.
> org.gradle.process.internal.worker.WorkerProcessFactory.singleRequestWorker(Ljava/lang/Class;Ljava/lang/Class;)Lorg/gradle/process/internal/worker/SingleRequestWorkerProcessBuilder;

* Try:
Run with --stacktrace option to get the stack trace. Run with --info or --debug option to
get more log output. Run with --scan to get full insights.
==============================================================================

3: Task failed with an exception.
-----------
* What went wrong:
Execution failed for task ':src:launcher:spotbugsMain'.
> org.gradle.process.internal.worker.WorkerProcessFactory.singleRequestWorker(Ljava/lang/Class;Ljava/lang/Class;)Lorg/gradle/process/internal/worker/SingleRequestWorkerProcessBuilder;

* Try:
Run with --stacktrace option to get the stack trace. Run with --info or --debug option to
get more log output. Run with --scan to get full insights.
==============================================================================

4: Task failed with an exception.
-----------
* What went wrong:
Execution failed for task ':src:testkit-wiremock:spotbugsMain'.
> org.gradle.process.internal.worker.WorkerProcessFactory.singleRequestWorker(Ljava/lang/Class;Ljava/lang/Class;)Lorg/gradle/process/internal/worker/SingleRequestWorkerProcessBuilder;

* Try:
Run with --stacktrace option to get the stack trace. Run with --info or --debug option to
get more log output. Run with --scan to get full insights.
==============================================================================

* Get more help at https://help.gradle.org

Deprecated Gradle features were used in this build, making it incompatible with Gradle 7.0.
Use '--warning-mode all' to show the individual deprecation warnings.
See https://docs.gradle.org/6.6/userguide/command_line_interface.html#sec:command_line_warnings

BUILD FAILED in 3m 5s
144 actionable tasks: 114 executed, 30 up-to-date

See the profiling report at: file://<https://ci-builds.apache.org/job/JMeter/job/JMeter-trunk/ws/build/reports/profile/profile-2020-08-20-16-09-33.html>
A fine-grained performance profile is available: use the --scan option.
Build step 'Invoke Gradle script' changed build result to FAILURE
Build step 'Invoke Gradle script' marked build as failure
Xvfb stopping
Archiving artifacts
Recording test results
ERROR: Step ?Publish JUnit test result report? failed: No test report files were found. Configuration
error?

Mime
View raw message