jmeter-dev mailing list archives

Site index · List index
Message view « Date » · « Thread »
Top « Date » · « Thread »
From Apache Jenkins Server <jenk...@builds.apache.org>
Subject Build failed in Jenkins: JMeter » JMeter-analysis #7
Date Sun, 09 Aug 2020 15:38:01 GMT
See <https://ci-builds.apache.org/job/JMeter/job/JMeter-analysis/7/display/redirect?page=changes>

Changes:

[Felix Schumacher] Try to make jars available for sonar scanner

[Felix Schumacher] Use correct path for jars


------------------------------------------
[...truncated 195.30 KB...]
    org.gradle.internal.concurrent.ManagedExecutorImpl$1#run at line:48
    java.util.concurrent.ThreadPoolExecutor#runWorker at line:1128
    java.util.concurrent.ThreadPoolExecutor$Worker#run at line:628
    org.gradle.internal.concurrent.ThreadFactoryImpl$ManagedThreadRunnable#run at line:56
    java.lang.Thread#run at line:834


PackageTest > checkI18n fr: messages STANDARD_OUT
    Ignoring missing junit_success_default_code=1000 in org/apache/jmeter/resources/messages_fr.properties
    Ignoring missing junit_failure_default_code=0001 in org/apache/jmeter/resources/messages_fr.properties
    Ignoring missing aggregate_report_90=90% in org/apache/jmeter/resources/messages_fr.properties
    Ignoring missing junit_error_default_code=9999 in org/apache/jmeter/resources/messages_fr.properties

> Task :src:protocol:http:compileTestGroovy
> Task :src:protocol:http:testClasses
> Task :src:protocol:http:testJar UP-TO-DATE
> Task :src:protocol:http:checkstyleMain
> Task :src:protocol:http:checkstyleTest
> Task :src:dist-check:batchBUG_62847
> Task :src:dist-check:compileTestJava UP-TO-DATE
> Task :src:core:check
> Task :src:core:assemble
> Task :src:dist:distTar
> Task :src:dist:compileTestJava NO-SOURCE
> Task :src:dist:testClasses UP-TO-DATE
> Task :src:dist:checkstyleTest NO-SOURCE
> Task :src:dist:spotbugsTest NO-SOURCE
> Task :src:dist:test NO-SOURCE
> Task :src:dist:check
> Task :src:dist-check:compileTestGroovy
> Task :src:dist-check:testClasses
> Task :src:dist-check:checkstyleTest
> Task :src:dist:distTarSha512
> Task :src:generator:spotbugsMain
> Task :src:generator:spotbugsTest NO-SOURCE
> Task :src:generator:test NO-SOURCE
> Task :src:generator:check
> Task :src:examples:spotbugsMain
> Task :src:examples:spotbugsTest NO-SOURCE
> Task :src:examples:test NO-SOURCE
> Task :src:examples:check
> Task :src:dist:distZip
> Task :src:dist:distZipSha512
> Task :src:dist:assemble

> Task :src:functions:spotbugsMain
SpotBugs rule violations were found. See the report at: file://<https://ci-builds.apache.org/job/JMeter/job/JMeter-analysis/ws/src/functions/build/reports/spotbugs/main.xml>

> Task :src:dist-check:spotbugsTest
SpotBugs rule violations were found. See the report at: file://<https://ci-builds.apache.org/job/JMeter/job/JMeter-analysis/ws/src/dist-check/build/reports/spotbugs/test.xml>

> Task :src:functions:spotbugsTest
SpotBugs rule violations were found. See the report at: file://<https://ci-builds.apache.org/job/JMeter/job/JMeter-analysis/ws/src/functions/build/reports/spotbugs/test.xml>

> Task :src:protocol:http:spotbugsMain
> Task :src:dist-check:batchBatchTestLocal

> Task :src:functions:test

Gradle Test Executor 57 STANDARD_OUT
    Setting JMeterHome: <https://ci-builds.apache.org/job/JMeter/job/JMeter-analysis/ws/src/functions/../../.>
    Initializing Properties: ../.././bin/jmeter.properties
    JMeterVersion=5.3.1-SNAPSHOT eeb5258
    java.version=11.0.6
    java.vm.name=Java HotSpot(TM) 64-Bit Server VM
    java.vendor=Oracle Corporation
    java.home=/usr/local/asfpackages/java/jdk-11.0.6
    file.encoding=ISO-8859-1
    default encoding=ISO-8859-1
    user.home=/home/jenkins
    user.dir=<https://ci-builds.apache.org/job/JMeter/job/JMeter-analysis/ws/src/functions>
    user.language=en
    user.region=null
    user.country=US
    user.variant=
    Locale=en_US
    java.class.version=55.0
    java.awt.headless=null
    os.name=Linux
    os.version=4.15.0-74-generic
    os.arch=amd64

TestRegexFunction > testVariableExtractionFromVariable() STANDARD_ERROR
    Warning: Nashorn engine is planned to be removed from a future JDK release

TestJavascriptFunction > testSum() STANDARD_ERROR
    Warning: Nashorn engine is planned to be removed from a future JDK release
    Warning: Nashorn engine is planned to be removed from a future JDK release

TestJavascriptFunction > testParameterCount() STANDARD_ERROR
    Warning: Nashorn engine is planned to be removed from a future JDK release

TestJavascriptFunction > testReplace1() STANDARD_ERROR
    Warning: Nashorn engine is planned to be removed from a future JDK release
    Warning: Nashorn engine is planned to be removed from a future JDK release

TestJavascriptFunction > testReplace2() STANDARD_ERROR
    Warning: Nashorn engine is planned to be removed from a future JDK release
    Warning: Nashorn engine is planned to be removed from a future JDK release

TestJavascriptFunction > testSumVar() STANDARD_ERROR
    Warning: Nashorn engine is planned to be removed from a future JDK release
    Warning: Nashorn engine is planned to be removed from a future JDK release

> Task :src:protocol:http:spotbugsMain
SpotBugs rule violations were found. See the report at: file://<https://ci-builds.apache.org/job/JMeter/job/JMeter-analysis/ws/src/protocol/http/build/reports/spotbugs/main.xml>

> Task :src:dist-check:batchBug50898
> Task :src:functions:check
> Task :src:functions:assemble UP-TO-DATE
> Task :src:dist-check:batchBug52968
> Task :src:dist-check:batchBug54685
> Task :src:dist-check:batchBug55375
> Task :src:dist-check:batchBug56243

> Task :src:protocol:http:spotbugsTest
SpotBugs rule violations were found. See the report at: file://<https://ci-builds.apache.org/job/JMeter/job/JMeter-analysis/ws/src/protocol/http/build/reports/spotbugs/test.xml>

> Task :src:dist-check:batchBug56811

> Task :src:protocol:http:test

Gradle Test Executor 59 STANDARD_OUT
    Setting JMeterHome: <https://ci-builds.apache.org/job/JMeter/job/JMeter-analysis/ws/src/protocol/http/../../../.>
    Initializing Properties: ../../.././bin/jmeter.properties
    JMeterVersion=5.3.1-SNAPSHOT eeb5258
    java.version=11.0.6
    java.vm.name=Java HotSpot(TM) 64-Bit Server VM
    java.vendor=Oracle Corporation
    java.home=/usr/local/asfpackages/java/jdk-11.0.6
    file.encoding=ISO-8859-1
    default encoding=ISO-8859-1
    user.home=/home/jenkins
    user.dir=<https://ci-builds.apache.org/job/JMeter/job/JMeter-analysis/ws/src/protocol/http>
    user.language=en
    user.region=null
    user.country=US
    user.variant=
    Locale=en_US
    java.class.version=55.0
    java.awt.headless=null
    os.name=Linux
    os.version=4.15.0-74-generic
    os.arch=amd64

> Task :src:dist-check:batchBug62239
> Task :src:dist-check:batchFTP_TESTS
> Task :src:dist-check:batchHTMLParserTestFile_2
> Task :src:dist-check:batchHttp4ImplDigestAuth SKIPPED
> Task :src:protocol:http:check
> Task :src:protocol:http:assemble UP-TO-DATE
> Task :src:dist-check:batchHttp4ImplPreemptiveBasicAuth
> Task :src:dist-check:batchHttp4ImplPreemptiveBasicAuthJava SKIPPED
> Task :src:dist-check:batchJDBC_TESTS
> Task :src:dist-check:batchJMS_TESTS
> Task :src:dist-check:batchOS_TESTS
> Task :src:dist-check:batchResponseDecompression
> Task :src:dist-check:batchServerBatchTestLocal
> Task :src:dist-check:batchSlowCharsFeatureHttpClient4 SKIPPED
> Task :src:dist-check:batchSlowCharsFeatureJava SKIPPED
> Task :src:dist-check:batchTCP_TESTS SKIPPED
> Task :src:dist-check:batchTEST_HTTPHttpClient4
> Task :src:dist-check:batchTEST_HTTPJava
> Task :src:dist-check:batchTEST_HTTPS
> Task :src:dist-check:batchTestCookieManager
> Task :src:dist-check:batchTestHeaderManagerHttpClient4
> Task :src:dist-check:batchTestHeaderManagerJava
> Task :src:dist-check:batchTestKeepAlive SKIPPED
> Task :src:dist-check:batchTestRedirectionPolicies SKIPPED
> Task :src:dist-check:batchTestResultStatusAction
> Task :src:dist-check:batchTestSchedulerWithTimer
> Task :src:dist-check:batchTests

> Task :src:dist-check:test

Gradle Test Executor 60 STANDARD_OUT
    Setting JMeterHome: <https://ci-builds.apache.org/job/JMeter/job/JMeter-analysis/ws/src/dist-check/../../.>
    Initializing Properties: ../.././bin/jmeter.properties
    JMeterVersion=5.3.1-SNAPSHOT eeb5258
    java.version=11.0.6
    java.vm.name=Java HotSpot(TM) 64-Bit Server VM
    java.vendor=Oracle Corporation
    java.home=/usr/local/asfpackages/java/jdk-11.0.6
    file.encoding=ISO-8859-1
    default encoding=ISO-8859-1
    user.home=/home/jenkins
    user.dir=<https://ci-builds.apache.org/job/JMeter/job/JMeter-analysis/ws/src/dist-check>
    user.language=en
    user.region=null
    user.country=US
    user.variant=
    Locale=en_US
    java.class.version=55.0
    java.awt.headless=null
    os.name=Linux
    os.version=4.15.0-74-generic
    os.arch=amd64

Gradle Test Executor 60 STANDARD_ERROR
    Warning: Nashorn engine is planned to be removed from a future JDK release
    Warning: Nashorn engine is planned to be removed from a future JDK release
    Warning: Nashorn engine is planned to be removed from a future JDK release

Gradle Test Executor 60 STANDARD_OUT
    o.a.j.junit.JMeterTest WARN: org.apache.jmeter.gui.JMeterGUIComponent: NoSuchMethodException
 org.apache.jmeter.gui.menu.StaticJMeterGUIComponent, missing empty Constructor or Constructor
with Object parameter
    o.a.j.junit.JMeterTest INFO: JMeterGUIComponent: skipping some tests org.apache.jmeter.testbeans.gui.TestBeanGUI
    o.a.j.junit.JMeterTest WARN: java.io.Serializable: NoSuchMethodException  org.apache.jmeter.gui.GlobalUndoableEdit,
missing empty Constructor or Constructor with Object parameter
    o.a.j.junit.JMeterTest WARN: java.io.Serializable: NoSuchMethodException  org.apache.jmeter.rmi.RMIServerSocketFactoryImpl,
missing empty Constructor or Constructor with Object parameter
    o.a.j.junit.JMeterTest WARN: java.io.Serializable: NoSuchMethodException  org.apache.jmeter.rmi.SSLRMIServerSocketFactory,
missing empty Constructor or Constructor with Object parameter
    o.a.j.junit.JMeterTest WARN: Error creating org.apache.jmeter.threads.RemoteThreadsListenerImpl
java.rmi.server.ExportException: Listen failed on port: 0; nested exception is: 
    	java.io.FileNotFoundException: rmi_keystore.jks (No such file or directory)

PackageSpec > testFunctionParse1 STANDARD_ERROR
    Warning: Nashorn engine is planned to be removed from a future JDK release
    Warning: Nashorn engine is planned to be removed from a future JDK release
    Warning: Nashorn engine is planned to be removed from a future JDK release
    Warning: Nashorn engine is planned to be removed from a future JDK release

> Task :src:dist-check:check
> Task :jacocoReport

> Task :sonarqube FAILED
Invalid value for sonar.java.libraries
checksum-dependency elapsed time: 19315ms, configurations processed: 416 (add -PchecksumTimingsPrint
to print detailed timings)

FAILURE: Build failed with an exception.

* What went wrong:
Execution failed for task ':sonarqube'.
> No files nor directories matching './lib/**/*.jar'

* Try:
Run with --stacktrace option to get the stack trace. Run with --info or --debug option to
get more log output. Run with --scan to get full insights.

* Get more help at https://help.gradle.org

Deprecated Gradle features were used in this build, making it incompatible with Gradle 7.0.
Use '--warning-mode all' to show the individual deprecation warnings.
See https://docs.gradle.org/6.3/userguide/command_line_interface.html#sec:command_line_warnings

BUILD FAILED in 7m 40s
358 actionable tasks: 225 executed, 133 up-to-date

See the profiling report at: file://<https://ci-builds.apache.org/job/JMeter/job/JMeter-analysis/ws/build/reports/profile/profile-2020-08-09-15-30-19.html>
A fine-grained performance profile is available: use the --scan option.
Build step 'Invoke Gradle script' changed build result to FAILURE
Build step 'Invoke Gradle script' marked build as failure
Xvfb stopping
Recording test results

Mime
View raw message