jmeter-dev mailing list archives

Site index · List index
Message view « Date » · « Thread »
Top « Date » · « Thread »
From Apache Jenkins Server <jenk...@builds.apache.org>
Subject Build failed in Jenkins: JMeter-trunk #7804
Date Sat, 08 Aug 2020 12:33:50 GMT
See <https://builds.apache.org/job/JMeter-trunk/7804/display/redirect?page=changes>

Changes:

[felix.schumacher] Implement a new setting to allow the exclusion of embedded URLs


------------------------------------------
[...truncated 101.41 KB...]
> Task :src:bshclient:assemble UP-TO-DATE
> Task :src:protocol:http:autostyleJavaCheck
> Task :src:protocol:http:autostyleKotlinGradleCheck NO-SOURCE
> Task :src:protocol:http:autostyleMarkdownCheck NO-SOURCE
> Task :src:protocol:http:autostyleCheck
> Task :src:jorphan:autostyleJavaCheck
> Task :src:jorphan:autostyleKotlinGradleCheck
> Task :src:jorphan:autostyleMarkdownCheck NO-SOURCE
> Task :src:jorphan:autostyleCheck
> Task :src:jorphan:checkstyleMain UP-TO-DATE
> Task :src:jorphan:checkstyleTest UP-TO-DATE
> Task :src:jorphan:spotbugsMain UP-TO-DATE
> Task :src:components:autostyleJavaCheck
> Task :src:components:autostyleKotlinGradleCheck
> Task :src:components:autostyleMarkdownCheck NO-SOURCE
> Task :src:components:autostyleCheck
> Task :src:components:processResources UP-TO-DATE
> Task :src:components:processTestResources UP-TO-DATE
> Task :src:jorphan:spotbugsTest UP-TO-DATE
> Task :src:core:autostyleJavaCheck

> Task :src:jorphan:test
          0.3sec,   37 completed,   0 failed,   0 skipped, org.apache.commons.cli.avalon.ClutilTestCase

> Task :rat
> Task :check

> Task :src:jorphan:test
          0.0sec,    8 completed,   0 failed,   0 skipped, org.apache.jorphan.util.TestConverter
          0.1sec,   50 completed,   0 failed,   0 skipped, org.apache.jorphan.util.TestJorphanUtils

PackageTest STANDARD_ERROR
    SLF4J: Failed to load class "org.slf4j.impl.StaticLoggerBinder".
    SLF4J: Defaulting to no-operation (NOP) logger implementation
    SLF4J: See http://www.slf4j.org/codes.html#StaticLoggerBinder for further details.
          0.1sec,    5 completed,   0 failed,   0 skipped, org.apache.jorphan.collections.PackageTest
          0.1sec,   26 completed,   0 failed,   0 skipped, org.apache.jorphan.gui.ObjectTableSorterTest
          0.0sec,    6 completed,   0 failed,   0 skipped, org.apache.jorphan.gui.ObjectTableModelTest
          2.0sec, org.apache.jorphan.exec.TestKeyToolUtils > testDNSNameBasedCert()
          7.8sec,    3 completed,   0 failed,   0 skipped, org.apache.jorphan.exec.TestKeyToolUtils
WARNING   0.0sec,   10 completed,   0 failed,   2 skipped, org.apache.jorphan.math.TestStatCalculator
          0.0sec,    4 completed,   0 failed,   0 skipped, org.apache.jorphan.reflect.TestClassTools
          0.5sec,    5 completed,   0 failed,   0 skipped, org.apache.jorphan.gui.MinMaxLongRendererTest
          0.3sec,   16 completed,   0 failed,   0 skipped, org.apache.jorphan.io.TextFileSpec
          0.3sec,   58 completed,   0 failed,   0 skipped, org.apache.jorphan.util.ConverterSpec

> Task :src:dist:distTarSource
> Task :src:jorphan:check
> Task :src:jorphan:assemble UP-TO-DATE
> Task :src:dist:distTarSourceSha512

> Task :src:core:compileJava
Note: Some input files use or override a deprecated API.
Note: Recompile with -Xlint:deprecation for details.
Note: <https://builds.apache.org/job/JMeter-trunk/ws/src/core/src/main/java/org/apache/jmeter/save/converters/TestElementPropertyConverter.java>
uses unchecked or unsafe operations.
Note: Recompile with -Xlint:unchecked for details.

> Task :src:core:compileGroovy NO-SOURCE
> Task :src:core:classes
> Task :src:protocol:tcp:compileJava UP-TO-DATE
> Task :src:protocol:native:compileJava UP-TO-DATE
> Task :src:protocol:junit-sample:compileJava UP-TO-DATE
> Task :src:protocol:ldap:compileJava UP-TO-DATE
> Task :src:protocol:jms:compileJava UP-TO-DATE
> Task :src:protocol:java:compileJava UP-TO-DATE
> Task :src:protocol:tcp:classes UP-TO-DATE
> Task :src:protocol:ldap:classes UP-TO-DATE
> Task :src:protocol:native:classes UP-TO-DATE
> Task :src:protocol:junit-sample:classes UP-TO-DATE
> Task :src:protocol:java:classes UP-TO-DATE
> Task :src:protocol:jms:classes UP-TO-DATE
> Task :src:protocol:ftp:compileJava UP-TO-DATE
> Task :src:protocol:ftp:classes UP-TO-DATE
> Task :src:protocol:tcp:jar UP-TO-DATE
> Task :src:protocol:native:jar UP-TO-DATE
> Task :src:protocol:ftp:jar UP-TO-DATE
> Task :src:protocol:ldap:jar UP-TO-DATE
> Task :src:protocol:junit-sample:jar UP-TO-DATE
> Task :src:protocol:java:jar UP-TO-DATE
> Task :src:protocol:jms:jar UP-TO-DATE
> Task :src:protocol:junit:compileJava UP-TO-DATE
> Task :src:protocol:junit:classes UP-TO-DATE
> Task :src:protocol:mongodb:compileJava UP-TO-DATE
> Task :src:protocol:mail:compileJava UP-TO-DATE
> Task :src:protocol:mail:classes UP-TO-DATE
> Task :src:protocol:mongodb:classes UP-TO-DATE
> Task :src:protocol:junit:jar UP-TO-DATE
> Task :src:protocol:mongodb:jar UP-TO-DATE
> Task :src:protocol:mail:jar UP-TO-DATE
> Task :src:core:jar
> Task :src:dist:distZipSource
> Task :src:dist:distZipSourceSha512
> Task :src:protocol:jdbc:compileJava UP-TO-DATE
> Task :src:protocol:jdbc:compileGroovy NO-SOURCE
> Task :src:protocol:jdbc:classes UP-TO-DATE
> Task :src:protocol:jdbc:jar UP-TO-DATE
> Task :src:protocol:bolt:compileJava UP-TO-DATE
> Task :src:protocol:bolt:compileGroovy NO-SOURCE
> Task :src:protocol:bolt:classes UP-TO-DATE
> Task :src:protocol:bolt:jar UP-TO-DATE
> Task :src:components:compileJava UP-TO-DATE
> Task :src:components:compileGroovy NO-SOURCE
> Task :src:components:classes UP-TO-DATE
> Task :src:generator:compileJava UP-TO-DATE
> Task :src:examples:compileJava UP-TO-DATE
> Task :src:generator:classes UP-TO-DATE
> Task :src:examples:classes UP-TO-DATE
> Task :src:dist:processSiteXslt FAILED
> Task :src:protocol:java:checkstyleMain
> Task :src:protocol:ftp:checkstyleMain
> Task :src:protocol:tcp:checkstyleMain
> Task :src:protocol:junit-sample:checkstyleMain
> Task :src:protocol:jms:checkstyleMain
> Task :src:protocol:ldap:checkstyleMain
> Task :src:protocol:mail:checkstyleMain
> Task :src:protocol:junit:checkstyleMain
> Task :src:protocol:native:checkstyleMain
> Task :src:protocol:jdbc:checkstyleMain
> Task :src:generator:jar UP-TO-DATE
> Task :src:protocol:mongodb:checkstyleMain
> Task :src:protocol:bolt:checkstyleMain
> Task :src:components:checkstyleMain
> Task :src:examples:checkstyleMain

> Task :src:core:compileTestJava
Note: <https://builds.apache.org/job/JMeter-trunk/ws/src/core/src/test/java/org/apache/jmeter/listeners/TestResultAction.java>
uses or overrides a deprecated API.
Note: Recompile with -Xlint:deprecation for details.
checksum-dependency elapsed time: 75573ms, configurations processed: 191
    SHA-512 computation time: 2814ms (goes in parallel, it might exceed wall-clock time),
files processed: 39, processed: 6MiB, skipped: 1659MiB
    PGP signature resolution time: 17101ms (wall-clock), resolution requests: 112, signatures
resolved: 236
    PGP key resolution time: 31416ms (wall-clock), resolution requests: 112, download time:
0ms (goes in parallel, it might exceed wall-clock time), keys downloaded: 0
        PGP signature verification time: 68875ms (goes in parallel, it might exceed wall-clock
time), files processed: 529, processed: 618MiB, skipped: 1030MiB

Build jmeter FAILURE reason:                                
    Execution failed for task ':src:dist:processSiteXslt':
        : javax.xml.transform.TransformerException: javax.xml.transform.TransformerException:
com.sun.org.apache.xml.internal.utils.WrappedRuntimeException: The element type "bug" must
be terminated by the matching end-tag "</bug>".
            at org.apache.tools.ant.taskdefs.XSLTProcess.handleTransformationError(XSLTProcess.java:1435)
            at org.apache.tools.ant.taskdefs.XSLTProcess.process(XSLTProcess.java:845)
            at org.apache.tools.ant.taskdefs.XSLTProcess.execute(XSLTProcess.java:426)
            at org.apache.tools.ant.UnknownElement.execute(UnknownElement.java:292)
            at org.apache.tools.ant.dispatch.DispatchUtils.execute(DispatchUtils.java:99)
            at org.gradle.api.internal.project.ant.BasicAntBuilder.nodeCompleted(BasicAntBuilder.java:80)
            at org.gradle.api.internal.project.ant.BasicAntBuilder.doInvokeMethod(BasicAntBuilder.java:107)
            at org.gradle.kotlin.dsl.GroovyBuilderScopeForGroovyObject.invoke(GroovyInteroperability.kt:266)
            at org.gradle.kotlin.dsl.GroovyBuilderScope$DefaultImpls.invoke(GroovyInteroperability.kt:245)
            at org.gradle.kotlin.dsl.GroovyBuilderScopeForGroovyObject.invoke(GroovyInteroperability.kt:263)
            at Build_gradle.xslt(build.gradle.kts:331)
            at Build_gradle.xslt$default(build.gradle.kts:321)
            at Build_gradle$processSiteXslt$2$1.execute(build.gradle.kts:350)
            at Build_gradle$processSiteXslt$2$1.execute(build.gradle.kts:22)
            at org.gradle.api.internal.AbstractTask$TaskActionWrapper.execute(AbstractTask.java:727)
            at org.gradle.api.internal.AbstractTask$TaskActionWrapper.execute(AbstractTask.java:694)
            at org.gradle.api.internal.tasks.execution.ExecuteActionsTaskExecuter$3.run(ExecuteActionsTaskExecuter.java:568)
            at org.gradle.internal.operations.DefaultBuildOperationExecutor$RunnableBuildOperationWorker.execute(DefaultBuildOperationExecutor.java:402)
            at org.gradle.internal.operations.DefaultBuildOperationExecutor$RunnableBuildOperationWorker.execute(DefaultBuildOperationExecutor.java:394)
            at org.gradle.internal.operations.DefaultBuildOperationExecutor$1.execute(DefaultBuildOperationExecutor.java:165)
            at org.gradle.internal.operations.DefaultBuildOperationExecutor.execute(DefaultBuildOperationExecutor.java:250)
            at org.gradle.internal.operations.DefaultBuildOperationExecutor.execute(DefaultBuildOperationExecutor.java:158)
            at org.gradle.internal.operations.DefaultBuildOperationExecutor.run(DefaultBuildOperationExecutor.java:92)
            at org.gradle.internal.operations.DelegatingBuildOperationExecutor.run(DelegatingBuildOperationExecutor.java:31)
            at org.gradle.api.internal.tasks.execution.ExecuteActionsTaskExecuter.executeAction(ExecuteActionsTaskExecuter.java:553)
            at org.gradle.api.internal.tasks.execution.ExecuteActionsTaskExecuter.executeActions(ExecuteActionsTaskExecuter.java:536)
            at org.gradle.api.internal.tasks.execution.ExecuteActionsTaskExecuter.access$300(ExecuteActionsTaskExecuter.java:109)
            at org.gradle.api.internal.tasks.execution.ExecuteActionsTaskExecuter$TaskExecution.executeWithPreviousOutputFiles(ExecuteActionsTaskExecuter.java:276)
            at org.gradle.api.internal.tasks.execution.ExecuteActionsTaskExecuter$TaskExecution.execute(ExecuteActionsTaskExecuter.java:265)
            at org.gradle.internal.execution.steps.ExecuteStep.lambda$execute$1(ExecuteStep.java:33)
            at org.gradle.internal.execution.steps.ExecuteStep.execute(ExecuteStep.java:33)
            at org.gradle.internal.execution.steps.ExecuteStep.execute(ExecuteStep.java:26)
            at org.gradle.internal.execution.steps.CleanupOutputsStep.execute(CleanupOutputsStep.java:67)
            at org.gradle.internal.execution.steps.CleanupOutputsStep.execute(CleanupOutputsStep.java:36)
            at org.gradle.internal.execution.steps.ResolveInputChangesStep.execute(ResolveInputChangesStep.java:49)
            at org.gradle.internal.execution.steps.ResolveInputChangesStep.execute(ResolveInputChangesStep.java:34)
            at org.gradle.internal.execution.steps.CancelExecutionStep.execute(CancelExecutionStep.java:43)
            at org.gradle.internal.execution.steps.TimeoutStep.executeWithoutTimeout(TimeoutStep.java:73)
            at org.gradle.internal.execution.steps.TimeoutStep.execute(TimeoutStep.java:54)
            at org.gradle.internal.execution.steps.CatchExceptionStep.execute(CatchExceptionStep.java:34)
            at org.gradle.internal.execution.steps.CreateOutputsStep.execute(CreateOutputsStep.java:44)
            at org.gradle.internal.execution.steps.SnapshotOutputsStep.execute(SnapshotOutputsStep.java:54)
            at org.gradle.internal.execution.steps.SnapshotOutputsStep.execute(SnapshotOutputsStep.java:38)
            at org.gradle.internal.execution.steps.BroadcastChangingOutputsStep.execute(BroadcastChangingOutputsStep.java:49)
            at org.gradle.internal.execution.steps.CacheStep.executeWithoutCache(CacheStep.java:159)
            at org.gradle.internal.execution.steps.CacheStep.execute(CacheStep.java:72)
            at org.gradle.internal.execution.steps.CacheStep.execute(CacheStep.java:43)
            at org.gradle.internal.execution.steps.StoreExecutionStateStep.execute(StoreExecutionStateStep.java:44)
            at org.gradle.internal.execution.steps.StoreExecutionStateStep.execute(StoreExecutionStateStep.java:33)
            at org.gradle.internal.execution.steps.RecordOutputsStep.execute(RecordOutputsStep.java:38)
            at org.gradle.internal.execution.steps.RecordOutputsStep.execute(RecordOutputsStep.java:24)
            at org.gradle.internal.execution.steps.SkipUpToDateStep.executeBecause(SkipUpToDateStep.java:92)
            at org.gradle.internal.execution.steps.SkipUpToDateStep.lambda$execute$0(SkipUpToDateStep.java:85)
            at org.gradle.internal.execution.steps.SkipUpToDateStep.execute(SkipUpToDateStep.java:55)
            at org.gradle.internal.execution.steps.SkipUpToDateStep.execute(SkipUpToDateStep.java:39)
            at org.gradle.internal.execution.steps.ResolveChangesStep.execute(ResolveChangesStep.java:76)
            at org.gradle.internal.execution.steps.ResolveChangesStep.execute(ResolveChangesStep.java:37)
            at org.gradle.internal.execution.steps.legacy.MarkSnapshottingInputsFinishedStep.execute(MarkSnapshottingInputsFinishedStep.java:36)
            at org.gradle.internal.execution.steps.legacy.MarkSnapshottingInputsFinishedStep.execute(MarkSnapshottingInputsFinishedStep.java:26)
            at org.gradle.internal.execution.steps.ResolveCachingStateStep.execute(ResolveCachingStateStep.java:94)
            at org.gradle.internal.execution.steps.ResolveCachingStateStep.execute(ResolveCachingStateStep.java:49)
            at org.gradle.internal.execution.steps.CaptureStateBeforeExecutionStep.execute(CaptureStateBeforeExecutionStep.java:79)
            at org.gradle.internal.execution.steps.CaptureStateBeforeExecutionStep.execute(CaptureStateBeforeExecutionStep.java:53)
            at org.gradle.internal.execution.steps.ValidateStep.execute(ValidateStep.java:74)
            at org.gradle.internal.execution.steps.SkipEmptyWorkStep.lambda$execute$2(SkipEmptyWorkStep.java:78)
            at org.gradle.internal.execution.steps.SkipEmptyWorkStep.execute(SkipEmptyWorkStep.java:78)
            at org.gradle.internal.execution.steps.SkipEmptyWorkStep.execute(SkipEmptyWorkStep.java:34)
            at org.gradle.internal.execution.steps.legacy.MarkSnapshottingInputsStartedStep.execute(MarkSnapshottingInputsStartedStep.java:39)
            at org.gradle.internal.execution.steps.LoadExecutionStateStep.execute(LoadExecutionStateStep.java:40)
            at org.gradle.internal.execution.steps.LoadExecutionStateStep.execute(LoadExecutionStateStep.java:28)
            Caused by: javax.xml.transform.TransformerException: javax.xml.transform.TransformerException:
com.sun.org.apache.xml.internal.utils.WrappedRuntimeException: The element type "bug" must
be terminated by the matching end-tag "</bug>".
                at com.sun.org.apache.xalan.internal.xsltc.trax.TransformerImpl.transform(TransformerImpl.java:740)
                at com.sun.org.apache.xalan.internal.xsltc.trax.TransformerImpl.transform(TransformerImpl.java:343)
                at org.apache.tools.ant.taskdefs.optional.TraXLiaison.transform(TraXLiaison.java:201)
                at org.apache.tools.ant.taskdefs.XSLTProcess.process(XSLTProcess.java:836)
                ... 68 more
                Caused by: javax.xml.transform.TransformerException: com.sun.org.apache.xml.internal.utils.WrappedRuntimeException:
The element type "bug" must be terminated by the matching end-tag "</bug>".
                    at com.sun.org.apache.xalan.internal.xsltc.trax.TransformerImpl.getDOM(TransformerImpl.java:570)
                    at com.sun.org.apache.xalan.internal.xsltc.trax.TransformerImpl.transform(TransformerImpl.java:730)
                    ... 71 more
                    Caused by: com.sun.org.apache.xml.internal.utils.WrappedRuntimeException:
The element type "bug" must be terminated by the matching end-tag "</bug>".
                        at com.sun.org.apache.xalan.internal.xsltc.dom.XSLTCDTMManager.getDTM(XSLTCDTMManager.java:427)
                        at com.sun.org.apache.xalan.internal.xsltc.dom.XSLTCDTMManager.getDTM(XSLTCDTMManager.java:215)
                        at com.sun.org.apache.xalan.internal.xsltc.trax.TransformerImpl.getDOM(TransformerImpl.java:548)
                        ... 72 more


FAILURE: Build failed with an exception.

* What went wrong:
Execution failed for task ':src:dist:processSiteXslt'.
> javax.xml.transform.TransformerException: javax.xml.transform.TransformerException: com.sun.org.apache.xml.internal.utils.WrappedRuntimeException:
The element type "bug" must be terminated by the matching end-tag "</bug>".

* Try:
Run with --stacktrace option to get the stack trace. Run with --info or --debug option to
get more log output. Run with --scan to get full insights.

* Get more help at https://help.gradle.org

Deprecated Gradle features were used in this build, making it incompatible with Gradle 7.0.
Use '--warning-mode all' to show the individual deprecation warnings.
See https://docs.gradle.org/6.3/userguide/command_line_interface.html#sec:command_line_warnings

BUILD FAILED in 1m 18s
202 actionable tasks: 109 executed, 93 up-to-date

See the profiling report at: file://<https://builds.apache.org/job/JMeter-trunk/ws/build/reports/profile/profile-2020-08-08-12-32-20.html>
A fine-grained performance profile is available: use the --scan option.
Build step 'Invoke Gradle script' changed build result to FAILURE
Build step 'Invoke Gradle script' marked build as failure
Xvfb stopping
Archiving artifacts
[Fast Archiver] Compressed 33.18 MB of artifacts by 59.3% relative to #7803
Recording test results

Mime
View raw message