jmeter-dev mailing list archives

Site index · List index
Message view « Date » · « Thread »
Top « Date » · « Thread »
From Apache Jenkins Server <jenk...@builds.apache.org>
Subject Build failed in Jenkins: JMeter Ubuntu #469
Date Fri, 20 Apr 2018 16:25:03 GMT
See <https://builds.apache.org/job/JMeter%20Ubuntu/469/display/redirect?page=changes>

Changes:

[pmouawad] Bug 62302 - Move JSR223 Sampler up the menu
Contributed by orimarko
Bugzilla Id: 62302

[pmouawad] Bug 62317 - ProxyControl: allow to add ResultSaver as sampler
Bugzilla Id: 62317

[pmouawad] Deprecate unused constant

[pmouawad] Bug 62320 - Counter : Reference Name property is not clear
Bugzilla Id: 62320

[pmouawad] Bug 62315 - "Save response to a file" Component - seems not to be thread safe
Clarify documentation of ResultSaver
Bugzilla Id: 62315

[pmouawad] Bug 58757 / HTTP Request : Updated deprecated methods of HttpComponents to last
APIs of httpclient-4.5.X. 
Use IgnoreSpecProvider
Bugzilla Id: 58757

[milamber] French translation of Precise Throughput Timer label

This closes #381

Bugzilla Id: 62310

[milamber] Update to Ant 1.10.3 (before was 1.10.2)

------------------------------------------
[...truncated 481.77 KB...]
   [concat] 	at org.apache.jmeter.threads.JMeterThread.doSampling(JMeterThread.java:622) [ApacheJMeter_core.jar:4.1-SNAPSHOT
r1829667]
   [concat] 	at org.apache.jmeter.threads.JMeterThread.executeSamplePackage(JMeterThread.java:546)
[ApacheJMeter_core.jar:4.1-SNAPSHOT r1829667]
   [concat] 	at org.apache.jmeter.threads.JMeterThread.processSampler(JMeterThread.java:486)
[ApacheJMeter_core.jar:4.1-SNAPSHOT r1829667]
   [concat] 	at org.apache.jmeter.threads.JMeterThread.run(JMeterThread.java:253) [ApacheJMeter_core.jar:4.1-SNAPSHOT
r1829667]
   [concat] 	at java.lang.Thread.run(Thread.java:748) [?:1.8.0_152]
   [concat] Caused by: java.net.SocketTimeoutException: Read timed out
   [concat] 	at java.net.SocketInputStream.socketRead0(Native Method) ~[?:1.8.0_152]
   [concat] 	at java.net.SocketInputStream.socketRead(SocketInputStream.java:116) ~[?:1.8.0_152]
   [concat] 	at java.net.SocketInputStream.read(SocketInputStream.java:171) ~[?:1.8.0_152]
   [concat] 	at java.net.SocketInputStream.read(SocketInputStream.java:141) ~[?:1.8.0_152]
   [concat] 	at java.net.SocketInputStream.read(SocketInputStream.java:127) ~[?:1.8.0_152]
   [concat] 	at org.apache.jmeter.protocol.tcp.sampler.TCPClientImpl.read(TCPClientImpl.java:114)
~[ApacheJMeter_tcp.jar:4.1-SNAPSHOT r1829667]
   [concat] 	... 6 more
   [concat] 2018-04-20 16:21:36,040 ERROR o.a.j.p.t.s.TCPSampler: 
   [concat] org.apache.jmeter.protocol.tcp.sampler.ReadException: 
   [concat] 	at org.apache.jmeter.protocol.tcp.sampler.BinaryTCPClientImpl.read(BinaryTCPClientImpl.java:152)
~[ApacheJMeter_tcp.jar:4.1-SNAPSHOT r1829667]
   [concat] 	at org.apache.jmeter.protocol.tcp.sampler.TCPSampler.sample(TCPSampler.java:402)
[ApacheJMeter_tcp.jar:4.1-SNAPSHOT r1829667]
   [concat] 	at org.apache.jmeter.threads.JMeterThread.doSampling(JMeterThread.java:622) [ApacheJMeter_core.jar:4.1-SNAPSHOT
r1829667]
   [concat] 	at org.apache.jmeter.threads.JMeterThread.executeSamplePackage(JMeterThread.java:546)
[ApacheJMeter_core.jar:4.1-SNAPSHOT r1829667]
   [concat] 	at org.apache.jmeter.threads.JMeterThread.processSampler(JMeterThread.java:486)
[ApacheJMeter_core.jar:4.1-SNAPSHOT r1829667]
   [concat] 	at org.apache.jmeter.threads.JMeterThread.run(JMeterThread.java:253) [ApacheJMeter_core.jar:4.1-SNAPSHOT
r1829667]
   [concat] 	at java.lang.Thread.run(Thread.java:748) [?:1.8.0_152]
   [concat] Caused by: java.net.SocketTimeoutException: Read timed out
   [concat] 	at java.net.SocketInputStream.socketRead0(Native Method) ~[?:1.8.0_152]
   [concat] 	at java.net.SocketInputStream.socketRead(SocketInputStream.java:116) ~[?:1.8.0_152]
   [concat] 	at java.net.SocketInputStream.read(SocketInputStream.java:171) ~[?:1.8.0_152]
   [concat] 	at java.net.SocketInputStream.read(SocketInputStream.java:141) ~[?:1.8.0_152]
   [concat] 	at java.net.SocketInputStream.read(SocketInputStream.java:127) ~[?:1.8.0_152]
   [concat] 	at org.apache.jmeter.protocol.tcp.sampler.BinaryTCPClientImpl.read(BinaryTCPClientImpl.java:134)
~[ApacheJMeter_tcp.jar:4.1-SNAPSHOT r1829667]
   [concat] 	... 6 more
   [concat] 2018-04-20 16:21:36,051 WARN o.a.j.p.t.s.TCPSampler: Could not create socket for
tcp://localhost:2223
   [concat] java.net.ConnectException: Connection refused (Connection refused)
   [concat] 	at java.net.PlainSocketImpl.socketConnect(Native Method) ~[?:1.8.0_152]
   [concat] 	at java.net.AbstractPlainSocketImpl.doConnect(AbstractPlainSocketImpl.java:350)
~[?:1.8.0_152]
   [concat] 	at java.net.AbstractPlainSocketImpl.connectToAddress(AbstractPlainSocketImpl.java:206)
~[?:1.8.0_152]
   [concat] 	at java.net.AbstractPlainSocketImpl.connect(AbstractPlainSocketImpl.java:188)
~[?:1.8.0_152]
   [concat] 	at java.net.SocksSocketImpl.connect(SocksSocketImpl.java:392) ~[?:1.8.0_152]
   [concat] 	at java.net.Socket.connect(Socket.java:589) ~[?:1.8.0_152]
   [concat] 	at org.apache.jmeter.protocol.tcp.sampler.TCPSampler.getSocket(TCPSampler.java:168)
[ApacheJMeter_tcp.jar:4.1-SNAPSHOT r1829667]
   [concat] 	at org.apache.jmeter.protocol.tcp.sampler.TCPSampler.sample(TCPSampler.java:384)
[ApacheJMeter_tcp.jar:4.1-SNAPSHOT r1829667]
   [concat] 	at org.apache.jmeter.threads.JMeterThread.doSampling(JMeterThread.java:622) [ApacheJMeter_core.jar:4.1-SNAPSHOT
r1829667]
   [concat] 	at org.apache.jmeter.threads.JMeterThread.executeSamplePackage(JMeterThread.java:546)
[ApacheJMeter_core.jar:4.1-SNAPSHOT r1829667]
   [concat] 	at org.apache.jmeter.threads.JMeterThread.processSampler(JMeterThread.java:486)
[ApacheJMeter_core.jar:4.1-SNAPSHOT r1829667]
   [concat] 	at org.apache.jmeter.threads.JMeterThread.run(JMeterThread.java:253) [ApacheJMeter_core.jar:4.1-SNAPSHOT
r1829667]
   [concat] 	at java.lang.Thread.run(Thread.java:748) [?:1.8.0_152]
   [concat] 2018-04-20 16:21:36,194 WARN o.a.j.p.t.s.TCPSampler: Unknown host for tcp://localhostXXXX:2223
   [concat] java.net.UnknownHostException: localhostXXXX
   [concat] 	at java.net.AbstractPlainSocketImpl.connect(AbstractPlainSocketImpl.java:184)
~[?:1.8.0_152]
   [concat] 	at java.net.SocksSocketImpl.connect(SocksSocketImpl.java:392) ~[?:1.8.0_152]
   [concat] 	at java.net.Socket.connect(Socket.java:589) ~[?:1.8.0_152]
   [concat] 	at org.apache.jmeter.protocol.tcp.sampler.TCPSampler.getSocket(TCPSampler.java:168)
[ApacheJMeter_tcp.jar:4.1-SNAPSHOT r1829667]
   [concat] 	at org.apache.jmeter.protocol.tcp.sampler.TCPSampler.sample(TCPSampler.java:384)
[ApacheJMeter_tcp.jar:4.1-SNAPSHOT r1829667]
   [concat] 	at org.apache.jmeter.threads.JMeterThread.doSampling(JMeterThread.java:622) [ApacheJMeter_core.jar:4.1-SNAPSHOT
r1829667]
   [concat] 	at org.apache.jmeter.threads.JMeterThread.executeSamplePackage(JMeterThread.java:546)
[ApacheJMeter_core.jar:4.1-SNAPSHOT r1829667]
   [concat] 	at org.apache.jmeter.threads.JMeterThread.processSampler(JMeterThread.java:486)
[ApacheJMeter_core.jar:4.1-SNAPSHOT r1829667]
   [concat] 	at org.apache.jmeter.threads.JMeterThread.run(JMeterThread.java:253) [ApacheJMeter_core.jar:4.1-SNAPSHOT
r1829667]
   [concat] 	at java.lang.Thread.run(Thread.java:748) [?:1.8.0_152]
   [concat] 2018-04-20 16:21:36,198 ERROR o.a.j.p.t.s.TCPSampler: Could not find protocol
class 'org.foo.xxx'
     [echo] TCP_TESTS output files compared OK

batchtest:
     [echo] Starting JDBC_TESTS with file JDBC_TESTS.jmx using -X -Jdummy=dummy
   [jmeter] SLF4J: Class path contains multiple SLF4J bindings.
   [jmeter] SLF4J: Found binding in [jar:<https://builds.apache.org/job/JMeter%20Ubuntu/ws/trunk/lib/log4j-slf4j-impl-2.10.0.jar!/org/slf4j/impl/StaticLoggerBinder.class]>
   [jmeter] SLF4J: Found binding in [jar:<https://builds.apache.org/job/JMeter%20Ubuntu/ws/trunk/lib/opt/activemq-all-5.15.2.jar!/org/slf4j/impl/StaticLoggerBinder.class]>
   [jmeter] SLF4J: See http://www.slf4j.org/codes.html#multiple_bindings for an explanation.
   [jmeter] SLF4J: Actual binding is of type [org.apache.logging.slf4j.Log4jLoggerFactory]
   [jmeter] Creating summariser <summary>
   [jmeter] Created the tree successfully using testfiles/JDBC_TESTS.jmx
   [jmeter] Starting the test @ Fri Apr 20 16:21:38 UTC 2018 (1524241298889)
   [jmeter] Waiting for possible Shutdown/StopTestNow/Heapdump message on port 4445
   [jmeter] summary =     21 in 00:00:01 =   18.4/s Avg:    18 Min:     0 Max:   350 Err:
    0 (0.00%)
   [jmeter] Tidying up ...    @ Fri Apr 20 16:21:40 UTC 2018 (1524241300833)
   [jmeter] ... end of run
   [concat] 2018-04-20 16:21:40,815 ERROR o.a.j.t.JMeterThread: Error while processing sampler:
'JDBC_With_Failing_PreProcessor'.
   [concat] java.lang.IllegalArgumentException: Variable Name must not be null in JDBC PreProcessor
   [concat] 	at org.apache.jmeter.protocol.jdbc.processor.AbstractJDBCProcessor.process(AbstractJDBCProcessor.java:45)
~[ApacheJMeter_jdbc.jar:4.1-SNAPSHOT r1829667]
   [concat] 	at org.apache.jmeter.protocol.jdbc.processor.JDBCPreProcessor.process(JDBCPreProcessor.java:33)
~[ApacheJMeter_jdbc.jar:4.1-SNAPSHOT r1829667]
   [concat] 	at org.apache.jmeter.threads.JMeterThread.runPreProcessors(JMeterThread.java:935)
~[ApacheJMeter_core.jar:4.1-SNAPSHOT r1829667]
   [concat] 	at org.apache.jmeter.threads.JMeterThread.executeSamplePackage(JMeterThread.java:537)
~[ApacheJMeter_core.jar:4.1-SNAPSHOT r1829667]
   [concat] 	at org.apache.jmeter.threads.JMeterThread.processSampler(JMeterThread.java:486)
[ApacheJMeter_core.jar:4.1-SNAPSHOT r1829667]
   [concat] 	at org.apache.jmeter.threads.JMeterThread.run(JMeterThread.java:253) [ApacheJMeter_core.jar:4.1-SNAPSHOT
r1829667]
   [concat] 	at java.lang.Thread.run(Thread.java:748) [?:1.8.0_152]
   [concat] 2018-04-20 16:21:40,822 ERROR o.a.j.t.JMeterThread: Error while processing sampler:
'JDBC_With_Failing_PostProcessor'.
   [concat] java.lang.IllegalArgumentException: Variable Name must not be null in JDBC PostProcessor
   [concat] 	at org.apache.jmeter.protocol.jdbc.processor.AbstractJDBCProcessor.process(AbstractJDBCProcessor.java:45)
~[ApacheJMeter_jdbc.jar:4.1-SNAPSHOT r1829667]
   [concat] 	at org.apache.jmeter.protocol.jdbc.processor.JDBCPostProcessor.process(JDBCPostProcessor.java:33)
~[ApacheJMeter_jdbc.jar:4.1-SNAPSHOT r1829667]
   [concat] 	at org.apache.jmeter.threads.JMeterThread.runPostProcessors(JMeterThread.java:925)
~[ApacheJMeter_core.jar:4.1-SNAPSHOT r1829667]
   [concat] 	at org.apache.jmeter.threads.JMeterThread.executeSamplePackage(JMeterThread.java:564)
~[ApacheJMeter_core.jar:4.1-SNAPSHOT r1829667]
   [concat] 	at org.apache.jmeter.threads.JMeterThread.processSampler(JMeterThread.java:486)
[ApacheJMeter_core.jar:4.1-SNAPSHOT r1829667]
   [concat] 	at org.apache.jmeter.threads.JMeterThread.run(JMeterThread.java:253) [ApacheJMeter_core.jar:4.1-SNAPSHOT
r1829667]
   [concat] 	at java.lang.Thread.run(Thread.java:748) [?:1.8.0_152]
   [concat] 2018-04-20 16:21:40,823 WARN o.a.j.p.j.p.AbstractJDBCProcessor: SQL Problem in
JDBC PreProcessor: java.sql.SQLSyntaxErrorException: unexpected token: USERS
   [concat] 2018-04-20 16:21:40,829 WARN o.a.j.p.j.p.AbstractJDBCProcessor: SQL Problem in
JDBC PostProcessor: java.sql.SQLSyntaxErrorException: unexpected token: USERS
     [echo] JDBC_TESTS output files compared OK

batchtest:
     [echo] Starting JMS_TESTS with file JMS_TESTS.jmx using -X -Jdummy=dummy
   [jmeter] SLF4J: Class path contains multiple SLF4J bindings.
   [jmeter] SLF4J: Found binding in [jar:<https://builds.apache.org/job/JMeter%20Ubuntu/ws/trunk/lib/log4j-slf4j-impl-2.10.0.jar!/org/slf4j/impl/StaticLoggerBinder.class]>
   [jmeter] SLF4J: Found binding in [jar:<https://builds.apache.org/job/JMeter%20Ubuntu/ws/trunk/lib/opt/activemq-all-5.15.2.jar!/org/slf4j/impl/StaticLoggerBinder.class]>
   [jmeter] SLF4J: See http://www.slf4j.org/codes.html#multiple_bindings for an explanation.
   [jmeter] SLF4J: Actual binding is of type [org.apache.logging.slf4j.Log4jLoggerFactory]
   [jmeter] Creating summariser <summary>
   [jmeter] Created the tree successfully using testfiles/JMS_TESTS.jmx
   [jmeter] Starting the test @ Fri Apr 20 16:21:42 UTC 2018 (1524241302691)
   [jmeter] Waiting for possible Shutdown/StopTestNow/Heapdump message on port 4445
   [jmeter] summary +     21 in 00:00:21 =    1.0/s Avg:   585 Min:     0 Max:  3000 Err:
    0 (0.00%) Active: 1 Started: 4 Finished: 3
   [jmeter] summary +      6 in 00:00:14 =    0.4/s Avg:   518 Min:     0 Max:  3001 Err:
    0 (0.00%) Active: 0 Started: 1 Finished: 1
   [jmeter] summary =     27 in 00:00:35 =    0.8/s Avg:   570 Min:     0 Max:  3001 Err:
    0 (0.00%)
   [jmeter] Tidying up ...    @ Fri Apr 20 16:22:18 UTC 2018 (1524241338484)
   [jmeter] ... end of run
     [echo] JMS_TESTS output files compared OK

batchtest:
     [echo] Starting OS_TESTS with file OS_TESTS.jmx using -X -Jdummy=dummy
   [jmeter] SLF4J: Class path contains multiple SLF4J bindings.
   [jmeter] SLF4J: Found binding in [jar:<https://builds.apache.org/job/JMeter%20Ubuntu/ws/trunk/lib/log4j-slf4j-impl-2.10.0.jar!/org/slf4j/impl/StaticLoggerBinder.class]>
   [jmeter] SLF4J: Found binding in [jar:<https://builds.apache.org/job/JMeter%20Ubuntu/ws/trunk/lib/opt/activemq-all-5.15.2.jar!/org/slf4j/impl/StaticLoggerBinder.class]>
   [jmeter] SLF4J: See http://www.slf4j.org/codes.html#multiple_bindings for an explanation.
   [jmeter] SLF4J: Actual binding is of type [org.apache.logging.slf4j.Log4jLoggerFactory]
   [jmeter] Creating summariser <summary>
   [jmeter] Created the tree successfully using testfiles/OS_TESTS.jmx
   [jmeter] Starting the test @ Fri Apr 20 16:22:20 UTC 2018 (1524241340864)
   [jmeter] Waiting for possible Shutdown/StopTestNow/Heapdump message on port 4445
   [jmeter] summary =      3 in 00:00:02 =    1.8/s Avg:   337 Min:     2 Max:  1002 Err:
    0 (0.00%)
   [jmeter] Tidying up ...    @ Fri Apr 20 16:22:22 UTC 2018 (1524241342916)
   [jmeter] ... end of run
     [echo] OS_TESTS output files compared OK

batchtest:
     [echo] Starting FTP_TESTS with file FTP_TESTS.jmx using -X -Jdummy=dummy
   [jmeter] SLF4J: Class path contains multiple SLF4J bindings.
   [jmeter] SLF4J: Found binding in [jar:<https://builds.apache.org/job/JMeter%20Ubuntu/ws/trunk/lib/log4j-slf4j-impl-2.10.0.jar!/org/slf4j/impl/StaticLoggerBinder.class]>
   [jmeter] SLF4J: Found binding in [jar:<https://builds.apache.org/job/JMeter%20Ubuntu/ws/trunk/lib/opt/activemq-all-5.15.2.jar!/org/slf4j/impl/StaticLoggerBinder.class]>
   [jmeter] SLF4J: See http://www.slf4j.org/codes.html#multiple_bindings for an explanation.
   [jmeter] SLF4J: Actual binding is of type [org.apache.logging.slf4j.Log4jLoggerFactory]
   [jmeter] Creating summariser <summary>
   [jmeter] Created the tree successfully using testfiles/FTP_TESTS.jmx
   [jmeter] Starting the test @ Fri Apr 20 16:22:24 UTC 2018 (1524241344747)
   [jmeter] Waiting for possible Shutdown/StopTestNow/Heapdump message on port 4445
   [jmeter] summary =      6 in 00:00:02 =    2.9/s Avg:   143 Min:     8 Max:   684 Err:
    0 (0.00%)
   [jmeter] Tidying up ...    @ Fri Apr 20 16:22:27 UTC 2018 (1524241347587)
   [jmeter] ... end of run
     [echo] FTP_TESTS output files compared OK

batchtest:
     [echo] Starting Bug60607 with file Bug60607.jmx using -X -Jdummy=dummy
   [jmeter] SLF4J: Class path contains multiple SLF4J bindings.
   [jmeter] SLF4J: Found binding in [jar:<https://builds.apache.org/job/JMeter%20Ubuntu/ws/trunk/lib/log4j-slf4j-impl-2.10.0.jar!/org/slf4j/impl/StaticLoggerBinder.class]>
   [jmeter] SLF4J: Found binding in [jar:<https://builds.apache.org/job/JMeter%20Ubuntu/ws/trunk/lib/opt/activemq-all-5.15.2.jar!/org/slf4j/impl/StaticLoggerBinder.class]>
   [jmeter] SLF4J: See http://www.slf4j.org/codes.html#multiple_bindings for an explanation.
   [jmeter] SLF4J: Actual binding is of type [org.apache.logging.slf4j.Log4jLoggerFactory]
   [jmeter] Creating summariser <summary>
   [jmeter] Created the tree successfully using testfiles/Bug60607.jmx
   [jmeter] Starting the test @ Fri Apr 20 16:22:29 UTC 2018 (1524241349396)
   [jmeter] Waiting for possible Shutdown/StopTestNow/Heapdump message on port 4445
   [jmeter] summary +      1 in 00:00:00 =    2.1/s Avg:   105 Min:   105 Max:   105 Err:
    0 (0.00%) Active: 1 Started: 1 Finished: 0
   [jmeter] summary +      1 in 00:00:30 =    0.0/s Avg: 30076 Min: 30076 Max: 30076 Err:
    0 (0.00%) Active: 1 Started: 2 Finished: 1
   [jmeter] summary =      2 in 00:00:31 =    0.1/s Avg: 15090 Min:   105 Max: 30076 Err:
    0 (0.00%)
   [jmeter] summary =      2 in 00:00:31 =    0.1/s Avg: 15090 Min:   105 Max: 30076 Err:
    0 (0.00%)
   [jmeter] Tidying up ...    @ Fri Apr 20 16:23:00 UTC 2018 (1524241380497)
   [jmeter] ... end of run
     [echo] Bug60607 output files compared OK

batchtest:
     [echo] Starting SlowCharsFeature_HttpClient4 with file SlowCharsFeature.jmx using -X
-Jdummy=dummy
   [jmeter] SLF4J: Class path contains multiple SLF4J bindings.
   [jmeter] SLF4J: Found binding in [jar:<https://builds.apache.org/job/JMeter%20Ubuntu/ws/trunk/lib/log4j-slf4j-impl-2.10.0.jar!/org/slf4j/impl/StaticLoggerBinder.class]>
   [jmeter] SLF4J: Found binding in [jar:<https://builds.apache.org/job/JMeter%20Ubuntu/ws/trunk/lib/opt/activemq-all-5.15.2.jar!/org/slf4j/impl/StaticLoggerBinder.class]>
   [jmeter] SLF4J: See http://www.slf4j.org/codes.html#multiple_bindings for an explanation.
   [jmeter] SLF4J: Actual binding is of type [org.apache.logging.slf4j.Log4jLoggerFactory]
   [jmeter] Creating summariser <summary>
   [jmeter] Created the tree successfully using testfiles/SlowCharsFeature.jmx
   [jmeter] Starting the test @ Fri Apr 20 16:23:02 UTC 2018 (1524241382938)
   [jmeter] Waiting for possible Shutdown/StopTestNow/Heapdump message on port 4445
   [jmeter] summary +      1 in 00:00:00 =    2.3/s Avg:   423 Min:   423 Max:   423 Err:
    0 (0.00%) Active: 1 Started: 1 Finished: 0
   [jmeter] summary +      4 in 00:00:28 =    0.1/s Avg:  6950 Min:  5586 Max: 10835 Err:
    0 (0.00%) Active: 1 Started: 1 Finished: 0
   [jmeter] summary =      5 in 00:00:29 =    0.2/s Avg:  5645 Min:   423 Max: 10835 Err:
    0 (0.00%)
   [jmeter] summary =      5 in 00:00:29 =    0.2/s Avg:  5645 Min:   423 Max: 10835 Err:
    0 (0.00%)
   [jmeter] Tidying up ...    @ Fri Apr 20 16:23:32 UTC 2018 (1524241412319)
   [jmeter] ... end of run
     [echo] SlowCharsFeature_HttpClient4 output files compared OK

batchtest:
     [echo] Starting SlowCharsFeature_Java with file SlowCharsFeature.jmx using -X -Jjmeter.httpsampler=Java
   [jmeter] SLF4J: Class path contains multiple SLF4J bindings.
   [jmeter] SLF4J: Found binding in [jar:<https://builds.apache.org/job/JMeter%20Ubuntu/ws/trunk/lib/log4j-slf4j-impl-2.10.0.jar!/org/slf4j/impl/StaticLoggerBinder.class]>
   [jmeter] SLF4J: Found binding in [jar:<https://builds.apache.org/job/JMeter%20Ubuntu/ws/trunk/lib/opt/activemq-all-5.15.2.jar!/org/slf4j/impl/StaticLoggerBinder.class]>
   [jmeter] SLF4J: See http://www.slf4j.org/codes.html#multiple_bindings for an explanation.
   [jmeter] SLF4J: Actual binding is of type [org.apache.logging.slf4j.Log4jLoggerFactory]
   [jmeter] Creating summariser <summary>
   [jmeter] Created the tree successfully using testfiles/SlowCharsFeature.jmx
   [jmeter] Starting the test @ Fri Apr 20 16:23:34 UTC 2018 (1524241414401)
   [jmeter] Waiting for possible Shutdown/StopTestNow/Heapdump message on port 4445
   [jmeter] summary +      1 in 00:00:00 =    2.1/s Avg:   447 Min:   447 Max:   447 Err:
    0 (0.00%) Active: 1 Started: 1 Finished: 0
   [jmeter] summary +      3 in 00:00:23 =    0.1/s Avg:  7493 Min:  5589 Max: 11229 Err:
    0 (0.00%) Active: 0 Started: 1 Finished: 1
   [jmeter] summary =      4 in 00:00:23 =    0.2/s Avg:  5731 Min:   447 Max: 11229 Err:
    0 (0.00%)
   [jmeter] Tidying up ...    @ Fri Apr 20 16:23:58 UTC 2018 (1524241438188)
   [jmeter] ... end of run
     [echo] SlowCharsFeature_Java output files compared OK

batchtest:
     [echo] Starting TestKeepAlive with file TestKeepAlive.jmx using -X -Jdummy=dummy
   [jmeter] SLF4J: Class path contains multiple SLF4J bindings.
   [jmeter] SLF4J: Found binding in [jar:<https://builds.apache.org/job/JMeter%20Ubuntu/ws/trunk/lib/log4j-slf4j-impl-2.10.0.jar!/org/slf4j/impl/StaticLoggerBinder.class]>
   [jmeter] SLF4J: Found binding in [jar:<https://builds.apache.org/job/JMeter%20Ubuntu/ws/trunk/lib/opt/activemq-all-5.15.2.jar!/org/slf4j/impl/StaticLoggerBinder.class]>
   [jmeter] SLF4J: See http://www.slf4j.org/codes.html#multiple_bindings for an explanation.
   [jmeter] SLF4J: Actual binding is of type [org.apache.logging.slf4j.Log4jLoggerFactory]
   [jmeter] Creating summariser <summary>
   [jmeter] Created the tree successfully using testfiles/TestKeepAlive.jmx
   [jmeter] Starting the test @ Fri Apr 20 16:24:00 UTC 2018 (1524241440111)
   [jmeter] Waiting for possible Shutdown/StopTestNow/Heapdump message on port 4445
   [jmeter] summary +      1 in 00:00:00 =    2.3/s Avg:   400 Min:   400 Max:   400 Err:
    0 (0.00%) Active: 1 Started: 1 Finished: 0
   [jmeter] summary +      6 in 00:00:31 =    0.2/s Avg:    29 Min:    12 Max:    72 Err:
    1 (16.67%) Active: 1 Started: 1 Finished: 0
   [jmeter] summary =      7 in 00:00:31 =    0.2/s Avg:    82 Min:    12 Max:   400 Err:
    1 (14.29%)
   [jmeter] summary +      1 in 00:00:30 =    0.0/s Avg:   315 Min:   315 Max:   315 Err:
    0 (0.00%) Active: 1 Started: 1 Finished: 0
   [jmeter] summary =      8 in 00:01:01 =    0.1/s Avg:   111 Min:    12 Max:   400 Err:
    1 (12.50%)
   [jmeter] summary =      8 in 00:01:01 =    0.1/s Avg:   111 Min:    12 Max:   400 Err:
    1 (12.50%)
   [jmeter] Tidying up ...    @ Fri Apr 20 16:25:02 UTC 2018 (1524241502391)
   [jmeter] ... end of run

BUILD FAILED
<https://builds.apache.org/job/JMeter%20Ubuntu/ws/trunk/build.xml>:2954: The following
error occurred while executing this line:
<https://builds.apache.org/job/JMeter%20Ubuntu/ws/trunk/build.xml>:2773: CSV Files are
not identical.
        <https://builds.apache.org/job/JMeter%20Ubuntu/ws/trunk/bin/testfiles/TestKeepAlive.csv>
        JSPP_SetProperties,200,OK,setUp Thread Group 1-1,text,true
HTTP_Request_CLOSE,200,OK,Thread Group 1-1,text,true
HTTP-Warmup,200,OK,Thread Group 1-1,text,true
HTTP_Request_REUSE,200,OK,Thread Group 1-1,text,true
HTTP_Request_REUSE_2,200,OK,Thread Group 1-1,text,true
HTTP_Request_REUSE_AFTER_VALIDATE,200,OK,Thread Group 1-1,text,true
HTTP_Request_NO_REUSE,200,OK,Thread Group 1-1,text,true
HTTP_Request_NO_REUSE,200,OK,Thread Group 1-1,text,true

        <https://builds.apache.org/job/JMeter%20Ubuntu/ws/trunk/bin/TestKeepAlive.csv>
        JSPP_SetProperties,200,OK,setUp Thread Group 1-1,text,true
HTTP_Request_CLOSE,200,OK,Thread Group 1-1,text,true
HTTP-Warmup,200,OK,Thread Group 1-1,text,true
HTTP_Request_REUSE,200,OK,Thread Group 1-1,text,true
HTTP_Request_REUSE_2,200,OK,Thread Group 1-1,text,true
HTTP_Request_REUSE_AFTER_VALIDATE,200,OK,Thread Group 1-1,text,false
HTTP_Request_NO_REUSE,200,OK,Thread Group 1-1,text,true
HTTP_Request_NO_REUSE,200,OK,Thread Group 1-1,text,true

Total time: 7 minutes 51 seconds
Build step 'Invoke Ant' marked build as failure
[locks-and-latches] Releasing all the locks
[locks-and-latches] All the locks released

Mime
View raw message