jmeter-dev mailing list archives

Site index · List index
Message view « Date » · « Thread »
Top « Date » · « Thread »
From Apache Jenkins Server <jenk...@builds.apache.org>
Subject Build failed in Jenkins: JMeter-trunk #6748
Date Thu, 05 Apr 2018 22:37:39 GMT
See <https://builds.apache.org/job/JMeter-trunk/6748/display/redirect?page=changes>

Changes:

[pmouawad] Bug 62265 - ModuleController behaves strangely
Bugzilla Id: 62265

------------------------------------------
[...truncated 546.57 KB...]
    [junit] Running org.apache.jmeter.functions.TestJavascriptFunction
    [junit] Tests run: 5, Failures: 0, Errors: 0, Skipped: 0, Time elapsed: 0.153 sec
    [junit] Running org.apache.jmeter.functions.TestJavascriptFunctionWithRhino
    [junit] Tests run: 5, Failures: 0, Errors: 0, Skipped: 0, Time elapsed: 0.534 sec
    [junit] Running org.apache.jmeter.functions.TestJexl2Function
    [junit] Tests run: 5, Failures: 0, Errors: 0, Skipped: 0, Time elapsed: 0.153 sec
    [junit] Running org.apache.jmeter.functions.TestJexl3Function
    [junit] Tests run: 5, Failures: 0, Errors: 0, Skipped: 0, Time elapsed: 0.234 sec
    [junit] Running org.apache.jmeter.functions.TestMachineIPName
    [junit] Tests run: 5, Failures: 0, Errors: 0, Skipped: 0, Time elapsed: 0.003 sec
    [junit] Running org.apache.jmeter.functions.TestRandomFromMultipleVars
    [junit] Tests run: 4, Failures: 0, Errors: 0, Skipped: 0, Time elapsed: 0.003 sec
    [junit] Running org.apache.jmeter.functions.TestRegexFunction
    [junit] Tests run: 22, Failures: 0, Errors: 0, Skipped: 0, Time elapsed: 0.012 sec
    [junit] Running org.apache.jmeter.functions.TestSamplerNameFunction
    [junit] Tests run: 2, Failures: 0, Errors: 0, Skipped: 0, Time elapsed: 0.003 sec
    [junit] Running org.apache.jmeter.functions.TestSetProperty
    [junit] Tests run: 3, Failures: 0, Errors: 0, Skipped: 0, Time elapsed: 0.003 sec
    [junit] Running org.apache.jmeter.functions.TestSimpleFunctions
    [junit] Tests run: 15, Failures: 0, Errors: 0, Skipped: 0, Time elapsed: 0.031 sec
    [junit] Running org.apache.jmeter.functions.TestTimeFunction
    [junit] Tests run: 15, Failures: 0, Errors: 0, Skipped: 0, Time elapsed: 0.006 sec
    [junit] Running org.apache.jmeter.functions.TestTimeRandomDateFunction
    [junit] Tests run: 14, Failures: 0, Errors: 0, Skipped: 0, Time elapsed: 0.128 sec
    [junit] Running org.apache.jmeter.functions.TestTimeShiftFunction
    [junit] Tests run: 11, Failures: 0, Errors: 0, Skipped: 0, Time elapsed: 0.042 sec
    [junit] Running org.apache.jmeter.functions.TestUrlEncodeDecode
    [junit] Tests run: 3, Failures: 0, Errors: 0, Skipped: 0, Time elapsed: 0.004 sec
    [junit] Running org.apache.jmeter.functions.VariableTest
    [junit] Tests run: 1, Failures: 0, Errors: 0, Skipped: 0, Time elapsed: 0.002 sec
    [junit] Running org.apache.jmeter.gui.action.TestLoad
    [junit] Tests run: 82, Failures: 0, Errors: 0, Skipped: 0, Time elapsed: 1.703 sec
    [junit] Running org.apache.jmeter.gui.action.TestSave
    [junit] Tests run: 1, Failures: 0, Errors: 0, Skipped: 0, Time elapsed: 0.008 sec
    [junit] Running org.apache.jmeter.gui.logging.TestGuiLogEventAppender
    [junit] Tests run: 1, Failures: 0, Errors: 0, Skipped: 0, Time elapsed: 0.039 sec
    [junit] Running org.apache.jmeter.gui.util.JSyntaxTextAreaTest
    [junit] Tests run: 2, Failures: 0, Errors: 0, Skipped: 0, Time elapsed: 0.016 sec
    [junit] Running org.apache.jmeter.junit.JMeterTest
    [junit] Tests run: 710, Failures: 0, Errors: 0, Skipped: 0, Time elapsed: 1.543 sec
    [junit] Running org.apache.jmeter.listeners.TestResultAction
    [junit] Tests run: 5, Failures: 0, Errors: 0, Skipped: 0, Time elapsed: 0.004 sec
    [junit] Running org.apache.jmeter.protocol.http.config.MultipartUrlConfigTest
    [junit] Tests run: 3, Failures: 0, Errors: 0, Skipped: 0, Time elapsed: 0.004 sec
    [junit] Running org.apache.jmeter.protocol.http.config.UrlConfigTest
    [junit] Tests run: 2, Failures: 0, Errors: 0, Skipped: 0, Time elapsed: 0.003 sec
    [junit] Running org.apache.jmeter.protocol.http.control.TestAuthManager
    [junit] Tests run: 6, Failures: 0, Errors: 0, Skipped: 0, Time elapsed: 0.016 sec
    [junit] Running org.apache.jmeter.protocol.http.control.TestAuthorization
    [junit] Tests run: 1, Failures: 0, Errors: 0, Skipped: 0, Time elapsed: 0.003 sec
    [junit] Running org.apache.jmeter.protocol.http.control.TestCacheManagerHC4
    [junit] Tests run: 24, Failures: 0, Errors: 0, Skipped: 0, Time elapsed: 12.764 sec
    [junit] Running org.apache.jmeter.protocol.http.control.TestCacheManagerUrlConnection
    [junit] Tests run: 23, Failures: 0, Errors: 0, Skipped: 0, Time elapsed: 12.749 sec
    [junit] Running org.apache.jmeter.protocol.http.control.TestDNSCacheManager
    [junit] Tests run: 12, Failures: 0, Errors: 0, Skipped: 0, Time elapsed: 0.378 sec
    [junit] Running org.apache.jmeter.protocol.http.control.TestHC4CookieManager
    [junit] Tests run: 33, Failures: 0, Errors: 0, Skipped: 0, Time elapsed: 0.071 sec
    [junit] Running org.apache.jmeter.protocol.http.control.TestHTTPMirrorThread
    [junit] Tests run: 9, Failures: 0, Errors: 0, Skipped: 0, Time elapsed: 0.986 sec
    [junit] Running org.apache.jmeter.protocol.http.control.gui.TestHttpTestSampleGui
    [junit] Tests run: 1, Failures: 0, Errors: 0, Skipped: 0, Time elapsed: 0.02 sec
    [junit] Running org.apache.jmeter.protocol.http.modifier.TestAnchorModifier
    [junit] Tests run: 18, Failures: 0, Errors: 0, Skipped: 0, Time elapsed: 0.124 sec
    [junit] Running org.apache.jmeter.protocol.http.modifier.TestURLRewritingModifier
    [junit] Tests run: 17, Failures: 0, Errors: 0, Skipped: 0, Time elapsed: 0.013 sec
    [junit] Running org.apache.jmeter.protocol.http.parser.TestBaseParser
    [junit] Tests run: 2, Failures: 0, Errors: 0, Skipped: 0, Time elapsed: 0.004 sec
    [junit] Running org.apache.jmeter.protocol.http.parser.TestBug60842HtmlParser
    [junit] Tests run: 42, Failures: 0, Errors: 0, Skipped: 0, Time elapsed: 0.05 sec
    [junit] Running org.apache.jmeter.protocol.http.parser.TestCssParser
    [junit] Tests run: 4, Failures: 0, Errors: 0, Skipped: 0, Time elapsed: 0.492 sec
    [junit] Running org.apache.jmeter.protocol.http.parser.TestHTMLParser
    [junit] Tests run: 103, Failures: 0, Errors: 0, Skipped: 0, Time elapsed: 0.4 sec
    [junit] Running org.apache.jmeter.protocol.http.parser.TestHtmlParsingUtils
    [junit] Tests run: 6, Failures: 0, Errors: 0, Skipped: 0, Time elapsed: 0.006 sec
    [junit] Running org.apache.jmeter.protocol.http.proxy.TestHttpRequestHdr
    [junit] Tests run: 10, Failures: 0, Errors: 0, Skipped: 0, Time elapsed: 0.356 sec
    [junit] Running org.apache.jmeter.protocol.http.proxy.TestProxyControl
    [junit] Tests run: 7, Failures: 0, Errors: 0, Skipped: 0, Time elapsed: 0.004 sec
    [junit] Running org.apache.jmeter.protocol.http.sampler.PackageTest
    [junit] Tests run: 1, Failures: 0, Errors: 0, Skipped: 0, Time elapsed: 0.024 sec
    [junit] Running org.apache.jmeter.protocol.http.sampler.PostWriterTest
    [junit] Tests run: 8, Failures: 0, Errors: 0, Skipped: 0, Time elapsed: 0.012 sec
    [junit] Running org.apache.jmeter.protocol.http.sampler.PutWriterTest
    [junit] Tests run: 2, Failures: 0, Errors: 0, Skipped: 0, Time elapsed: 0.003 sec
    [junit] Running org.apache.jmeter.protocol.http.sampler.TestHTTPSamplers
    [junit] Tests run: 18, Failures: 0, Errors: 0, Skipped: 0, Time elapsed: 0.006 sec
    [junit] Running org.apache.jmeter.protocol.http.sampler.TestHTTPSamplersAgainstHttpMirrorServer
    [junit] Tests run: 53, Failures: 0, Errors: 0, Skipped: 0, Time elapsed: 0.463 sec
    [junit] Running org.apache.jmeter.protocol.http.sampler.TestHttpWebdav
    [junit] Tests run: 2, Failures: 0, Errors: 0, Skipped: 0, Time elapsed: 0.003 sec
    [junit] Running org.apache.jmeter.protocol.http.util.TestHTTPArgument
    [junit] Tests run: 3, Failures: 0, Errors: 0, Skipped: 0, Time elapsed: 0.002 sec
    [junit] Running org.apache.jmeter.protocol.http.util.TestHTTPFileArg
    [junit] Tests run: 3, Failures: 0, Errors: 0, Skipped: 0, Time elapsed: 0.002 sec
    [junit] Running org.apache.jmeter.protocol.http.util.TestHTTPFileArgs
    [junit] Tests run: 5, Failures: 0, Errors: 0, Skipped: 0, Time elapsed: 0.003 sec
    [junit] Running org.apache.jmeter.protocol.http.util.accesslog.TestLogFilter
    [junit] Tests run: 6, Failures: 0, Errors: 0, Skipped: 0, Time elapsed: 0.003 sec
    [junit] Running org.apache.jmeter.protocol.http.util.accesslog.TestSessionFilter
    [junit] Tests run: 3, Failures: 0, Errors: 0, Skipped: 0, Time elapsed: 0.002 sec
    [junit] Running org.apache.jmeter.protocol.http.util.accesslog.TestTCLogParser
    [junit] Tests run: 4, Failures: 0, Errors: 0, Skipped: 0, Time elapsed: 0.002 sec
    [junit] Running org.apache.jmeter.protocol.http.visualizers.RequestViewHTTPTest
    [junit] Tests run: 7, Failures: 0, Errors: 0, Skipped: 0, Time elapsed: 0.004 sec
    [junit] Running org.apache.jmeter.protocol.jms.sampler.PublisherSamplerTest
    [junit] Tests run: 1, Failures: 0, Errors: 0, Skipped: 0, Time elapsed: 0.013 sec
    [junit] Running org.apache.jmeter.protocol.jms.sampler.render.BinaryMessageRendererTest
    [junit] Tests run: 8, Failures: 0, Errors: 0, Skipped: 0, Time elapsed: 0.026 sec
    [junit] Running org.apache.jmeter.protocol.jms.sampler.render.ObjectMessageRendererTest
    [junit] Tests run: 5, Failures: 0, Errors: 0, Skipped: 0, Time elapsed: 0.056 sec
    [junit] Running org.apache.jmeter.protocol.jms.sampler.render.TextMessageRendererTest
    [junit] Tests run: 7, Failures: 0, Errors: 0, Skipped: 0, Time elapsed: 0.006 sec
    [junit] Running org.apache.jmeter.protocol.ldap.config.gui.PackageTest
    [junit] Tests run: 1, Failures: 0, Errors: 0, Skipped: 0, Time elapsed: 0.004 sec
    [junit] Running org.apache.jmeter.protocol.tcp.sampler.BinaryTCPClientImplTest
    [junit] Tests run: 3, Failures: 0, Errors: 0, Skipped: 0, Time elapsed: 0.003 sec
    [junit] Running org.apache.jmeter.protocol.tcp.sampler.LengthPrefixedBinaryTCPClientImplTest
    [junit] Tests run: 2, Failures: 0, Errors: 0, Skipped: 0, Time elapsed: 0.002 sec
    [junit] Running org.apache.jmeter.protocol.tcp.sampler.TCPClientDecoratorTest
    [junit] Tests run: 3, Failures: 0, Errors: 0, Skipped: 0, Time elapsed: 0.002 sec
    [junit] Running org.apache.jmeter.report.core.CsvSampleReaderTest
    [junit] Tests run: 6, Failures: 0, Errors: 0, Skipped: 0, Time elapsed: 0.02 sec
    [junit] Running org.apache.jmeter.report.core.SampleMetadataTest
    [junit] Tests run: 1, Failures: 0, Errors: 0, Skipped: 0, Time elapsed: 0.002 sec
    [junit] Running org.apache.jmeter.report.core.TestCsvSampleWriter
    [junit] Tests run: 5, Failures: 0, Errors: 0, Skipped: 0, Time elapsed: 0.005 sec
    [junit] Running org.apache.jmeter.report.dashboard.ApdexPerTransactionTest
    [junit] Tests run: 7, Failures: 0, Errors: 0, Skipped: 0, Time elapsed: 0.016 sec
    [junit] Running org.apache.jmeter.report.processor.ErrorsSummaryConsumerTest
    [junit] Tests run: 2, Failures: 0, Errors: 0, Skipped: 0, Time elapsed: 0.005 sec
    [junit] Running org.apache.jmeter.report.processor.FieldSampleComparatorTest
    [junit] Tests run: 1, Failures: 0, Errors: 0, Skipped: 0, Time elapsed: 0.001 sec
    [junit] Running org.apache.jmeter.reporters.TestResultSaver
    [junit] Tests run: 5, Failures: 0, Errors: 0, Skipped: 0, Time elapsed: 0.003 sec
    [junit] Running org.apache.jmeter.resources.PackageTest
    [junit] Tests run: 365, Failures: 0, Errors: 0, Skipped: 0, Time elapsed: 0.718 sec
    [junit] Running org.apache.jmeter.resources.TestPropertiesFiles
    [junit] Tests run: 2, Failures: 0, Errors: 0, Skipped: 0, Time elapsed: 0.003 sec
    [junit] Running org.apache.jmeter.samplers.TestSampleResult
    [junit] Tests run: 16, Failures: 0, Errors: 0, Skipped: 0, Time elapsed: 3.839 sec
    [junit] Running org.apache.jmeter.samplers.TestSampleSaveConfiguration
    [junit] Tests run: 7, Failures: 0, Errors: 0, Skipped: 0, Time elapsed: 0.023 sec
    [junit] Running org.apache.jmeter.save.TestCSVSaveService
    [junit] Tests run: 11, Failures: 0, Errors: 0, Skipped: 0, Time elapsed: 0.008 sec
    [junit] Running org.apache.jmeter.save.TestSaveService
    [junit] Tests run: 5, Failures: 0, Errors: 0, Skipped: 0, Time elapsed: 0.73 sec
    [junit] Running org.apache.jmeter.testbeans.gui.PackageTest
    [junit] Tests run: 384, Failures: 0, Errors: 0, Skipped: 0, Time elapsed: 1.189 sec
    [junit] Running org.apache.jmeter.testbeans.gui.TestBooleanPropertyEditor
    [junit] Tests run: 2, Failures: 0, Errors: 0, Skipped: 0, Time elapsed: 0.003 sec
    [junit] Running org.apache.jmeter.testbeans.gui.TestComboStringEditor
    [junit] Tests run: 2, Failures: 0, Errors: 0, Skipped: 0, Time elapsed: 0.007 sec
    [junit] Running org.apache.jmeter.testbeans.gui.TestFieldStringEditor
    [junit] Tests run: 2, Failures: 0, Errors: 0, Skipped: 0, Time elapsed: 0.01 sec
    [junit] Running org.apache.jmeter.testelement.PackageTest
    [junit] Tests run: 2, Failures: 0, Errors: 0, Skipped: 0, Time elapsed: 0.003 sec
    [junit] Running org.apache.jmeter.testelement.TestElementTest
    [junit] Tests run: 134, Failures: 0, Errors: 0, Skipped: 0, Time elapsed: 0.112 sec
    [junit] Running org.apache.jmeter.testelement.TestHeaderManager
    [junit] Tests run: 2, Failures: 0, Errors: 0, Skipped: 0, Time elapsed: 0.003 sec
    [junit] Running org.apache.jmeter.testelement.TestNumberProperty
    [junit] Tests run: 5, Failures: 0, Errors: 0, Skipped: 0, Time elapsed: 0.002 sec
    [junit] Running org.apache.jmeter.testelement.property.AbstractPropertyTest
    [junit] Tests run: 6, Failures: 0, Errors: 0, Skipped: 0, Time elapsed: 0.008 sec
    [junit] Running org.apache.jmeter.testelement.property.PackageTest
    [junit] Tests run: 11, Failures: 0, Errors: 0, Skipped: 0, Time elapsed: 0.006 sec
    [junit] Running org.apache.jmeter.threads.TestJMeterContextService
    [junit] Tests run: 1, Failures: 0, Errors: 0, Skipped: 0, Time elapsed: 0.002 sec
    [junit] Running org.apache.jmeter.threads.TestJMeterThread
    [junit] Tests run: 2, Failures: 0, Errors: 0, Skipped: 0, Time elapsed: 0.003 sec
    [junit] Running org.apache.jmeter.threads.TestTestCompiler
    [junit] Tests run: 1, Failures: 0, Errors: 0, Skipped: 0, Time elapsed: 0.003 sec
    [junit] Running org.apache.jmeter.threads.TestUnmodifiableJMeterVariables
    [junit] Tests run: 17, Failures: 0, Errors: 0, Skipped: 0, Time elapsed: 0.007 sec
    [junit] Running org.apache.jmeter.timers.ConstantThroughputTimerTest
    [junit] Tests run: 9, Failures: 0, Errors: 0, Skipped: 0, Time elapsed: 0.548 sec
    [junit] Running org.apache.jmeter.timers.poissonarrivals.PreciseThroughputTimerTest
    [junit] Tests run: 2, Failures: 0, Errors: 0, Skipped: 0, Time elapsed: 0.04 sec
    [junit] Running org.apache.jmeter.util.JSR223TestElementTest
    [junit] Tests run: 2, Failures: 0, Errors: 0, Skipped: 0, Time elapsed: 0.008 sec
    [junit] Running org.apache.jmeter.util.PackageTest
    [junit] Tests run: 1, Failures: 0, Errors: 0, Skipped: 0, Time elapsed: 0.011 sec
    [junit] Running org.apache.jmeter.util.StringUtilitiesTest
    [junit] Tests run: 5, Failures: 0, Errors: 0, Skipped: 0, Time elapsed: 0.002 sec
    [junit] Running org.apache.jmeter.util.TestJMeterUtils
    [junit] Tests run: 3, Failures: 0, Errors: 0, Skipped: 0, Time elapsed: 0.002 sec
    [junit] Running org.apache.jmeter.util.XPathUtilTest
    [junit] Tests run: 3, Failures: 0, Errors: 0, Skipped: 0, Time elapsed: 0.008 sec
    [junit] Running org.apache.jmeter.visualizers.TestRenderAsJson
    [junit] Tests run: 6, Failures: 0, Errors: 0, Skipped: 0, Time elapsed: 0.004 sec
    [junit] Running org.apache.jmeter.visualizers.TestSampleCompareTo
    [junit] Tests run: 9, Failures: 0, Errors: 0, Skipped: 0, Time elapsed: 0.013 sec
    [junit] Running org.apache.jmeter.visualizers.TestSamplingStatCalculator
    [junit] Tests run: 2, Failures: 0, Errors: 0, Skipped: 0, Time elapsed: 0.004 sec
    [junit] Running org.apache.jmeter.visualizers.backend.SamplerMetricFixedModeTest
    [junit] Tests run: 3, Failures: 0, Errors: 0, Skipped: 0, Time elapsed: 0.011 sec
    [junit] Running org.apache.jmeter.visualizers.backend.SamplerMetricTimedModeTest
    [junit] Tests run: 2, Failures: 0, Errors: 0, Skipped: 0, Time elapsed: 0.003 sec
    [junit] Running org.apache.jorphan.TestFunctorUsers
    [junit] Tests run: 7, Failures: 0, Errors: 0, Skipped: 0, Time elapsed: 0.033 sec
    [junit] Running org.apache.jorphan.TestXMLBuffer
    [junit] Tests run: 4, Failures: 0, Errors: 0, Skipped: 0, Time elapsed: 0.012 sec
    [junit] Running org.apache.jorphan.collections.PackageTest
    [junit] Tests run: 5, Failures: 0, Errors: 0, Skipped: 0, Time elapsed: 0.002 sec
    [junit] Running org.apache.jorphan.exec.TestKeyToolUtils
    [junit] Tests run: 1, Failures: 0, Errors: 0, Skipped: 0, Time elapsed: 0.002 sec
    [junit] Running org.apache.jorphan.gui.ObjectTableModelTest
    [junit] Tests run: 6, Failures: 0, Errors: 0, Skipped: 0, Time elapsed: 0.014 sec
    [junit] Running org.apache.jorphan.gui.ObjectTableSorterTest
    [junit] Tests run: 26, Failures: 0, Errors: 0, Skipped: 0, Time elapsed: 0.024 sec
    [junit] Running org.apache.jorphan.math.TestStatCalculator
    [junit] Tests run: 10, Failures: 0, Errors: 0, Skipped: 2, Time elapsed: 0.008 sec
    [junit] Running org.apache.jorphan.reflect.TestClassFinder
    [junit] Tests run: 10, Failures: 0, Errors: 0, Skipped: 0, Time elapsed: 17.111 sec
    [junit] Running org.apache.jorphan.reflect.TestClassTools
    [junit] Tests run: 4, Failures: 0, Errors: 0, Skipped: 0, Time elapsed: 0.006 sec
    [junit] Running org.apache.jorphan.reflect.TestFunctor
    [junit] Tests run: 6, Failures: 0, Errors: 0, Skipped: 0, Time elapsed: 0.007 sec
    [junit] Running org.apache.jorphan.util.TestConverter
    [junit] Tests run: 8, Failures: 0, Errors: 0, Skipped: 0, Time elapsed: 0.015 sec
    [junit] Running org.apache.jorphan.util.TestJorphanUtils
    [junit] Tests run: 40, Failures: 0, Errors: 0, Skipped: 0, Time elapsed: 0.014 sec

nightlysonar:

checkstyle:

_process_checkstyle_jars:

_check_exists:

_check_jarfile:
[checkstyle] Running Checkstyle 8.8 on 1681 files
[checkstyle] [ERROR] <https://builds.apache.org/job/JMeter-trunk/ws/trunk/src/protocol/http/org/apache/jmeter/protocol/http/sampler/HTTPHC4Impl.java>:693:5:
Return count is 10 (max allowed for non-void methods/lambdas is 9). [ReturnCount]
[checkstyle] [ERROR] <https://builds.apache.org/job/JMeter-trunk/ws/trunk/src/protocol/http/org/apache/jmeter/protocol/http/sampler/HTTPSamplerBase.java>:425:16:
Unnecessary parentheses around return value. [UnnecessaryParentheses]
[checkstyle] [ERROR] <https://builds.apache.org/job/JMeter-trunk/ws/trunk/test/src/org/apache/jmeter/protocol/http/sampler/PostWriterTest.java>:22:
Wrong order for 'org.junit.Assert.assertEquals' import. [ImportOrder]

BUILD FAILED
<https://builds.apache.org/job/JMeter-trunk/ws/trunk/build.xml>:3584: Got 3 errors and
0 warnings.

Total time: 14 minutes 17 seconds
Build step 'Invoke Ant' marked build as failure
[locks-and-latches] Releasing all the locks
[locks-and-latches] All the locks released
Archiving artifacts
[Fast Archiver] Compressed 126.40 MB of artifacts by 28.2% relative to #6740
Recording test results

Mime
View raw message