jmeter-dev mailing list archives

Site index · List index
Message view « Date » · « Thread »
Top « Date » · « Thread »
From Apache Jenkins Server <jenk...@builds.apache.org>
Subject Build failed in Jenkins: JMeter-trunk #6613
Date Mon, 22 Jan 2018 21:59:55 GMT
See <https://builds.apache.org/job/JMeter-trunk/6613/display/redirect?page=changes>

Changes:

[pmouawad] Specialize config builder to use some configuration related to Conditional Comments

------------------------------------------
[...truncated 272.49 KB...]
     [java] 	at org.junit.runners.ParentRunner$2.evaluate(ParentRunner.java:268)
     [java] 	at org.junit.runners.ParentRunner.run(ParentRunner.java:363)
     [java] 	at org.junit.runner.JUnitCore.run(JUnitCore.java:137)
     [java] 	at org.junit.runner.JUnitCore.run(JUnitCore.java:115)
     [java] 	at org.apache.jorphan.test.AllTests.main(AllTests.java:218)
     [java] Caused by: java.lang.NullPointerException
     [java] 	at org.apache.jmeter.protocol.http.parser.LagartoBasedHtmlParser.getEmbeddedResourceURLs(LagartoBasedHtmlParser.java:218)
     [java] 	... 30 more
     [java] 39) testParserList(org.apache.jmeter.protocol.http.parser.TestHTMLParser)
     [java] org.apache.jmeter.protocol.http.parser.HTMLParseException: java.lang.NullPointerException
     [java] 	at org.apache.jmeter.protocol.http.parser.LagartoBasedHtmlParser.getEmbeddedResourceURLs(LagartoBasedHtmlParser.java:230)
     [java] 	at org.apache.jmeter.protocol.http.parser.HTMLParser.getEmbeddedResourceURLs(HTMLParser.java:182)
     [java] 	at org.apache.jmeter.protocol.http.parser.TestHTMLParser.filetest(TestHTMLParser.java:388)
     [java] 	at org.apache.jmeter.protocol.http.parser.TestHTMLParser.testParserList(TestHTMLParser.java:356)
     [java] 	at sun.reflect.GeneratedMethodAccessor115.invoke(Unknown Source)
     [java] 	at sun.reflect.DelegatingMethodAccessorImpl.invoke(DelegatingMethodAccessorImpl.java:43)
     [java] 	at java.lang.reflect.Method.invoke(Method.java:498)
     [java] 	at junit.framework.TestCase.runTest(TestCase.java:176)
     [java] 	at junit.framework.TestCase.runBare(TestCase.java:141)
     [java] 	at junit.framework.TestResult$1.protect(TestResult.java:122)
     [java] 	at junit.framework.TestResult.runProtected(TestResult.java:142)
     [java] 	at junit.framework.TestResult.run(TestResult.java:125)
     [java] 	at junit.framework.TestCase.run(TestCase.java:129)
     [java] 	at junit.framework.TestSuite.runTest(TestSuite.java:252)
     [java] 	at junit.framework.TestSuite.run(TestSuite.java:247)
     [java] 	at junit.framework.TestSuite.runTest(TestSuite.java:252)
     [java] 	at junit.framework.TestSuite.run(TestSuite.java:247)
     [java] 	at junit.framework.TestSuite.runTest(TestSuite.java:252)
     [java] 	at junit.framework.TestSuite.run(TestSuite.java:247)
     [java] 	at org.junit.internal.runners.JUnit38ClassRunner.run(JUnit38ClassRunner.java:86)
     [java] 	at org.junit.runners.Suite.runChild(Suite.java:128)
     [java] 	at org.junit.runners.Suite.runChild(Suite.java:27)
     [java] 	at org.junit.runners.ParentRunner$3.run(ParentRunner.java:290)
     [java] 	at org.junit.runners.ParentRunner$1.schedule(ParentRunner.java:71)
     [java] 	at org.junit.runners.ParentRunner.runChildren(ParentRunner.java:288)
     [java] 	at org.junit.runners.ParentRunner.access$000(ParentRunner.java:58)
     [java] 	at org.junit.runners.ParentRunner$2.evaluate(ParentRunner.java:268)
     [java] 	at org.junit.runners.ParentRunner.run(ParentRunner.java:363)
     [java] 	at org.junit.runner.JUnitCore.run(JUnitCore.java:137)
     [java] 	at org.junit.runner.JUnitCore.run(JUnitCore.java:115)
     [java] 	at org.apache.jorphan.test.AllTests.main(AllTests.java:218)
     [java] Caused by: java.lang.NullPointerException
     [java] 	at org.apache.jmeter.protocol.http.parser.LagartoBasedHtmlParser.getEmbeddedResourceURLs(LagartoBasedHtmlParser.java:218)
     [java] 	... 30 more
     [java] 40) testParserSet(org.apache.jmeter.protocol.http.parser.TestHTMLParser)
     [java] org.apache.jmeter.protocol.http.parser.HTMLParseException: java.lang.NullPointerException
     [java] 	at org.apache.jmeter.protocol.http.parser.LagartoBasedHtmlParser.getEmbeddedResourceURLs(LagartoBasedHtmlParser.java:230)
     [java] 	at org.apache.jmeter.protocol.http.parser.HTMLParser.getEmbeddedResourceURLs(HTMLParser.java:113)
     [java] 	at org.apache.jmeter.protocol.http.parser.TestHTMLParser.filetest(TestHTMLParser.java:386)
     [java] 	at org.apache.jmeter.protocol.http.parser.TestHTMLParser.testParserSet(TestHTMLParser.java:350)
     [java] 	at sun.reflect.GeneratedMethodAccessor114.invoke(Unknown Source)
     [java] 	at sun.reflect.DelegatingMethodAccessorImpl.invoke(DelegatingMethodAccessorImpl.java:43)
     [java] 	at java.lang.reflect.Method.invoke(Method.java:498)
     [java] 	at junit.framework.TestCase.runTest(TestCase.java:176)
     [java] 	at junit.framework.TestCase.runBare(TestCase.java:141)
     [java] 	at junit.framework.TestResult$1.protect(TestResult.java:122)
     [java] 	at junit.framework.TestResult.runProtected(TestResult.java:142)
     [java] 	at junit.framework.TestResult.run(TestResult.java:125)
     [java] 	at junit.framework.TestCase.run(TestCase.java:129)
     [java] 	at junit.framework.TestSuite.runTest(TestSuite.java:252)
     [java] 	at junit.framework.TestSuite.run(TestSuite.java:247)
     [java] 	at junit.framework.TestSuite.runTest(TestSuite.java:252)
     [java] 	at junit.framework.TestSuite.run(TestSuite.java:247)
     [java] 	at junit.framework.TestSuite.runTest(TestSuite.java:252)
     [java] 	at junit.framework.TestSuite.run(TestSuite.java:247)
     [java] 	at org.junit.internal.runners.JUnit38ClassRunner.run(JUnit38ClassRunner.java:86)
     [java] 	at org.junit.runners.Suite.runChild(Suite.java:128)
     [java] 	at org.junit.runners.Suite.runChild(Suite.java:27)
     [java] 	at org.junit.runners.ParentRunner$3.run(ParentRunner.java:290)
     [java] 	at org.junit.runners.ParentRunner$1.schedule(ParentRunner.java:71)
     [java] 	at org.junit.runners.ParentRunner.runChildren(ParentRunner.java:288)
     [java] 	at org.junit.runners.ParentRunner.access$000(ParentRunner.java:58)
     [java] 	at org.junit.runners.ParentRunner$2.evaluate(ParentRunner.java:268)
     [java] 	at org.junit.runners.ParentRunner.run(ParentRunner.java:363)
     [java] 	at org.junit.runner.JUnitCore.run(JUnitCore.java:137)
     [java] 	at org.junit.runner.JUnitCore.run(JUnitCore.java:115)
     [java] 	at org.apache.jorphan.test.AllTests.main(AllTests.java:218)
     [java] Caused by: java.lang.NullPointerException
     [java] 	at org.apache.jmeter.protocol.http.parser.LagartoBasedHtmlParser.getEmbeddedResourceURLs(LagartoBasedHtmlParser.java:218)
     [java] 	... 30 more
     [java] 41) testParserList(org.apache.jmeter.protocol.http.parser.TestHTMLParser)
     [java] org.apache.jmeter.protocol.http.parser.HTMLParseException: java.lang.NullPointerException
     [java] 	at org.apache.jmeter.protocol.http.parser.LagartoBasedHtmlParser.getEmbeddedResourceURLs(LagartoBasedHtmlParser.java:230)
     [java] 	at org.apache.jmeter.protocol.http.parser.HTMLParser.getEmbeddedResourceURLs(HTMLParser.java:182)
     [java] 	at org.apache.jmeter.protocol.http.parser.TestHTMLParser.filetest(TestHTMLParser.java:388)
     [java] 	at org.apache.jmeter.protocol.http.parser.TestHTMLParser.testParserList(TestHTMLParser.java:356)
     [java] 	at sun.reflect.GeneratedMethodAccessor115.invoke(Unknown Source)
     [java] 	at sun.reflect.DelegatingMethodAccessorImpl.invoke(DelegatingMethodAccessorImpl.java:43)
     [java] 	at java.lang.reflect.Method.invoke(Method.java:498)
     [java] 	at junit.framework.TestCase.runTest(TestCase.java:176)
     [java] 	at junit.framework.TestCase.runBare(TestCase.java:141)
     [java] 	at junit.framework.TestResult$1.protect(TestResult.java:122)
     [java] 	at junit.framework.TestResult.runProtected(TestResult.java:142)
     [java] 	at junit.framework.TestResult.run(TestResult.java:125)
     [java] 	at junit.framework.TestCase.run(TestCase.java:129)
     [java] 	at junit.framework.TestSuite.runTest(TestSuite.java:252)
     [java] 	at junit.framework.TestSuite.run(TestSuite.java:247)
     [java] 	at junit.framework.TestSuite.runTest(TestSuite.java:252)
     [java] 	at junit.framework.TestSuite.run(TestSuite.java:247)
     [java] 	at junit.framework.TestSuite.runTest(TestSuite.java:252)
     [java] 	at junit.framework.TestSuite.run(TestSuite.java:247)
     [java] 	at org.junit.internal.runners.JUnit38ClassRunner.run(JUnit38ClassRunner.java:86)
     [java] 	at org.junit.runners.Suite.runChild(Suite.java:128)
     [java] 	at org.junit.runners.Suite.runChild(Suite.java:27)
     [java] 	at org.junit.runners.ParentRunner$3.run(ParentRunner.java:290)
     [java] 	at org.junit.runners.ParentRunner$1.schedule(ParentRunner.java:71)
     [java] 	at org.junit.runners.ParentRunner.runChildren(ParentRunner.java:288)
     [java] 	at org.junit.runners.ParentRunner.access$000(ParentRunner.java:58)
     [java] 	at org.junit.runners.ParentRunner$2.evaluate(ParentRunner.java:268)
     [java] 	at org.junit.runners.ParentRunner.run(ParentRunner.java:363)
     [java] 	at org.junit.runner.JUnitCore.run(JUnitCore.java:137)
     [java] 	at org.junit.runner.JUnitCore.run(JUnitCore.java:115)
     [java] 	at org.apache.jorphan.test.AllTests.main(AllTests.java:218)
     [java] Caused by: java.lang.NullPointerException
     [java] 	at org.apache.jmeter.protocol.http.parser.LagartoBasedHtmlParser.getEmbeddedResourceURLs(LagartoBasedHtmlParser.java:218)
     [java] 	... 30 more
     [java] 42) testSpecificParserList(org.apache.jmeter.protocol.http.parser.TestHTMLParser)
     [java] org.apache.jmeter.protocol.http.parser.HTMLParseException: java.lang.NullPointerException
     [java] 	at org.apache.jmeter.protocol.http.parser.LagartoBasedHtmlParser.getEmbeddedResourceURLs(LagartoBasedHtmlParser.java:230)
     [java] 	at org.apache.jmeter.protocol.http.parser.HTMLParser.getEmbeddedResourceURLs(HTMLParser.java:182)
     [java] 	at org.apache.jmeter.protocol.http.parser.TestHTMLParser.filetest(TestHTMLParser.java:388)
     [java] 	at org.apache.jmeter.protocol.http.parser.TestHTMLParser.testSpecificParserList(TestHTMLParser.java:362)
     [java] 	at sun.reflect.NativeMethodAccessorImpl.invoke0(Native Method)
     [java] 	at sun.reflect.NativeMethodAccessorImpl.invoke(NativeMethodAccessorImpl.java:62)
     [java] 	at sun.reflect.DelegatingMethodAccessorImpl.invoke(DelegatingMethodAccessorImpl.java:43)
     [java] 	at java.lang.reflect.Method.invoke(Method.java:498)
     [java] 	at junit.framework.TestCase.runTest(TestCase.java:176)
     [java] 	at junit.framework.TestCase.runBare(TestCase.java:141)
     [java] 	at junit.framework.TestResult$1.protect(TestResult.java:122)
     [java] 	at junit.framework.TestResult.runProtected(TestResult.java:142)
     [java] 	at junit.framework.TestResult.run(TestResult.java:125)
     [java] 	at junit.framework.TestCase.run(TestCase.java:129)
     [java] 	at junit.framework.TestSuite.runTest(TestSuite.java:252)
     [java] 	at junit.framework.TestSuite.run(TestSuite.java:247)
     [java] 	at junit.framework.TestSuite.runTest(TestSuite.java:252)
     [java] 	at junit.framework.TestSuite.run(TestSuite.java:247)
     [java] 	at junit.framework.TestSuite.runTest(TestSuite.java:252)
     [java] 	at junit.framework.TestSuite.run(TestSuite.java:247)
     [java] 	at org.junit.internal.runners.JUnit38ClassRunner.run(JUnit38ClassRunner.java:86)
     [java] 	at org.junit.runners.Suite.runChild(Suite.java:128)
     [java] 	at org.junit.runners.Suite.runChild(Suite.java:27)
     [java] 	at org.junit.runners.ParentRunner$3.run(ParentRunner.java:290)
     [java] 	at org.junit.runners.ParentRunner$1.schedule(ParentRunner.java:71)
     [java] 	at org.junit.runners.ParentRunner.runChildren(ParentRunner.java:288)
     [java] 	at org.junit.runners.ParentRunner.access$000(ParentRunner.java:58)
     [java] 	at org.junit.runners.ParentRunner$2.evaluate(ParentRunner.java:268)
     [java] 	at org.junit.runners.ParentRunner.run(ParentRunner.java:363)
     [java] 	at org.junit.runner.JUnitCore.run(JUnitCore.java:137)
     [java] 	at org.junit.runner.JUnitCore.run(JUnitCore.java:115)
     [java] 	at org.apache.jorphan.test.AllTests.main(AllTests.java:218)
     [java] Caused by: java.lang.NullPointerException
     [java] 	at org.apache.jmeter.protocol.http.parser.LagartoBasedHtmlParser.getEmbeddedResourceURLs(LagartoBasedHtmlParser.java:218)
     [java] 	... 31 more
     [java] 43) testSpecificParserList(org.apache.jmeter.protocol.http.parser.TestHTMLParser)
     [java] org.apache.jmeter.protocol.http.parser.HTMLParseException: java.lang.NullPointerException
     [java] 	at org.apache.jmeter.protocol.http.parser.LagartoBasedHtmlParser.getEmbeddedResourceURLs(LagartoBasedHtmlParser.java:230)
     [java] 	at org.apache.jmeter.protocol.http.parser.HTMLParser.getEmbeddedResourceURLs(HTMLParser.java:182)
     [java] 	at org.apache.jmeter.protocol.http.parser.TestHTMLParser.filetest(TestHTMLParser.java:388)
     [java] 	at org.apache.jmeter.protocol.http.parser.TestHTMLParser.testSpecificParserList(TestHTMLParser.java:362)
     [java] 	at sun.reflect.NativeMethodAccessorImpl.invoke0(Native Method)
     [java] 	at sun.reflect.NativeMethodAccessorImpl.invoke(NativeMethodAccessorImpl.java:62)
     [java] 	at sun.reflect.DelegatingMethodAccessorImpl.invoke(DelegatingMethodAccessorImpl.java:43)
     [java] 	at java.lang.reflect.Method.invoke(Method.java:498)
     [java] 	at junit.framework.TestCase.runTest(TestCase.java:176)
     [java] 	at junit.framework.TestCase.runBare(TestCase.java:141)
     [java] 	at junit.framework.TestResult$1.protect(TestResult.java:122)
     [java] 	at junit.framework.TestResult.runProtected(TestResult.java:142)
     [java] 	at junit.framework.TestResult.run(TestResult.java:125)
     [java] 	at junit.framework.TestCase.run(TestCase.java:129)
     [java] 	at junit.framework.TestSuite.runTest(TestSuite.java:252)
     [java] 	at junit.framework.TestSuite.run(TestSuite.java:247)
     [java] 	at junit.framework.TestSuite.runTest(TestSuite.java:252)
     [java] 	at junit.framework.TestSuite.run(TestSuite.java:247)
     [java] 	at junit.framework.TestSuite.runTest(TestSuite.java:252)
     [java] 	at junit.framework.TestSuite.run(TestSuite.java:247)
     [java] 	at org.junit.internal.runners.JUnit38ClassRunner.run(JUnit38ClassRunner.java:86)
     [java] 	at org.junit.runners.Suite.runChild(Suite.java:128)
     [java] 	at org.junit.runners.Suite.runChild(Suite.java:27)
     [java] 	at org.junit.runners.ParentRunner$3.run(ParentRunner.java:290)
     [java] 	at org.junit.runners.ParentRunner$1.schedule(ParentRunner.java:71)
     [java] 	at org.junit.runners.ParentRunner.runChildren(ParentRunner.java:288)
     [java] 	at org.junit.runners.ParentRunner.access$000(ParentRunner.java:58)
     [java] 	at org.junit.runners.ParentRunner$2.evaluate(ParentRunner.java:268)
     [java] 	at org.junit.runners.ParentRunner.run(ParentRunner.java:363)
     [java] 	at org.junit.runner.JUnitCore.run(JUnitCore.java:137)
     [java] 	at org.junit.runner.JUnitCore.run(JUnitCore.java:115)
     [java] 	at org.apache.jorphan.test.AllTests.main(AllTests.java:218)
     [java] Caused by: java.lang.NullPointerException
     [java] 	at org.apache.jmeter.protocol.http.parser.LagartoBasedHtmlParser.getEmbeddedResourceURLs(LagartoBasedHtmlParser.java:218)
     [java] 	... 31 more
     [java] 44) testSpecificParserList(org.apache.jmeter.protocol.http.parser.TestHTMLParser)
     [java] org.apache.jmeter.protocol.http.parser.HTMLParseException: java.lang.NullPointerException
     [java] 	at org.apache.jmeter.protocol.http.parser.LagartoBasedHtmlParser.getEmbeddedResourceURLs(LagartoBasedHtmlParser.java:230)
     [java] 	at org.apache.jmeter.protocol.http.parser.HTMLParser.getEmbeddedResourceURLs(HTMLParser.java:182)
     [java] 	at org.apache.jmeter.protocol.http.parser.TestHTMLParser.filetest(TestHTMLParser.java:388)
     [java] 	at org.apache.jmeter.protocol.http.parser.TestHTMLParser.testSpecificParserList(TestHTMLParser.java:362)
     [java] 	at sun.reflect.NativeMethodAccessorImpl.invoke0(Native Method)
     [java] 	at sun.reflect.NativeMethodAccessorImpl.invoke(NativeMethodAccessorImpl.java:62)
     [java] 	at sun.reflect.DelegatingMethodAccessorImpl.invoke(DelegatingMethodAccessorImpl.java:43)
     [java] 	at java.lang.reflect.Method.invoke(Method.java:498)
     [java] 	at junit.framework.TestCase.runTest(TestCase.java:176)
     [java] 	at junit.framework.TestCase.runBare(TestCase.java:141)
     [java] 	at junit.framework.TestResult$1.protect(TestResult.java:122)
     [java] 	at junit.framework.TestResult.runProtected(TestResult.java:142)
     [java] 	at junit.framework.TestResult.run(TestResult.java:125)
     [java] 	at junit.framework.TestCase.run(TestCase.java:129)
     [java] 	at junit.framework.TestSuite.runTest(TestSuite.java:252)
     [java] 	at junit.framework.TestSuite.run(TestSuite.java:247)
     [java] 	at junit.framework.TestSuite.runTest(TestSuite.java:252)
     [java] 	at junit.framework.TestSuite.run(TestSuite.java:247)
     [java] 	at junit.framework.TestSuite.runTest(TestSuite.java:252)
     [java] 	at junit.framework.TestSuite.run(TestSuite.java:247)
     [java] 	at org.junit.internal.runners.JUnit38ClassRunner.run(JUnit38ClassRunner.java:86)
     [java] 	at org.junit.runners.Suite.runChild(Suite.java:128)
     [java] 	at org.junit.runners.Suite.runChild(Suite.java:27)
     [java] 	at org.junit.runners.ParentRunner$3.run(ParentRunner.java:290)
     [java] 	at org.junit.runners.ParentRunner$1.schedule(ParentRunner.java:71)
     [java] 	at org.junit.runners.ParentRunner.runChildren(ParentRunner.java:288)
     [java] 	at org.junit.runners.ParentRunner.access$000(ParentRunner.java:58)
     [java] 	at org.junit.runners.ParentRunner$2.evaluate(ParentRunner.java:268)
     [java] 	at org.junit.runners.ParentRunner.run(ParentRunner.java:363)
     [java] 	at org.junit.runner.JUnitCore.run(JUnitCore.java:137)
     [java] 	at org.junit.runner.JUnitCore.run(JUnitCore.java:115)
     [java] 	at org.apache.jorphan.test.AllTests.main(AllTests.java:218)
     [java] Caused by: java.lang.NullPointerException
     [java] 	at org.apache.jmeter.protocol.http.parser.LagartoBasedHtmlParser.getEmbeddedResourceURLs(LagartoBasedHtmlParser.java:218)
     [java] 	... 31 more
     [java] 
     [java] FAILURES!!!
     [java] Tests run: 3211,  Failures: 44
     [java] 
     [java] ................................................
     [java] Time: 4.406
     [java] 
     [java] OK (48 tests)
     [java] 

BUILD FAILED
<https://builds.apache.org/job/JMeter-trunk/ws/trunk/build.xml>:3045: Java returned:
1

Total time: 2 minutes 26 seconds
Build step 'Invoke Ant' marked build as failure
[locks-and-latches] Releasing all the locks
[locks-and-latches] All the locks released
Archiving artifacts
Recording test results
ERROR: Step ?Publish JUnit test result report? failed: Test reports were found but none of
them are new. Did leafNodes run? 
For example, <https://builds.apache.org/job/JMeter-trunk/ws/trunk/reports/TEST-org.apache.commons.cli.avalon.ClutilTestCase.xml>
is 8 hr 25 min old


Mime
View raw message