jmeter-dev mailing list archives

Site index · List index
Message view « Date » · « Thread »
Top « Date » · « Thread »
From Apache Jenkins Server <jenk...@builds.apache.org>
Subject Build failed in Jenkins: JMeter-trunk #6530
Date Thu, 07 Dec 2017 22:59:49 GMT
See <https://builds.apache.org/job/JMeter-trunk/6530/display/redirect?page=changes>

Changes:

[agomes] Bug 61785 - add release notes in useful links

[pmouawad] Revert commit r1817421

[agomes] Bug 61785 - fix comments

[agomes] Bug 61872 - Better labels in dynamic HTML report

------------------------------------------
[...truncated 142.92 KB...]
  [javadoc] Loading source files for package org.apache.jmeter.thinktime...
  [javadoc] Loading source files for package org.apache.jmeter.validation...
  [javadoc] Loading source files for package org.apache.jmeter.visualizers.backend.graphite...
  [javadoc] Loading source files for package org.apache.jmeter.visualizers.backend.influxdb...
  [javadoc] Loading source files for package org.apache.jmeter.visualizers.utils...
  [javadoc] Loading source files for package org.apache.jmeter.protocol.http.config...
  [javadoc] Loading source files for package org.apache.jmeter.protocol.http.config.gui...
  [javadoc] Loading source files for package org.apache.jmeter.protocol.http.control...
  [javadoc] Loading source files for package org.apache.jmeter.protocol.http.control.gui...
  [javadoc] Loading source files for package org.apache.jmeter.protocol.http.gui...
  [javadoc] Loading source files for package org.apache.jmeter.protocol.http.modifier...
  [javadoc] Loading source files for package org.apache.jmeter.protocol.http.modifier.gui...
  [javadoc] Loading source files for package org.apache.jmeter.protocol.http.parser...
  [javadoc] Loading source files for package org.apache.jmeter.protocol.http.proxy...
  [javadoc] Loading source files for package org.apache.jmeter.protocol.http.proxy.gui...
  [javadoc] Loading source files for package org.apache.jmeter.protocol.http.sampler...
  [javadoc] Loading source files for package org.apache.jmeter.protocol.http.sampler.hc...
  [javadoc] Loading source files for package org.apache.jmeter.protocol.http.util...
  [javadoc] Loading source files for package org.apache.jmeter.protocol.http.util.accesslog...
  [javadoc] Loading source files for package org.apache.jmeter.protocol.http.visualizers...
  [javadoc] Loading source files for package org.apache.jmeter.protocol.ftp.config.gui...
  [javadoc] Loading source files for package org.apache.jmeter.protocol.ftp.control.gui...
  [javadoc] Loading source files for package org.apache.jmeter.protocol.ftp.sampler...
  [javadoc] Loading source files for package org.apache.jmeter.protocol.jdbc...
  [javadoc] Loading source files for package org.apache.jmeter.protocol.jdbc.config...
  [javadoc] Loading source files for package org.apache.jmeter.protocol.jdbc.processor...
  [javadoc] Loading source files for package org.apache.jmeter.protocol.jdbc.sampler...
  [javadoc] Loading source files for package org.apache.jmeter.protocol.java.config...
  [javadoc] Loading source files for package org.apache.jmeter.protocol.java.config.gui...
  [javadoc] Loading source files for package org.apache.jmeter.protocol.java.control.gui...
  [javadoc] Loading source files for package org.apache.jmeter.protocol.java.sampler...
  [javadoc] Loading source files for package org.apache.jmeter.protocol.java.test...
  [javadoc] Loading source files for package org.apache.jorphan.collections...
  [javadoc] Loading source files for package org.apache.jorphan.exec...
  [javadoc] Loading source files for package org.apache.jorphan.gui...
  [javadoc] Loading source files for package org.apache.jorphan.gui.layout...
  [javadoc] Loading source files for package org.apache.jorphan.io...
  [javadoc] Loading source files for package org.apache.jorphan.logging...
  [javadoc] Loading source files for package org.apache.jorphan.math...
  [javadoc] Loading source files for package org.apache.jorphan.reflect...
  [javadoc] Loading source files for package org.apache.jorphan.test...
  [javadoc] Loading source files for package org.apache.jorphan.util...
  [javadoc] Loading source files for package org.apache.jmeter.protocol.ldap.config.gui...
  [javadoc] Loading source files for package org.apache.jmeter.protocol.ldap.control.gui...
  [javadoc] Loading source files for package org.apache.jmeter.protocol.ldap.sampler...
  [javadoc] Loading source files for package org.apache.jmeter.protocol.tcp.config.gui...
  [javadoc] Loading source files for package org.apache.jmeter.protocol.tcp.control.gui...
  [javadoc] Loading source files for package org.apache.jmeter.protocol.tcp.sampler...
  [javadoc] Loading source files for package org.apache.jmeter.examples.sampler...
  [javadoc] Loading source files for package org.apache.jmeter.examples.sampler.gui...
  [javadoc] Loading source files for package org.apache.jmeter.examples.testbeans.example1...
  [javadoc] Loading source files for package org.apache.jmeter.examples.testbeans.example2...
  [javadoc] Loading source files for package org.apache.jmeter.examples.testbeans.example3...
  [javadoc] Loading source files for package org.apache.jmeter.protocol.mail.sampler...
  [javadoc] Loading source files for package org.apache.jmeter.protocol.mail.sampler.gui...
  [javadoc] Loading source files for package org.apache.jmeter.protocol.smtp.sampler...
  [javadoc] Loading source files for package org.apache.jmeter.protocol.smtp.sampler.gui...
  [javadoc] Loading source files for package org.apache.jmeter.protocol.smtp.sampler.protocol...
  [javadoc] Loading source files for package org.apache.jmeter.protocol.jms...
  [javadoc] Loading source files for package org.apache.jmeter.protocol.jms.client...
  [javadoc] Loading source files for package org.apache.jmeter.protocol.jms.control.gui...
  [javadoc] Loading source files for package org.apache.jmeter.protocol.jms.sampler...
  [javadoc] Loading source files for package org.apache.jmeter.protocol.jms.sampler.render...
  [javadoc] Loading source files for package org.apache.jmeter.protocol.system...
  [javadoc] Loading source files for package org.apache.jmeter.protocol.system.gui...
  [javadoc] Loading source files for package org.apache.jmeter.protocol.mongodb.config...
  [javadoc] Loading source files for package org.apache.jmeter.protocol.mongodb.mongo...
  [javadoc] Loading source files for package org.apache.jmeter.protocol.mongodb.sampler...
  [javadoc] Constructing Javadoc information...
  [javadoc] Standard Doclet version 1.8.0_152
  [javadoc] Building tree for all the packages and classes...
  [javadoc] <https://builds.apache.org/job/JMeter-trunk/ws/trunk/src/components/org/apache/jmeter/extractor/BoundaryExtractor.java>:234:
warning: no description for @param
  [javadoc]      * @param leftBoundary
  [javadoc]        ^
  [javadoc] <https://builds.apache.org/job/JMeter-trunk/ws/trunk/src/components/org/apache/jmeter/extractor/BoundaryExtractor.java>:235:
warning: no description for @param
  [javadoc]      * @param rightBoundary
  [javadoc]        ^
  [javadoc] <https://builds.apache.org/job/JMeter-trunk/ws/trunk/src/components/org/apache/jmeter/extractor/BoundaryExtractor.java>:236:
warning: no description for @param
  [javadoc]      * @param matchNumber
  [javadoc]        ^
  [javadoc] <https://builds.apache.org/job/JMeter-trunk/ws/trunk/src/components/org/apache/jmeter/extractor/BoundaryExtractor.java>:237:
warning: no description for @param
  [javadoc]      * @param inputString
  [javadoc]        ^
  [javadoc] <https://builds.apache.org/job/JMeter-trunk/ws/trunk/src/components/org/apache/jmeter/extractor/BoundaryExtractor.java>:238:
warning: no description for @param
  [javadoc]      * @param result
  [javadoc]        ^
  [javadoc] <https://builds.apache.org/job/JMeter-trunk/ws/trunk/src/components/org/apache/jmeter/extractor/BoundaryExtractor.java>:239:
warning: no description for @param
  [javadoc]      * @param found
  [javadoc]        ^
  [javadoc] Building index for all the packages and classes...
  [javadoc] Building index for all classes...
  [javadoc] Generating <https://builds.apache.org/job/JMeter-trunk/ws/trunk/docs/api/help-doc.html...>
  [javadoc] 6 warnings

compile-tests:
    [javac] Compiling 192 source files to <https://builds.apache.org/job/JMeter-trunk/ws/trunk/build/test>
    [javac] Note: Some input files use or override a deprecated API.
    [javac] Note: Recompile with -Xlint:deprecation for details.
  [groovyc] Compiling 11 source files to <https://builds.apache.org/job/JMeter-trunk/ws/trunk/build/test>

_test:
     [echo] 
     [echo]    gump.run = false
     [echo]    java.awt.headless = true
     [echo]    test.headless = true
     [echo]    user.dir = <https://builds.apache.org/job/JMeter-trunk/ws/trunk>
     [echo]    basedir = <https://builds.apache.org/job/JMeter-trunk/ws/trunk>
     [echo]    test dir = build/test
     [echo]    test dir gump = build/test
     [echo]    testsaveservice.saveout = ${testsaveservice.saveout}
     [echo]    test.encoding = UTF-8
     [echo]     
     [java] SLF4J: Class path contains multiple SLF4J bindings.
     [java] SLF4J: Found binding in [jar:<https://builds.apache.org/job/JMeter-trunk/ws/trunk/lib/log4j-slf4j-impl-2.8.2.jar!/org/slf4j/impl/StaticLoggerBinder.class]>
     [java] SLF4J: Found binding in [jar:<https://builds.apache.org/job/JMeter-trunk/ws/trunk/lib/opt/activemq-all-5.15.2.jar!/org/slf4j/impl/StaticLoggerBinder.class]>
     [java] SLF4J: See http://www.slf4j.org/codes.html#multiple_bindings for an explanation.
     [java] SLF4J: Actual binding is of type [org.apache.logging.slf4j.Log4jLoggerFactory]
     [java] Setting JMeterHome: <https://builds.apache.org/job/JMeter-trunk/ws/trunk>
     [java] Using initializeProperties() from org.apache.jmeter.util.JMeterUtils
     [java] Setting up initial properties using: <https://builds.apache.org/job/JMeter-trunk/ws/trunk/bin/jmeter.properties>
     [java] Initializing Properties: <https://builds.apache.org/job/JMeter-trunk/ws/trunk/bin/jmeter.properties>
     [java] JMeterVersion=r1817434
     [java] java.version=1.8.0_152
     [java] java.home=/usr/local/asfpackages/java/jdk1.8.0_152/jre
     [java] file.encoding=UTF-8
     [java] default encoding=UTF-8
     [java] user.dir=<https://builds.apache.org/job/JMeter-trunk/ws/trunk/bin>
     [java] Locale=en_US
     [java] os.name=Linux
     [java] os.version=4.4.0-98-generic
     [java] JCE max key length = 128
     [java] +++++++++++
     [java] java.awt.headless=true
     [java] java.awt.graphicsenv=sun.awt.X11GraphicsEnvironment
     [java] ------------
     [java] Searching junit tests in : build/test
     [java] Last class=org.apache.jmeter.assertions.gui.XPathAssertionGui
     [java] objects.size=10
     [java] Last error=java.lang.NullPointerException
     [java] java.rmi.server.hostname=null
     [java] asf935.gq1.ygridcore.net/67.195.81.176
     [java] isSiteLocalAddress:false
     [java] isAnyLocalAddress:false
     [java] isLinkLocalAddress:false
     [java] isLoopbackAddress:false
     [java] isMulticastAddress:false
     [java] localhost/127.0.0.1
     [java] isSiteLocalAddress:false
     [java] isAnyLocalAddress:false
     [java] isLinkLocalAddress:false
     [java] isLoopbackAddress:true
     [java] isMulticastAddress:false
     [java] ====================
     [java] asf935.gq1.ygridcore.net/67.195.81.176
     [java] isSiteLocalAddress:false
     [java] isAnyLocalAddress:false
     [java] isLinkLocalAddress:false
     [java] isLoopbackAddress:false
     [java] isMulticastAddress:false
     [java] Security framework of XStream not initialized, XStream is probably vulnerable.
     [java] Security framework of XStream not initialized, XStream is probably vulnerable.
     [java] Security framework of XStream not initialized, XStream is probably vulnerable.
     [java] Security framework of XStream not initialized, XStream is probably vulnerable.
     [java] ...............................................................................................................................................I...........................................................................................................................................................................................................................................................................................................................................................................................................................................................................................................................................................E...................................................................................................................................................................................................................................................................................................................................................................................................................................................................................................................................................................................................................................................................................................................................................................................................................................................................................................................................................................Unnecessary
entry junit_failure_default_code=0001 in org/apache/jmeter/resources/messages_fr.properties
     [java] Unnecessary entry aggregate_report_90=90% in org/apache/jmeter/resources/messages_fr.properties
     [java] Unnecessary entry junit_error_default_code=9999 in org/apache/jmeter/resources/messages_fr.properties
     [java] Unnecessary entry junit_success_default_code=1000 in org/apache/jmeter/resources/messages_fr.properties
     [java] ..................................................................................................................................................................................................................................................................................................................................................................................................................................................................................................................................................................................................................................................................................................................................................I.I.........................................................................
     [java] Time: 25.583
     [java] There was 1 failure:
     [java] 1) initializationError(org.apache.jmeter.junit.JMeterTest)
     [java] java.lang.Exception: Error creating org.apache.jmeter.assertions.gui.XPathAssertionGui
     [java] 	at org.apache.jmeter.junit.JMeterTest.getObjects(JMeterTest.java:488)
     [java] 	at org.apache.jmeter.junit.JMeterTest.suiteGUIComponents(JMeterTest.java:253)
     [java] 	at org.apache.jmeter.junit.JMeterTest.suite(JMeterTest.java:132)
     [java] 	at sun.reflect.NativeMethodAccessorImpl.invoke0(Native Method)
     [java] 	at sun.reflect.NativeMethodAccessorImpl.invoke(NativeMethodAccessorImpl.java:62)
     [java] 	at sun.reflect.DelegatingMethodAccessorImpl.invoke(DelegatingMethodAccessorImpl.java:43)
     [java] 	at java.lang.reflect.Method.invoke(Method.java:498)
     [java] 	at org.junit.internal.runners.SuiteMethod.testFromSuiteMethod(SuiteMethod.java:35)
     [java] 	at org.junit.internal.runners.SuiteMethod.<init>(SuiteMethod.java:24)
     [java] 	at org.junit.internal.builders.SuiteMethodBuilder.runnerForClass(SuiteMethodBuilder.java:11)
     [java] 	at org.junit.runners.model.RunnerBuilder.safeRunnerForClass(RunnerBuilder.java:59)
     [java] 	at org.junit.internal.builders.AllDefaultPossibilitiesBuilder.runnerForClass(AllDefaultPossibilitiesBuilder.java:26)
     [java] 	at org.junit.runner.Computer.getRunner(Computer.java:40)
     [java] 	at org.junit.experimental.ParallelComputer.getRunner(ParallelComputer.java:64)
     [java] 	at org.junit.runner.Computer$1.runnerForClass(Computer.java:31)
     [java] 	at org.junit.runners.model.RunnerBuilder.safeRunnerForClass(RunnerBuilder.java:59)
     [java] 	at org.junit.runners.model.RunnerBuilder.runners(RunnerBuilder.java:101)
     [java] 	at org.junit.runners.model.RunnerBuilder.runners(RunnerBuilder.java:87)
     [java] 	at org.junit.runners.Suite.<init>(Suite.java:81)
     [java] 	at org.junit.runner.Computer.getSuite(Computer.java:28)
     [java] 	at org.junit.experimental.ParallelComputer.getSuite(ParallelComputer.java:57)
     [java] 	at org.junit.runner.Request.classes(Request.java:75)
     [java] 	at org.apache.jorphan.test.AllTests.getParallelTests(AllTests.java:231)
     [java] 	at org.apache.jorphan.test.AllTests.main(AllTests.java:218)
     [java] Caused by: java.lang.NullPointerException
     [java] 	at org.fife.ui.rsyntaxtextarea.RSyntaxTextArea.getFontMetricsForTokenType(RSyntaxTextArea.java:1159)
     [java] 	at org.fife.ui.rsyntaxtextarea.TokenImpl.getWidthUpTo(TokenImpl.java:575)
     [java] 	at org.fife.ui.rsyntaxtextarea.TokenImpl.getWidth(TokenImpl.java:567)
     [java] 	at org.fife.ui.rsyntaxtextarea.RSyntaxUtilities.getTokenListWidth(RSyntaxUtilities.java:1180)
     [java] 	at org.fife.ui.rsyntaxtextarea.RSyntaxUtilities.getTokenListWidth(RSyntaxUtilities.java:1159)
     [java] 	at org.fife.ui.rsyntaxtextarea.SyntaxView.getLineWidth(SyntaxView.java:307)
     [java] 	at org.fife.ui.rsyntaxtextarea.SyntaxView.calculateLongestLine(SyntaxView.java:110)
     [java] 	at org.fife.ui.rsyntaxtextarea.SyntaxView.updateMetrics(SyntaxView.java:903)
     [java] 	at org.fife.ui.rsyntaxtextarea.SyntaxView.updateDamage(SyntaxView.java:825)
     [java] 	at org.fife.ui.rsyntaxtextarea.SyntaxView.changedUpdate(SyntaxView.java:130)
     [java] 	at javax.swing.plaf.basic.BasicTextUI$RootView.changedUpdate(BasicTextUI.java:1638)
     [java] 	at javax.swing.plaf.basic.BasicTextUI$UpdateHandler.changedUpdate(BasicTextUI.java:1899)
     [java] 	at javax.swing.text.AbstractDocument.fireChangedUpdate(AbstractDocument.java:230)
     [java] 	at org.fife.ui.rsyntaxtextarea.RSyntaxDocument.updateLastTokensBelow(RSyntaxDocument.java:618)
     [java] 	at org.fife.ui.rsyntaxtextarea.RSyntaxDocument.fireInsertUpdate(RSyntaxDocument.java:182)
     [java] 	at javax.swing.text.AbstractDocument.handleInsertString(AbstractDocument.java:748)
     [java] 	at javax.swing.text.AbstractDocument.insertString(AbstractDocument.java:707)
     [java] 	at javax.swing.text.PlainDocument.insertString(PlainDocument.java:130)
     [java] 	at javax.swing.text.AbstractDocument.replace(AbstractDocument.java:669)
     [java] 	at javax.swing.text.JTextComponent.setText(JTextComponent.java:1669)
     [java] 	at org.apache.jmeter.gui.util.JSyntaxTextArea.setInitialText(JSyntaxTextArea.java:257)
     [java] 	at org.apache.jmeter.assertions.gui.XPathPanel.setXPath(XPathPanel.java:103)
     [java] 	at org.apache.jmeter.assertions.gui.XPathPanel.setDefaultValues(XPathPanel.java:84)
     [java] 	at org.apache.jmeter.assertions.gui.XPathPanel.init(XPathPanel.java:77)
     [java] 	at org.apache.jmeter.assertions.gui.XPathPanel.<init>(XPathPanel.java:60)
     [java] 	at org.apache.jmeter.assertions.gui.XPathAssertionGui.init(XPathAssertionGui.java:99)
     [java] 	at org.apache.jmeter.assertions.gui.XPathAssertionGui.<init>(XPathAssertionGui.java:41)
     [java] 	at sun.reflect.NativeConstructorAccessorImpl.newInstance0(Native Method)
     [java] 	at sun.reflect.NativeConstructorAccessorImpl.newInstance(NativeConstructorAccessorImpl.java:62)
     [java] 	at sun.reflect.DelegatingConstructorAccessorImpl.newInstance(DelegatingConstructorAccessorImpl.java:45)
     [java] 	at java.lang.reflect.Constructor.newInstance(Constructor.java:423)
     [java] 	at java.lang.Class.newInstance(Class.java:442)
     [java] 	at org.apache.jmeter.junit.JMeterTest.getObjects(JMeterTest.java:456)
     [java] 	... 23 more
     [java] 
     [java] FAILURES!!!
     [java] Tests run: 2409,  Failures: 1
     [java] 
     [java] ................................................
     [java] Time: 4.411
     [java] 
     [java] OK (48 tests)
     [java] 

BUILD FAILED
<https://builds.apache.org/job/JMeter-trunk/ws/trunk/build.xml>:2938: Java returned:
1

Total time: 2 minutes 18 seconds
Build step 'Invoke Ant' marked build as failure
[locks-and-latches] Releasing all the locks
[locks-and-latches] All the locks released
Archiving artifacts

Mime
View raw message