jmeter-dev mailing list archives

Site index · List index
Message view « Date » · « Thread »
Top « Date » · « Thread »
From Apache Jenkins Server <jenk...@builds.apache.org>
Subject Build failed in Jenkins: JMeter-trunk #6556
Date Fri, 22 Dec 2017 20:59:37 GMT
See <https://builds.apache.org/job/JMeter-trunk/6556/display/redirect?page=changes>

Changes:

[pmouawad] Remove useless import

[pmouawad] Add a test to show potential bug

------------------------------------------
[...truncated 142.31 KB...]
  [javadoc] Loading source files for package org.apache.jmeter.extractor.json.jsonpath.gui...
  [javadoc] Loading source files for package org.apache.jmeter.extractor.json.render...
  [javadoc] Loading source files for package org.apache.jmeter.modifiers...
  [javadoc] Loading source files for package org.apache.jmeter.modifiers.gui...
  [javadoc] Loading source files for package org.apache.jmeter.sampler...
  [javadoc] Loading source files for package org.apache.jmeter.sampler.gui...
  [javadoc] Loading source files for package org.apache.jmeter.thinktime...
  [javadoc] Loading source files for package org.apache.jmeter.validation...
  [javadoc] Loading source files for package org.apache.jmeter.visualizers.backend.graphite...
  [javadoc] Loading source files for package org.apache.jmeter.visualizers.backend.influxdb...
  [javadoc] Loading source files for package org.apache.jmeter.visualizers.utils...
  [javadoc] Loading source files for package org.apache.jmeter.protocol.http.config...
  [javadoc] Loading source files for package org.apache.jmeter.protocol.http.config.gui...
  [javadoc] Loading source files for package org.apache.jmeter.protocol.http.control...
  [javadoc] Loading source files for package org.apache.jmeter.protocol.http.control.gui...
  [javadoc] Loading source files for package org.apache.jmeter.protocol.http.gui...
  [javadoc] Loading source files for package org.apache.jmeter.protocol.http.modifier...
  [javadoc] Loading source files for package org.apache.jmeter.protocol.http.modifier.gui...
  [javadoc] Loading source files for package org.apache.jmeter.protocol.http.parser...
  [javadoc] Loading source files for package org.apache.jmeter.protocol.http.proxy...
  [javadoc] Loading source files for package org.apache.jmeter.protocol.http.proxy.gui...
  [javadoc] Loading source files for package org.apache.jmeter.protocol.http.sampler...
  [javadoc] Loading source files for package org.apache.jmeter.protocol.http.sampler.hc...
  [javadoc] Loading source files for package org.apache.jmeter.protocol.http.util...
  [javadoc] Loading source files for package org.apache.jmeter.protocol.http.util.accesslog...
  [javadoc] Loading source files for package org.apache.jmeter.protocol.http.visualizers...
  [javadoc] Loading source files for package org.apache.jmeter.protocol.ftp.config.gui...
  [javadoc] Loading source files for package org.apache.jmeter.protocol.ftp.control.gui...
  [javadoc] Loading source files for package org.apache.jmeter.protocol.ftp.sampler...
  [javadoc] Loading source files for package org.apache.jmeter.protocol.jdbc...
  [javadoc] Loading source files for package org.apache.jmeter.protocol.jdbc.config...
  [javadoc] Loading source files for package org.apache.jmeter.protocol.jdbc.processor...
  [javadoc] Loading source files for package org.apache.jmeter.protocol.jdbc.sampler...
  [javadoc] Loading source files for package org.apache.jmeter.protocol.java.config...
  [javadoc] Loading source files for package org.apache.jmeter.protocol.java.config.gui...
  [javadoc] Loading source files for package org.apache.jmeter.protocol.java.control.gui...
  [javadoc] Loading source files for package org.apache.jmeter.protocol.java.sampler...
  [javadoc] Loading source files for package org.apache.jmeter.protocol.java.test...
  [javadoc] Loading source files for package org.apache.jorphan.collections...
  [javadoc] Loading source files for package org.apache.jorphan.exec...
  [javadoc] Loading source files for package org.apache.jorphan.gui...
  [javadoc] Loading source files for package org.apache.jorphan.gui.layout...
  [javadoc] Loading source files for package org.apache.jorphan.io...
  [javadoc] Loading source files for package org.apache.jorphan.logging...
  [javadoc] Loading source files for package org.apache.jorphan.math...
  [javadoc] Loading source files for package org.apache.jorphan.reflect...
  [javadoc] Loading source files for package org.apache.jorphan.test...
  [javadoc] Loading source files for package org.apache.jorphan.util...
  [javadoc] Loading source files for package org.apache.jmeter.protocol.ldap.config.gui...
  [javadoc] Loading source files for package org.apache.jmeter.protocol.ldap.control.gui...
  [javadoc] Loading source files for package org.apache.jmeter.protocol.ldap.sampler...
  [javadoc] Loading source files for package org.apache.jmeter.protocol.tcp.config.gui...
  [javadoc] Loading source files for package org.apache.jmeter.protocol.tcp.control.gui...
  [javadoc] Loading source files for package org.apache.jmeter.protocol.tcp.sampler...
  [javadoc] Loading source files for package org.apache.jmeter.examples.sampler...
  [javadoc] Loading source files for package org.apache.jmeter.examples.sampler.gui...
  [javadoc] Loading source files for package org.apache.jmeter.examples.testbeans.example1...
  [javadoc] Loading source files for package org.apache.jmeter.examples.testbeans.example2...
  [javadoc] Loading source files for package org.apache.jmeter.examples.testbeans.example3...
  [javadoc] Loading source files for package org.apache.jmeter.protocol.mail.sampler...
  [javadoc] Loading source files for package org.apache.jmeter.protocol.mail.sampler.gui...
  [javadoc] Loading source files for package org.apache.jmeter.protocol.smtp.sampler...
  [javadoc] Loading source files for package org.apache.jmeter.protocol.smtp.sampler.gui...
  [javadoc] Loading source files for package org.apache.jmeter.protocol.smtp.sampler.protocol...
  [javadoc] Loading source files for package org.apache.jmeter.protocol.jms...
  [javadoc] Loading source files for package org.apache.jmeter.protocol.jms.client...
  [javadoc] Loading source files for package org.apache.jmeter.protocol.jms.control.gui...
  [javadoc] Loading source files for package org.apache.jmeter.protocol.jms.sampler...
  [javadoc] Loading source files for package org.apache.jmeter.protocol.jms.sampler.render...
  [javadoc] Loading source files for package org.apache.jmeter.protocol.system...
  [javadoc] Loading source files for package org.apache.jmeter.protocol.system.gui...
  [javadoc] Loading source files for package org.apache.jmeter.protocol.mongodb.config...
  [javadoc] Loading source files for package org.apache.jmeter.protocol.mongodb.mongo...
  [javadoc] Loading source files for package org.apache.jmeter.protocol.mongodb.sampler...
  [javadoc] Constructing Javadoc information...
  [javadoc] Standard Doclet version 1.8.0_152
  [javadoc] Building tree for all the packages and classes...
  [javadoc] <https://builds.apache.org/job/JMeter-trunk/ws/trunk/src/components/org/apache/jmeter/assertions/ResponseAssertion.java>:44:
error: reference not found
  [javadoc]  * See {@link AssertionGui} for GUI.
  [javadoc]               ^
  [javadoc] <https://builds.apache.org/job/JMeter-trunk/ws/trunk/src/core/org/apache/jmeter/gui/GuiPackage.java>:981:
warning: no description for @param
  [javadoc]      * @param listener
  [javadoc]        ^
  [javadoc] <https://builds.apache.org/job/JMeter-trunk/ws/trunk/src/core/org/apache/jmeter/gui/GuiPackage.java>:989:
warning: no description for @param
  [javadoc]      * @param listener
  [javadoc]        ^
  [javadoc] <https://builds.apache.org/job/JMeter-trunk/ws/trunk/src/core/org/apache/jmeter/threads/JMeterContext.java>:150:
warning: no @param for threadNum
  [javadoc]     public void setThreadNum(int threadNum) {
  [javadoc]                 ^
  [javadoc] <https://builds.apache.org/job/JMeter-trunk/ws/trunk/src/core/org/apache/jmeter/threads/JMeterContext.java>:161:
warning: no @param for thread
  [javadoc]     public void setThread(JMeterThread thread) {
  [javadoc]                 ^
  [javadoc] <https://builds.apache.org/job/JMeter-trunk/ws/trunk/src/core/org/apache/jmeter/threads/JMeterContext.java>:172:
warning: no @param for threadgrp
  [javadoc]     public void setThreadGroup(AbstractThreadGroup threadgrp) {
  [javadoc]                 ^
  [javadoc] <https://builds.apache.org/job/JMeter-trunk/ws/trunk/src/core/org/apache/jmeter/threads/JMeterContext.java>:183:
warning: no @param for engine
  [javadoc]     public void setEngine(StandardJMeterEngine engine) {
  [javadoc]                 ^
  [javadoc] <https://builds.apache.org/job/JMeter-trunk/ws/trunk/src/core/org/apache/jmeter/threads/JMeterContext.java>:194:
warning: no @param for b
  [javadoc]     public void setSamplingStarted(boolean b) {
  [javadoc]                 ^
  [javadoc] <https://builds.apache.org/job/JMeter-trunk/ws/trunk/src/core/org/apache/jmeter/threads/JMeterContext.java>:201:
warning: no @param for restartNextLoop
  [javadoc]     public void setStartNextThreadLoop(boolean restartNextLoop) {
  [javadoc]                 ^
  [javadoc] <https://builds.apache.org/job/JMeter-trunk/ws/trunk/src/core/org/apache/jmeter/threads/JMeterContext.java>:209:
warning: no @return
  [javadoc]     public boolean isStartNextThreadLoop() {
  [javadoc]                    ^
  [javadoc] <https://builds.apache.org/job/JMeter-trunk/ws/trunk/src/core/org/apache/jmeter/threads/JMeterContext.java>:220:
warning: no @param for restartNextLoop
  [javadoc]     public void setRestartNextLoop(boolean restartNextLoop) {
  [javadoc]                 ^
  [javadoc] <https://builds.apache.org/job/JMeter-trunk/ws/trunk/src/core/org/apache/jmeter/threads/JMeterContext.java>:228:
warning: no @return
  [javadoc]     public boolean isRestartNextLoop() {
  [javadoc]                    ^
  [javadoc] <https://builds.apache.org/job/JMeter-trunk/ws/trunk/src/core/org/apache/jmeter/threads/JMeterContext.java>:254:
warning: no @param for recording
  [javadoc]     public void setRecording(boolean recording) {
  [javadoc]                 ^
  [javadoc] <https://builds.apache.org/job/JMeter-trunk/ws/trunk/src/components/org/apache/jmeter/extractor/HtmlExtractor.java>:286:
warning: no @param for defaultValue
  [javadoc]     public void setDefaultValue(String defaultValue) {
  [javadoc]                 ^
  [javadoc] Building index for all the packages and classes...
  [javadoc] Building index for all classes...
  [javadoc] Generating <https://builds.apache.org/job/JMeter-trunk/ws/trunk/docs/api/help-doc.html...>
  [javadoc] 1 error
  [javadoc] 13 warnings

compile-tests:
    [javac] Compiling 186 source files to <https://builds.apache.org/job/JMeter-trunk/ws/trunk/build/test>
    [javac] Note: Some input files use or override a deprecated API.
    [javac] Note: Recompile with -Xlint:deprecation for details.
  [groovyc] Compiling 18 source files to <https://builds.apache.org/job/JMeter-trunk/ws/trunk/build/test>

_test:
     [echo] 
     [echo]    gump.run = false
     [echo]    java.awt.headless = true
     [echo]    test.headless = true
     [echo]    user.dir = <https://builds.apache.org/job/JMeter-trunk/ws/trunk>
     [echo]    basedir = <https://builds.apache.org/job/JMeter-trunk/ws/trunk>
     [echo]    test dir = build/test
     [echo]    test dir gump = build/test
     [echo]    testsaveservice.saveout = ${testsaveservice.saveout}
     [echo]    test.encoding = UTF-8
     [echo]     
     [java] SLF4J: Class path contains multiple SLF4J bindings.
     [java] SLF4J: Found binding in [jar:<https://builds.apache.org/job/JMeter-trunk/ws/trunk/lib/log4j-slf4j-impl-2.8.2.jar!/org/slf4j/impl/StaticLoggerBinder.class]>
     [java] SLF4J: Found binding in [jar:<https://builds.apache.org/job/JMeter-trunk/ws/trunk/lib/opt/activemq-all-5.15.2.jar!/org/slf4j/impl/StaticLoggerBinder.class]>
     [java] SLF4J: See http://www.slf4j.org/codes.html#multiple_bindings for an explanation.
     [java] SLF4J: Actual binding is of type [org.apache.logging.slf4j.Log4jLoggerFactory]
     [java] Setting JMeterHome: <https://builds.apache.org/job/JMeter-trunk/ws/trunk>
     [java] Using initializeProperties() from org.apache.jmeter.util.JMeterUtils
     [java] Setting up initial properties using: <https://builds.apache.org/job/JMeter-trunk/ws/trunk/bin/jmeter.properties>
     [java] Initializing Properties: <https://builds.apache.org/job/JMeter-trunk/ws/trunk/bin/jmeter.properties>
     [java] JMeterVersion=r1819090
     [java] java.version=1.8.0_152
     [java] java.home=/usr/local/asfpackages/java/jdk1.8.0_152/jre
     [java] file.encoding=UTF-8
     [java] default encoding=UTF-8
     [java] user.dir=<https://builds.apache.org/job/JMeter-trunk/ws/trunk/bin>
     [java] Locale=en_US
     [java] os.name=Linux
     [java] os.version=3.13.0-125-generic
     [java] JCE max key length = 128
     [java] +++++++++++
     [java] java.awt.headless=true
     [java] java.awt.graphicsenv=sun.awt.X11GraphicsEnvironment
     [java] ------------
     [java] Searching junit tests in : build/test
     [java] o.a.j.junit.JMeterTest INFO: JMeterGUIComponent: skipping some tests org.apache.jmeter.testbeans.gui.TestBeanGUI
     [java] o.a.j.junit.JMeterTest Error creating org.apache.jmeter.SplashScreen java.awt.HeadlessException
     [java] o.a.j.junit.JMeterTest Error creating org.apache.jmeter.config.gui.RowDetailDialog
java.awt.HeadlessException
     [java] o.a.j.junit.JMeterTest Error creating org.apache.jmeter.functions.gui.FunctionHelper
java.awt.HeadlessException
     [java] o.a.j.junit.JMeterTest WARN: java.io.Serializable: NoSuchMethodException  org.apache.jmeter.gui.GlobalUndoableEdit,
missing empty Constructor or Constructor with Object parameter
     [java] o.a.j.junit.JMeterTest Error creating org.apache.jmeter.gui.MainFrame java.awt.HeadlessException
     [java] o.a.j.junit.JMeterTest Error creating org.apache.jmeter.gui.SavePropertyDialog
java.awt.HeadlessException
     [java] o.a.j.junit.JMeterTest Error creating org.apache.jmeter.gui.action.SearchTreeDialog
java.awt.HeadlessException
     [java] o.a.j.junit.JMeterTest Error creating org.apache.jmeter.gui.action.SelectTemplatesDialog
java.awt.HeadlessException
     [java] o.a.j.junit.JMeterTest Error creating org.apache.jmeter.gui.util.EscapeDialog
java.awt.HeadlessException
     [java] o.a.j.junit.JMeterTest Error creating org.apache.jmeter.gui.util.JSyntaxTextArea
java.awt.HeadlessException
     [java] java.rmi.server.hostname=null
     [java] penates.apache.org/67.195.81.186
     [java] isSiteLocalAddress:false
     [java] isAnyLocalAddress:false
     [java] isLinkLocalAddress:false
     [java] isLoopbackAddress:false
     [java] isMulticastAddress:false
     [java] localhost/127.0.0.1
     [java] isSiteLocalAddress:false
     [java] isAnyLocalAddress:false
     [java] isLinkLocalAddress:false
     [java] isLoopbackAddress:true
     [java] isMulticastAddress:false
     [java] ====================
     [java] penates.apache.org/67.195.81.186
     [java] isSiteLocalAddress:false
     [java] isAnyLocalAddress:false
     [java] isLinkLocalAddress:false
     [java] isLoopbackAddress:false
     [java] isMulticastAddress:false
     [java] Security framework of XStream not initialized, XStream is probably vulnerable.
     [java] Security framework of XStream not initialized, XStream is probably vulnerable.
     [java] Security framework of XStream not initialized, XStream is probably vulnerable.
     [java] Security framework of XStream not initialized, XStream is probably vulnerable.
     [java] ......................................................................................................................................................I......................................................................................................................................................................................................................................................................................................................................................................................................................................................................................................................E..................................................................................................................................................................................................................................................................................................................................................................................................................................................................................................................................................................................................................................................................................................................................................................................................................................................................................................................................................................................................................................................................................................................................................................................................................................................................................................................................................................................................................................................................................................................................................................................................................................................................................................................................................................................................................................................................................................................................................................................................................................................................................................................................................................................................................................................................................................................................................................................................................................................................................................................................................II........................................................................
     [java] Time: 25.648
     [java] There was 1 failure:
     [java] 1) testPotentialBugWithComplexPeriod(org.apache.jmeter.functions.TestTimeShiftFunction)
     [java] java.lang.AssertionError: 
     [java] Expected: the date is within 1 seconds of Sun, 31 Dec 2017 10:55:05.000 AM
     [java]      but: the date is Mon, 01 Jan 2018 07:54:17.000 PM and 118752 seconds different
     [java] 	at org.hamcrest.MatcherAssert.assertThat(MatcherAssert.java:20)
     [java] 	at org.junit.Assert.assertThat(Assert.java:956)
     [java] 	at org.junit.Assert.assertThat(Assert.java:923)
     [java] 	at org.apache.jmeter.functions.TestTimeShiftFunction.testPotentialBugWithComplexPeriod(TestTimeShiftFunction.java:131)
     [java] 	at sun.reflect.NativeMethodAccessorImpl.invoke0(Native Method)
     [java] 	at sun.reflect.NativeMethodAccessorImpl.invoke(NativeMethodAccessorImpl.java:62)
     [java] 	at sun.reflect.DelegatingMethodAccessorImpl.invoke(DelegatingMethodAccessorImpl.java:43)
     [java] 	at java.lang.reflect.Method.invoke(Method.java:498)
     [java] 	at org.junit.runners.model.FrameworkMethod$1.runReflectiveCall(FrameworkMethod.java:50)
     [java] 	at org.junit.internal.runners.model.ReflectiveCallable.run(ReflectiveCallable.java:12)
     [java] 	at org.junit.runners.model.FrameworkMethod.invokeExplosively(FrameworkMethod.java:47)
     [java] 	at org.junit.internal.runners.statements.InvokeMethod.evaluate(InvokeMethod.java:17)
     [java] 	at org.junit.internal.runners.statements.RunBefores.evaluate(RunBefores.java:26)
     [java] 	at org.junit.runners.ParentRunner.runLeaf(ParentRunner.java:325)
     [java] 	at org.junit.runners.BlockJUnit4ClassRunner.runChild(BlockJUnit4ClassRunner.java:78)
     [java] 	at org.junit.runners.BlockJUnit4ClassRunner.runChild(BlockJUnit4ClassRunner.java:57)
     [java] 	at org.junit.runners.ParentRunner$3.run(ParentRunner.java:290)
     [java] 	at java.util.concurrent.Executors$RunnableAdapter.call(Executors.java:511)
     [java] 	at java.util.concurrent.FutureTask.run(FutureTask.java:266)
     [java] 	at java.util.concurrent.ThreadPoolExecutor.runWorker(ThreadPoolExecutor.java:1149)
     [java] 	at java.util.concurrent.ThreadPoolExecutor$Worker.run(ThreadPoolExecutor.java:624)
     [java] 	at java.lang.Thread.run(Thread.java:748)
     [java] 
     [java] FAILURES!!!
     [java] Tests run: 3174,  Failures: 1
     [java] 
     [java] ................................................
     [java] Time: 4.324
     [java] 
     [java] OK (48 tests)
     [java] 

BUILD FAILED
<https://builds.apache.org/job/JMeter-trunk/ws/trunk/build.xml>:2938: Java returned:
1

Total time: 2 minutes 9 seconds
Build step 'Invoke Ant' marked build as failure
[locks-and-latches] Releasing all the locks
[locks-and-latches] All the locks released
Archiving artifacts

Mime
View raw message