jmeter-dev mailing list archives

Site index · List index
Message view « Date » · « Thread »
Top « Date » · « Thread »
From Apache Jenkins Server <jenk...@builds.apache.org>
Subject Build failed in Jenkins: JMeter Windows #810
Date Thu, 26 Oct 2017 20:37:18 GMT
See <https://builds.apache.org/job/JMeter%20Windows/810/display/redirect?page=changes>

Changes:

[pmouawad] fix svn:eol
Thanks sebb !

[pmouawad] Fix sonar warnings

[pmouawad] Clarify documentation as per:

- https://stackoverflow.com/questions/46952357/dummy-sampler-under-runtime-controller-duplicate-requests

[pmouawad] Fix sonar warning

------------------------------------------
[...truncated 153.18 KB...]
   [concat] 	at java.lang.Thread.run(Thread.java:745) [?:1.8.0_121]
   [concat] Caused by: java.net.SocketTimeoutException: Read timed out
   [concat] 	at java.net.SocketInputStream.socketRead0(Native Method) ~[?:1.8.0_121]
   [concat] 	at java.net.SocketInputStream.socketRead(SocketInputStream.java:116) ~[?:1.8.0_121]
   [concat] 	at java.net.SocketInputStream.read(SocketInputStream.java:171) ~[?:1.8.0_121]
   [concat] 	at java.net.SocketInputStream.read(SocketInputStream.java:141) ~[?:1.8.0_121]
   [concat] 	at java.net.SocketInputStream.read(SocketInputStream.java:127) ~[?:1.8.0_121]
   [concat] 	at org.apache.jmeter.protocol.tcp.sampler.TCPClientImpl.read(TCPClientImpl.java:114)
~[ApacheJMeter_tcp.jar:r1813454]
   [concat] 	... 5 more
   [concat] 2017-10-26 20:36:16,317 WARN o.a.m.f.l.LoggingFilter: EXCEPTION :
   [concat] java.io.IOException: An established connection was aborted by the software in
your host machine
   [concat] 	at sun.nio.ch.SocketDispatcher.read0(Native Method) ~[?:1.8.0_121]
   [concat] 	at sun.nio.ch.SocketDispatcher.read(SocketDispatcher.java:43) ~[?:1.8.0_121]
   [concat] 	at sun.nio.ch.IOUtil.readIntoNativeBuffer(IOUtil.java:223) ~[?:1.8.0_121]
   [concat] 	at sun.nio.ch.IOUtil.read(IOUtil.java:197) ~[?:1.8.0_121]
   [concat] 	at sun.nio.ch.SocketChannelImpl.read(SocketChannelImpl.java:380) ~[?:1.8.0_121]
   [concat] 	at org.apache.mina.transport.socket.nio.NioProcessor.read(NioProcessor.java:317)
~[mina-core-2.0.16.jar:?]
   [concat] 	at org.apache.mina.transport.socket.nio.NioProcessor.read(NioProcessor.java:45)
~[mina-core-2.0.16.jar:?]
   [concat] 	at org.apache.mina.core.polling.AbstractPollingIoProcessor.read(AbstractPollingIoProcessor.java:683)
[mina-core-2.0.16.jar:?]
   [concat] 	at org.apache.mina.core.polling.AbstractPollingIoProcessor.process(AbstractPollingIoProcessor.java:659)
[mina-core-2.0.16.jar:?]
   [concat] 	at org.apache.mina.core.polling.AbstractPollingIoProcessor.process(AbstractPollingIoProcessor.java:648)
[mina-core-2.0.16.jar:?]
   [concat] 	at org.apache.mina.core.polling.AbstractPollingIoProcessor.access$600(AbstractPollingIoProcessor.java:68)
[mina-core-2.0.16.jar:?]
   [concat] 	at org.apache.mina.core.polling.AbstractPollingIoProcessor$Processor.run(AbstractPollingIoProcessor.java:1120)
[mina-core-2.0.16.jar:?]
   [concat] 	at org.apache.mina.util.NamePreservingRunnable.run(NamePreservingRunnable.java:64)
[mina-core-2.0.16.jar:?]
   [concat] 	at java.util.concurrent.ThreadPoolExecutor.runWorker(ThreadPoolExecutor.java:1142)
[?:1.8.0_121]
   [concat] 	at java.util.concurrent.ThreadPoolExecutor$Worker.run(ThreadPoolExecutor.java:617)
[?:1.8.0_121]
   [concat] 	at java.lang.Thread.run(Thread.java:745) [?:1.8.0_121]
   [concat] 2017-10-26 20:36:16,320 ERROR TimeServerHandler: Exception occured
   [concat] java.io.IOException: An established connection was aborted by the software in
your host machine
   [concat] 	at sun.nio.ch.SocketDispatcher.read0(Native Method) ~[?:1.8.0_121]
   [concat] 	at sun.nio.ch.SocketDispatcher.read(SocketDispatcher.java:43) ~[?:1.8.0_121]
   [concat] 	at sun.nio.ch.IOUtil.readIntoNativeBuffer(IOUtil.java:223) ~[?:1.8.0_121]
   [concat] 	at sun.nio.ch.IOUtil.read(IOUtil.java:197) ~[?:1.8.0_121]
   [concat] 	at sun.nio.ch.SocketChannelImpl.read(SocketChannelImpl.java:380) ~[?:1.8.0_121]
   [concat] 	at org.apache.mina.transport.socket.nio.NioProcessor.read(NioProcessor.java:317)
~[mina-core-2.0.16.jar:?]
   [concat] 	at org.apache.mina.transport.socket.nio.NioProcessor.read(NioProcessor.java:45)
~[mina-core-2.0.16.jar:?]
   [concat] 	at org.apache.mina.core.polling.AbstractPollingIoProcessor.read(AbstractPollingIoProcessor.java:683)
[mina-core-2.0.16.jar:?]
   [concat] 	at org.apache.mina.core.polling.AbstractPollingIoProcessor.process(AbstractPollingIoProcessor.java:659)
[mina-core-2.0.16.jar:?]
   [concat] 	at org.apache.mina.core.polling.AbstractPollingIoProcessor.process(AbstractPollingIoProcessor.java:648)
[mina-core-2.0.16.jar:?]
   [concat] 	at org.apache.mina.core.polling.AbstractPollingIoProcessor.access$600(AbstractPollingIoProcessor.java:68)
[mina-core-2.0.16.jar:?]
   [concat] 	at org.apache.mina.core.polling.AbstractPollingIoProcessor$Processor.run(AbstractPollingIoProcessor.java:1120)
[mina-core-2.0.16.jar:?]
   [concat] 	at org.apache.mina.util.NamePreservingRunnable.run(NamePreservingRunnable.java:64)
[mina-core-2.0.16.jar:?]
   [concat] 	at java.util.concurrent.ThreadPoolExecutor.runWorker(ThreadPoolExecutor.java:1142)
[?:1.8.0_121]
   [concat] 	at java.util.concurrent.ThreadPoolExecutor$Worker.run(ThreadPoolExecutor.java:617)
[?:1.8.0_121]
   [concat] 	at java.lang.Thread.run(Thread.java:745) [?:1.8.0_121]
   [concat] 2017-10-26 20:36:16,400 ERROR o.a.j.p.t.s.TCPSampler: 
   [concat] org.apache.jmeter.protocol.tcp.sampler.ReadException: 
   [concat] 	at org.apache.jmeter.protocol.tcp.sampler.BinaryTCPClientImpl.read(BinaryTCPClientImpl.java:152)
~[ApacheJMeter_tcp.jar:r1813454]
   [concat] 	at org.apache.jmeter.protocol.tcp.sampler.TCPSampler.sample(TCPSampler.java:402)
[ApacheJMeter_tcp.jar:r1813454]
   [concat] 	at org.apache.jmeter.threads.JMeterThread.executeSamplePackage(JMeterThread.java:498)
[ApacheJMeter_core.jar:r1813454]
   [concat] 	at org.apache.jmeter.threads.JMeterThread.processSampler(JMeterThread.java:424)
[ApacheJMeter_core.jar:r1813454]
   [concat] 	at org.apache.jmeter.threads.JMeterThread.run(JMeterThread.java:255) [ApacheJMeter_core.jar:r1813454]
   [concat] 	at java.lang.Thread.run(Thread.java:745) [?:1.8.0_121]
   [concat] Caused by: java.net.SocketTimeoutException: Read timed out
   [concat] 	at java.net.SocketInputStream.socketRead0(Native Method) ~[?:1.8.0_121]
   [concat] 	at java.net.SocketInputStream.socketRead(SocketInputStream.java:116) ~[?:1.8.0_121]
   [concat] 	at java.net.SocketInputStream.read(SocketInputStream.java:171) ~[?:1.8.0_121]
   [concat] 	at java.net.SocketInputStream.read(SocketInputStream.java:141) ~[?:1.8.0_121]
   [concat] 	at java.net.SocketInputStream.read(SocketInputStream.java:127) ~[?:1.8.0_121]
   [concat] 	at org.apache.jmeter.protocol.tcp.sampler.BinaryTCPClientImpl.read(BinaryTCPClientImpl.java:134)
~[ApacheJMeter_tcp.jar:r1813454]
   [concat] 	... 5 more
   [concat] 2017-10-26 20:36:17,402 WARN o.a.m.f.l.LoggingFilter: EXCEPTION :
   [concat] java.io.IOException: An established connection was aborted by the software in
your host machine
   [concat] 	at sun.nio.ch.SocketDispatcher.read0(Native Method) ~[?:1.8.0_121]
   [concat] 	at sun.nio.ch.SocketDispatcher.read(SocketDispatcher.java:43) ~[?:1.8.0_121]
   [concat] 	at sun.nio.ch.IOUtil.readIntoNativeBuffer(IOUtil.java:223) ~[?:1.8.0_121]
   [concat] 	at sun.nio.ch.IOUtil.read(IOUtil.java:197) ~[?:1.8.0_121]
   [concat] 	at sun.nio.ch.SocketChannelImpl.read(SocketChannelImpl.java:380) ~[?:1.8.0_121]
   [concat] 	at org.apache.mina.transport.socket.nio.NioProcessor.read(NioProcessor.java:317)
~[mina-core-2.0.16.jar:?]
   [concat] 	at org.apache.mina.transport.socket.nio.NioProcessor.read(NioProcessor.java:45)
~[mina-core-2.0.16.jar:?]
   [concat] 	at org.apache.mina.core.polling.AbstractPollingIoProcessor.read(AbstractPollingIoProcessor.java:683)
[mina-core-2.0.16.jar:?]
   [concat] 	at org.apache.mina.core.polling.AbstractPollingIoProcessor.process(AbstractPollingIoProcessor.java:659)
[mina-core-2.0.16.jar:?]
   [concat] 	at org.apache.mina.core.polling.AbstractPollingIoProcessor.process(AbstractPollingIoProcessor.java:648)
[mina-core-2.0.16.jar:?]
   [concat] 	at org.apache.mina.core.polling.AbstractPollingIoProcessor.access$600(AbstractPollingIoProcessor.java:68)
[mina-core-2.0.16.jar:?]
   [concat] 	at org.apache.mina.core.polling.AbstractPollingIoProcessor$Processor.run(AbstractPollingIoProcessor.java:1120)
[mina-core-2.0.16.jar:?]
   [concat] 	at org.apache.mina.util.NamePreservingRunnable.run(NamePreservingRunnable.java:64)
[mina-core-2.0.16.jar:?]
   [concat] 	at java.util.concurrent.ThreadPoolExecutor.runWorker(ThreadPoolExecutor.java:1142)
[?:1.8.0_121]
   [concat] 	at java.util.concurrent.ThreadPoolExecutor$Worker.run(ThreadPoolExecutor.java:617)
[?:1.8.0_121]
   [concat] 	at java.lang.Thread.run(Thread.java:745) [?:1.8.0_121]
   [concat] 2017-10-26 20:36:17,404 ERROR TimeServerHandler: Exception occured
   [concat] java.io.IOException: An established connection was aborted by the software in
your host machine
   [concat] 	at sun.nio.ch.SocketDispatcher.read0(Native Method) ~[?:1.8.0_121]
   [concat] 	at sun.nio.ch.SocketDispatcher.read(SocketDispatcher.java:43) ~[?:1.8.0_121]
   [concat] 	at sun.nio.ch.IOUtil.readIntoNativeBuffer(IOUtil.java:223) ~[?:1.8.0_121]
   [concat] 	at sun.nio.ch.IOUtil.read(IOUtil.java:197) ~[?:1.8.0_121]
   [concat] 	at sun.nio.ch.SocketChannelImpl.read(SocketChannelImpl.java:380) ~[?:1.8.0_121]
   [concat] 	at org.apache.mina.transport.socket.nio.NioProcessor.read(NioProcessor.java:317)
~[mina-core-2.0.16.jar:?]
   [concat] 	at org.apache.mina.transport.socket.nio.NioProcessor.read(NioProcessor.java:45)
~[mina-core-2.0.16.jar:?]
   [concat] 	at org.apache.mina.core.polling.AbstractPollingIoProcessor.read(AbstractPollingIoProcessor.java:683)
[mina-core-2.0.16.jar:?]
   [concat] 	at org.apache.mina.core.polling.AbstractPollingIoProcessor.process(AbstractPollingIoProcessor.java:659)
[mina-core-2.0.16.jar:?]
   [concat] 	at org.apache.mina.core.polling.AbstractPollingIoProcessor.process(AbstractPollingIoProcessor.java:648)
[mina-core-2.0.16.jar:?]
   [concat] 	at org.apache.mina.core.polling.AbstractPollingIoProcessor.access$600(AbstractPollingIoProcessor.java:68)
[mina-core-2.0.16.jar:?]
   [concat] 	at org.apache.mina.core.polling.AbstractPollingIoProcessor$Processor.run(AbstractPollingIoProcessor.java:1120)
[mina-core-2.0.16.jar:?]
   [concat] 	at org.apache.mina.util.NamePreservingRunnable.run(NamePreservingRunnable.java:64)
[mina-core-2.0.16.jar:?]
   [concat] 	at java.util.concurrent.ThreadPoolExecutor.runWorker(ThreadPoolExecutor.java:1142)
[?:1.8.0_121]
   [concat] 	at java.util.concurrent.ThreadPoolExecutor$Worker.run(ThreadPoolExecutor.java:617)
[?:1.8.0_121]
   [concat] 	at java.lang.Thread.run(Thread.java:745) [?:1.8.0_121]
   [concat] 2017-10-26 20:36:17,428 WARN o.a.j.p.t.s.TCPSampler: Could not create socket for
tcp://localhost:2223
   [concat] java.net.ConnectException: Connection refused: connect
   [concat] 	at java.net.DualStackPlainSocketImpl.waitForConnect(Native Method) ~[?:1.8.0_121]
   [concat] 	at java.net.DualStackPlainSocketImpl.socketConnect(DualStackPlainSocketImpl.java:85)
~[?:1.8.0_121]
   [concat] 	at java.net.AbstractPlainSocketImpl.doConnect(AbstractPlainSocketImpl.java:350)
~[?:1.8.0_121]
   [concat] 	at java.net.AbstractPlainSocketImpl.connectToAddress(AbstractPlainSocketImpl.java:206)
~[?:1.8.0_121]
   [concat] 	at java.net.AbstractPlainSocketImpl.connect(AbstractPlainSocketImpl.java:188)
~[?:1.8.0_121]
   [concat] 	at java.net.PlainSocketImpl.connect(PlainSocketImpl.java:172) ~[?:1.8.0_121]
   [concat] 	at java.net.SocksSocketImpl.connect(SocksSocketImpl.java:392) ~[?:1.8.0_121]
   [concat] 	at java.net.Socket.connect(Socket.java:589) ~[?:1.8.0_121]
   [concat] 	at org.apache.jmeter.protocol.tcp.sampler.TCPSampler.getSocket(TCPSampler.java:168)
[ApacheJMeter_tcp.jar:r1813454]
   [concat] 	at org.apache.jmeter.protocol.tcp.sampler.TCPSampler.sample(TCPSampler.java:384)
[ApacheJMeter_tcp.jar:r1813454]
   [concat] 	at org.apache.jmeter.threads.JMeterThread.executeSamplePackage(JMeterThread.java:498)
[ApacheJMeter_core.jar:r1813454]
   [concat] 	at org.apache.jmeter.threads.JMeterThread.processSampler(JMeterThread.java:424)
[ApacheJMeter_core.jar:r1813454]
   [concat] 	at org.apache.jmeter.threads.JMeterThread.run(JMeterThread.java:255) [ApacheJMeter_core.jar:r1813454]
   [concat] 	at java.lang.Thread.run(Thread.java:745) [?:1.8.0_121]
   [concat] 2017-10-26 20:36:19,750 WARN o.a.j.p.t.s.TCPSampler: Unknown host for tcp://localhostXXXX:2223
   [concat] java.net.UnknownHostException: localhostXXXX
   [concat] 	at java.net.AbstractPlainSocketImpl.connect(AbstractPlainSocketImpl.java:184)
~[?:1.8.0_121]
   [concat] 	at java.net.PlainSocketImpl.connect(PlainSocketImpl.java:172) ~[?:1.8.0_121]
   [concat] 	at java.net.SocksSocketImpl.connect(SocksSocketImpl.java:392) ~[?:1.8.0_121]
   [concat] 	at java.net.Socket.connect(Socket.java:589) ~[?:1.8.0_121]
   [concat] 	at org.apache.jmeter.protocol.tcp.sampler.TCPSampler.getSocket(TCPSampler.java:168)
[ApacheJMeter_tcp.jar:r1813454]
   [concat] 	at org.apache.jmeter.protocol.tcp.sampler.TCPSampler.sample(TCPSampler.java:384)
[ApacheJMeter_tcp.jar:r1813454]
   [concat] 	at org.apache.jmeter.threads.JMeterThread.executeSamplePackage(JMeterThread.java:498)
[ApacheJMeter_core.jar:r1813454]
   [concat] 	at org.apache.jmeter.threads.JMeterThread.processSampler(JMeterThread.java:424)
[ApacheJMeter_core.jar:r1813454]
   [concat] 	at org.apache.jmeter.threads.JMeterThread.run(JMeterThread.java:255) [ApacheJMeter_core.jar:r1813454]
   [concat] 	at java.lang.Thread.run(Thread.java:745) [?:1.8.0_121]
   [concat] 2017-10-26 20:36:19,754 ERROR o.a.j.p.t.s.TCPSampler: Could not find protocol
class 'org.foo.xxx'
     [echo] TCP_TESTS output files compared OK

batchtest:
     [echo] Starting JDBC_TESTS with file JDBC_TESTS.jmx using -X -Jdummy=dummy
   [jmeter] SLF4J: Class path contains multiple SLF4J bindings.
   [jmeter] SLF4J: Found binding in [jar:file:/F:/jenkins/jenkins-slave/workspace/JMeter%20Windows/trunk/lib/log4j-slf4j-impl-2.8.2.jar!/org/slf4j/impl/StaticLoggerBinder.class]
   [jmeter] SLF4J: Found binding in [jar:file:/F:/jenkins/jenkins-slave/workspace/JMeter%20Windows/trunk/lib/opt/activemq-all-5.15.2.jar!/org/slf4j/impl/StaticLoggerBinder.class]
   [jmeter] SLF4J: See http://www.slf4j.org/codes.html#multiple_bindings for an explanation.
   [jmeter] SLF4J: Actual binding is of type [org.apache.logging.slf4j.Log4jLoggerFactory]
   [jmeter] Creating summariser <summary>
   [jmeter] Created the tree successfully using testfiles/JDBC_TESTS.jmx
   [jmeter] Starting the test @ Thu Oct 26 20:36:23 UTC 2017 (1509050183015)
   [jmeter] Waiting for possible Shutdown/StopTestNow/Heapdump message on port 4445
   [jmeter] summary =     10 in 00:00:02 =    6.2/s Avg:    70 Min:     0 Max:   658 Err:
    0 (0.00%)
   [jmeter] Tidying up ...    @ Thu Oct 26 20:36:26 UTC 2017 (1509050186011)
   [jmeter] ... end of run
     [echo] JDBC_TESTS output files compared OK

batchtest:
     [echo] Starting JMS_TESTS with file JMS_TESTS.jmx using -X -Jdummy=dummy
   [jmeter] SLF4J: Class path contains multiple SLF4J bindings.
   [jmeter] SLF4J: Found binding in [jar:file:/F:/jenkins/jenkins-slave/workspace/JMeter%20Windows/trunk/lib/log4j-slf4j-impl-2.8.2.jar!/org/slf4j/impl/StaticLoggerBinder.class]
   [jmeter] SLF4J: Found binding in [jar:file:/F:/jenkins/jenkins-slave/workspace/JMeter%20Windows/trunk/lib/opt/activemq-all-5.15.2.jar!/org/slf4j/impl/StaticLoggerBinder.class]
   [jmeter] SLF4J: See http://www.slf4j.org/codes.html#multiple_bindings for an explanation.
   [jmeter] SLF4J: Actual binding is of type [org.apache.logging.slf4j.Log4jLoggerFactory]
   [jmeter] Creating summariser <summary>
   [jmeter] Created the tree successfully using testfiles/JMS_TESTS.jmx
   [jmeter] Starting the test @ Thu Oct 26 20:36:29 UTC 2017 (1509050189230)
   [jmeter] Waiting for possible Shutdown/StopTestNow/Heapdump message on port 4445
   [jmeter] summary +      1 in 00:00:02 =    0.5/s Avg:  1810 Min:  1810 Max:  1810 Err:
    0 (0.00%) Active: 1 Started: 1 Finished: 0
   [jmeter] summary +     19 in 00:00:30 =    0.6/s Avg:   640 Min:     0 Max:  3001 Err:
    0 (0.00%) Active: 1 Started: 1 Finished: 0
   [jmeter] summary =     20 in 00:00:32 =    0.6/s Avg:   698 Min:     0 Max:  3001 Err:
    0 (0.00%)
   [jmeter] summary =     20 in 00:00:32 =    0.6/s Avg:   698 Min:     0 Max:  3001 Err:
    0 (0.00%)
   [jmeter] Tidying up ...    @ Thu Oct 26 20:37:02 UTC 2017 (1509050222417)
   [jmeter] ... end of run
     [echo] JMS_TESTS output files compared OK

batchtest:
     [echo] Starting OS_TESTS with file OS_TESTS.jmx using -X -Jdummy=dummy
   [jmeter] SLF4J: Class path contains multiple SLF4J bindings.
   [jmeter] SLF4J: Found binding in [jar:file:/F:/jenkins/jenkins-slave/workspace/JMeter%20Windows/trunk/lib/log4j-slf4j-impl-2.8.2.jar!/org/slf4j/impl/StaticLoggerBinder.class]
   [jmeter] SLF4J: Found binding in [jar:file:/F:/jenkins/jenkins-slave/workspace/JMeter%20Windows/trunk/lib/opt/activemq-all-5.15.2.jar!/org/slf4j/impl/StaticLoggerBinder.class]
   [jmeter] SLF4J: See http://www.slf4j.org/codes.html#multiple_bindings for an explanation.
   [jmeter] SLF4J: Actual binding is of type [org.apache.logging.slf4j.Log4jLoggerFactory]
   [jmeter] Creating summariser <summary>
   [jmeter] Created the tree successfully using testfiles/OS_TESTS.jmx
   [jmeter] Starting the test @ Thu Oct 26 20:37:06 UTC 2017 (1509050226114)
   [jmeter] Waiting for possible Shutdown/StopTestNow/Heapdump message on port 4445
   [jmeter] summary =      3 in 00:00:01 =    2.5/s Avg:    41 Min:     2 Max:   114 Err:
    3 (100.00%)
   [jmeter] Tidying up ...    @ Thu Oct 26 20:37:07 UTC 2017 (1509050227595)
   [jmeter] ... end of run
Target 'batchtest' failed with message 'CSV Files are not identical.
        <https://builds.apache.org/job/JMeter%20Windows/ws/trunk\bin\testfiles\OS_TESTS.csv>
        label,responseCode,responseMessage,threadName,dataType,success,grpThreads,allThreads,SampleCount,ErrorCount
OSPS-listDirectory,0,OK,Thread Group 1-1,text,true,1,1,1,0
OSPS-listEnv,0,OK,Thread Group 1-1,text,true,1,1,1,0
OSPS-sleep,500,System Sampler interrupted whilst executing system call: java.lang.InterruptedException:
Process timeout out after 1000 milliseconds,Thread Group 1-1,text,true,1,1,1,0

        <https://builds.apache.org/job/JMeter%20Windows/ws/trunk\bin\OS_TESTS.csv>
        label,responseCode,responseMessage,threadName,dataType,success,grpThreads,allThreads,SampleCount,ErrorCount
OSPS-listDirectory,500,"Exception occurred whilst executing system call: java.io.IOException:
Cannot run program ""dir"" (in directory ""<https://builds.apache.org/job/JMeter%20Windows/ws/trunk\bin"")>:
CreateProcess error=2, The system cannot find the file specified",Thread Group 1-1,text,false,1,1,1,1
OSPS-listEnv,500,"Exception occurred whilst executing system call: java.io.IOException: Cannot
run program ""set"" (in directory ""<https://builds.apache.org/job/JMeter%20Windows/ws/trunk\bin"")>:
CreateProcess error=2, The system cannot find the file specified",Thread Group 1-1,text,false,1,1,1,1
OSPS-sleep,1,Unexpected return code.  Expected [0]. Actual [1].,Thread Group 1-1,text,false,1,1,1,1'.
Target 'batch_scripts' failed with message 'The following error occurred while executing this
line:
<https://builds.apache.org/job/JMeter%20Windows/ws/trunk\build.xml>:2619: CSV Files
are not identical.
        <https://builds.apache.org/job/JMeter%20Windows/ws/trunk\bin\testfiles\OS_TESTS.csv>
        label,responseCode,responseMessage,threadName,dataType,success,grpThreads,allThreads,SampleCount,ErrorCount
OSPS-listDirectory,0,OK,Thread Group 1-1,text,true,1,1,1,0
OSPS-listEnv,0,OK,Thread Group 1-1,text,true,1,1,1,0
OSPS-sleep,500,System Sampler interrupted whilst executing system call: java.lang.InterruptedException:
Process timeout out after 1000 milliseconds,Thread Group 1-1,text,true,1,1,1,0

        <https://builds.apache.org/job/JMeter%20Windows/ws/trunk\bin\OS_TESTS.csv>
        label,responseCode,responseMessage,threadName,dataType,success,grpThreads,allThreads,SampleCount,ErrorCount
OSPS-listDirectory,500,"Exception occurred whilst executing system call: java.io.IOException:
Cannot run program ""dir"" (in directory ""<https://builds.apache.org/job/JMeter%20Windows/ws/trunk\bin"")>:
CreateProcess error=2, The system cannot find the file specified",Thread Group 1-1,text,false,1,1,1,1
OSPS-listEnv,500,"Exception occurred whilst executing system call: java.io.IOException: Cannot
run program ""set"" (in directory ""<https://builds.apache.org/job/JMeter%20Windows/ws/trunk\bin"")>:
CreateProcess error=2, The system cannot find the file specified",Thread Group 1-1,text,false,1,1,1,1
OSPS-sleep,1,Unexpected return code.  Expected [0]. Actual [1].,Thread Group 1-1,text,false,1,1,1,1'.
Cannot execute '_allbatchtests' - 'batch_scripts' failed or was not executed.
Cannot execute 'test' - '_allbatchtests' failed or was not executed.

download_checkstyle:

_process_checkstyle_jars:

_check_exists:

_check_jarfile:
     [echo] Checking checkstyle-6.13-all.jar
     [echo] Deleting checkstyle-6.13-all.jar (excluding checkstyle-6.13-all.jar)

setproxy:

_get_jarfile:

setproxy:

_get_zipfile:

checkstyle:

_process_checkstyle_jars:

_check_exists:

_check_jarfile:
[checkstyle] Running Checkstyle 6.13 on 1056 files

BUILD FAILED
<https://builds.apache.org/job/JMeter%20Windows/ws/trunk\build.xml>:2756: The following
error occurred while executing this line:
<https://builds.apache.org/job/JMeter%20Windows/ws/trunk\build.xml>:2619: CSV Files
are not identical.
        <https://builds.apache.org/job/JMeter%20Windows/ws/trunk\bin\testfiles\OS_TESTS.csv>
        label,responseCode,responseMessage,threadName,dataType,success,grpThreads,allThreads,SampleCount,ErrorCount
OSPS-listDirectory,0,OK,Thread Group 1-1,text,true,1,1,1,0
OSPS-listEnv,0,OK,Thread Group 1-1,text,true,1,1,1,0
OSPS-sleep,500,System Sampler interrupted whilst executing system call: java.lang.InterruptedException:
Process timeout out after 1000 milliseconds,Thread Group 1-1,text,true,1,1,1,0

        <https://builds.apache.org/job/JMeter%20Windows/ws/trunk\bin\OS_TESTS.csv>
        label,responseCode,responseMessage,threadName,dataType,success,grpThreads,allThreads,SampleCount,ErrorCount
OSPS-listDirectory,500,"Exception occurred whilst executing system call: java.io.IOException:
Cannot run program ""dir"" (in directory ""<https://builds.apache.org/job/JMeter%20Windows/ws/trunk\bin"")>:
CreateProcess error=2, The system cannot find the file specified",Thread Group 1-1,text,false,1,1,1,1
OSPS-listEnv,500,"Exception occurred whilst executing system call: java.io.IOException: Cannot
run program ""set"" (in directory ""<https://builds.apache.org/job/JMeter%20Windows/ws/trunk\bin"")>:
CreateProcess error=2, The system cannot find the file specified",Thread Group 1-1,text,false,1,1,1,1
OSPS-sleep,1,Unexpected return code.  Expected [0]. Actual [1].,Thread Group 1-1,text,false,1,1,1,1

Total time: 6 minutes 39 seconds
Build step 'Invoke Ant' marked build as failure

Mime
View raw message