jmeter-dev mailing list archives

Site index · List index
Message view « Date » · « Thread »
Top « Date » · « Thread »
From Apache Jenkins Server <jenk...@builds.apache.org>
Subject Build failed in Jenkins: JMeter Windows #785
Date Sun, 22 Oct 2017 20:21:59 GMT
See <https://builds.apache.org/job/JMeter%20Windows/785/display/redirect>

------------------------------------------
[...truncated 501.04 KB...]
   [jmeter] ... end of run
     [echo] Bug54685 output files compared OK

batchtest:
     [echo] Starting Bug55375 with file Bug55375.jmx using -X -Jdummy=dummy
   [jmeter] SLF4J: Class path contains multiple SLF4J bindings.
   [jmeter] SLF4J: Found binding in [jar:file:/F:/jenkins/jenkins-slave/workspace/JMeter%20Windows/trunk/lib/log4j-slf4j-impl-2.8.2.jar!/org/slf4j/impl/StaticLoggerBinder.class]
   [jmeter] SLF4J: Found binding in [jar:file:/F:/jenkins/jenkins-slave/workspace/JMeter%20Windows/trunk/lib/opt/activemq-all-5.15.2.jar!/org/slf4j/impl/StaticLoggerBinder.class]
   [jmeter] SLF4J: See http://www.slf4j.org/codes.html#multiple_bindings for an explanation.
   [jmeter] SLF4J: Actual binding is of type [org.apache.logging.slf4j.Log4jLoggerFactory]
   [jmeter] Creating summariser <summary>
   [jmeter] Created the tree successfully using testfiles/Bug55375.jmx
   [jmeter] Starting the test @ Sun Oct 22 20:21:05 UTC 2017 (1508703665120)
   [jmeter] Waiting for possible Shutdown/StopTestNow/Heapdump message on port 4445
   [jmeter] summary =      1 in 00:00:00 =    2.6/s Avg:   245 Min:   245 Max:   245 Err:
    0 (0.00%)
   [jmeter] Tidying up ...    @ Sun Oct 22 20:21:06 UTC 2017 (1508703666232)
   [jmeter] ... end of run
     [echo] Bug55375 output files compared OK

batchtestserver:
   [server] SLF4J: Class path contains multiple SLF4J bindings.
   [server] SLF4J: Found binding in [jar:file:/F:/jenkins/jenkins-slave/workspace/JMeter%20Windows/trunk/lib/log4j-slf4j-impl-2.8.2.jar!/org/slf4j/impl/StaticLoggerBinder.class]
   [server] SLF4J: Found binding in [jar:file:/F:/jenkins/jenkins-slave/workspace/JMeter%20Windows/trunk/lib/opt/activemq-all-5.15.2.jar!/org/slf4j/impl/StaticLoggerBinder.class]
   [server] SLF4J: See http://www.slf4j.org/codes.html#multiple_bindings for an explanation.
   [server] SLF4J: Actual binding is of type [org.apache.logging.slf4j.Log4jLoggerFactory]

batchtest:
     [echo] Starting Bug54685 with file Bug54685.jmx using -Rlocalhost:2002 -Jsample_variables=REFERENCE,JSESSIONID
   [server] Created remote object: UnicastServerRef [liveRef: [endpoint:[10.20.2.219:60978](local),objID:[-25bb406c:15f45bf0901:-7fff,
-2570310577591957163]]]
   [client] SLF4J: Class path contains multiple SLF4J bindings.
   [client] SLF4J: Found binding in [jar:file:/F:/jenkins/jenkins-slave/workspace/JMeter%20Windows/trunk/lib/log4j-slf4j-impl-2.8.2.jar!/org/slf4j/impl/StaticLoggerBinder.class]
   [client] SLF4J: Found binding in [jar:file:/F:/jenkins/jenkins-slave/workspace/JMeter%20Windows/trunk/lib/opt/activemq-all-5.15.2.jar!/org/slf4j/impl/StaticLoggerBinder.class]
   [client] SLF4J: See http://www.slf4j.org/codes.html#multiple_bindings for an explanation.
   [client] SLF4J: Actual binding is of type [org.apache.logging.slf4j.Log4jLoggerFactory]
   [client] Creating summariser <summary>
   [client] Created the tree successfully using testfiles/Bug54685.jmx
   [client] Configuring remote engine: localhost:2002
   [client] Starting remote engines
   [client] Starting the test @ Sun Oct 22 20:21:11 UTC 2017 (1508703671338)
   [server] Starting the test on host localhost:2002 @ Sun Oct 22 20:21:12 UTC 2017 (1508703672752)
   [client] Remote engines have been started
   [client] Waiting for possible Shutdown/StopTestNow/Heapdump message on port 4445
   [server] Finished the test on host localhost:2002 @ Sun Oct 22 20:21:13 UTC 2017 (1508703673770)
- exit requested.
   [client] summary =      1 in 00:00:00 =    3.2/s Avg:   178 Min:   178 Max:   178 Err:
    0 (0.00%)
   [client] Tidying up remote @ Sun Oct 22 20:21:13 UTC 2017 (1508703673770)
   [client] ... end of run
     [echo] Bug54685 output files compared OK

batchtest:
     [echo] Starting Bug56811 with file Bug56811.jmx using -X -Jdummy=dummy
   [jmeter] SLF4J: Class path contains multiple SLF4J bindings.
   [jmeter] SLF4J: Found binding in [jar:file:/F:/jenkins/jenkins-slave/workspace/JMeter%20Windows/trunk/lib/log4j-slf4j-impl-2.8.2.jar!/org/slf4j/impl/StaticLoggerBinder.class]
   [jmeter] SLF4J: Found binding in [jar:file:/F:/jenkins/jenkins-slave/workspace/JMeter%20Windows/trunk/lib/opt/activemq-all-5.15.2.jar!/org/slf4j/impl/StaticLoggerBinder.class]
   [jmeter] SLF4J: See http://www.slf4j.org/codes.html#multiple_bindings for an explanation.
   [jmeter] SLF4J: Actual binding is of type [org.apache.logging.slf4j.Log4jLoggerFactory]
   [jmeter] Creating summariser <summary>
   [jmeter] Created the tree successfully using testfiles/Bug56811.jmx
   [jmeter] Starting the test @ Sun Oct 22 20:21:21 UTC 2017 (1508703681630)
   [jmeter] Waiting for possible Shutdown/StopTestNow/Heapdump message on port 4445
   [jmeter] summary +      1 in 00:00:08 =    0.1/s Avg:   323 Min:   323 Max:   323 Err:
    0 (0.00%) Active: 1 Started: 4 Finished: 3
   [jmeter] summary +      8 in 00:00:01 =    7.4/s Avg:   133 Min:     0 Max:   309 Err:
    3 (37.50%) Active: 0 Started: 4 Finished: 4
   [jmeter] summary =      9 in 00:00:09 =    1.0/s Avg:   154 Min:     0 Max:   323 Err:
    3 (33.33%)
   [jmeter] Tidying up ...    @ Sun Oct 22 20:21:31 UTC 2017 (1508703691668)
   [jmeter] ... end of run
     [echo] Bug56811 output files compared OK

batchtest:
     [echo] Starting TEST_HTTPS with file TEST_HTTPS.jmx using -X -Jdummy=dummy
   [jmeter] SLF4J: Class path contains multiple SLF4J bindings.
   [jmeter] SLF4J: Found binding in [jar:file:/F:/jenkins/jenkins-slave/workspace/JMeter%20Windows/trunk/lib/log4j-slf4j-impl-2.8.2.jar!/org/slf4j/impl/StaticLoggerBinder.class]
   [jmeter] SLF4J: Found binding in [jar:file:/F:/jenkins/jenkins-slave/workspace/JMeter%20Windows/trunk/lib/opt/activemq-all-5.15.2.jar!/org/slf4j/impl/StaticLoggerBinder.class]
   [jmeter] SLF4J: See http://www.slf4j.org/codes.html#multiple_bindings for an explanation.
   [jmeter] SLF4J: Actual binding is of type [org.apache.logging.slf4j.Log4jLoggerFactory]
   [jmeter] Creating summariser <summary>
   [jmeter] Created the tree successfully using testfiles/TEST_HTTPS.jmx
   [jmeter] Starting the test @ Sun Oct 22 20:21:34 UTC 2017 (1508703694444)
   [jmeter] Waiting for possible Shutdown/StopTestNow/Heapdump message on port 4445
   [jmeter] summary =      2 in 00:00:04 =    0.5/s Avg:  1847 Min:  1440 Max:  2254 Err:
    0 (0.00%)
   [jmeter] Tidying up ...    @ Sun Oct 22 20:21:39 UTC 2017 (1508703699132)
   [jmeter] ... end of run
     [echo] TEST_HTTPS output files compared OK

batchtest:
     [echo] Starting JDBC_TESTS with file JDBC_TESTS.jmx using -X -Jdummy=dummy
   [jmeter] SLF4J: Class path contains multiple SLF4J bindings.
   [jmeter] SLF4J: Found binding in [jar:file:/F:/jenkins/jenkins-slave/workspace/JMeter%20Windows/trunk/lib/log4j-slf4j-impl-2.8.2.jar!/org/slf4j/impl/StaticLoggerBinder.class]
   [jmeter] SLF4J: Found binding in [jar:file:/F:/jenkins/jenkins-slave/workspace/JMeter%20Windows/trunk/lib/opt/activemq-all-5.15.2.jar!/org/slf4j/impl/StaticLoggerBinder.class]
   [jmeter] SLF4J: See http://www.slf4j.org/codes.html#multiple_bindings for an explanation.
   [jmeter] SLF4J: Actual binding is of type [org.apache.logging.slf4j.Log4jLoggerFactory]
   [jmeter] Creating summariser <summary>
   [jmeter] Created the tree successfully using testfiles/JDBC_TESTS.jmx
   [jmeter] Starting the test @ Sun Oct 22 20:21:41 UTC 2017 (1508703701945)
   [jmeter] Waiting for possible Shutdown/StopTestNow/Heapdump message on port 4445
   [jmeter] summary =     10 in 00:00:01 =    7.5/s Avg:    52 Min:     0 Max:   483 Err:
    0 (0.00%)
   [jmeter] Tidying up ...    @ Sun Oct 22 20:21:44 UTC 2017 (1508703704656)
   [jmeter] ... end of run
     [echo] JDBC_TESTS output files compared OK

batchtest:
     [echo] Starting JMS_TESTS with file JMS_TESTS.jmx using -X -Jdummy=dummy
   [jmeter] SLF4J: Class path contains multiple SLF4J bindings.
   [jmeter] SLF4J: Found binding in [jar:file:/F:/jenkins/jenkins-slave/workspace/JMeter%20Windows/trunk/lib/log4j-slf4j-impl-2.8.2.jar!/org/slf4j/impl/StaticLoggerBinder.class]
   [jmeter] SLF4J: Found binding in [jar:file:/F:/jenkins/jenkins-slave/workspace/JMeter%20Windows/trunk/lib/opt/activemq-all-5.15.2.jar!/org/slf4j/impl/StaticLoggerBinder.class]
   [jmeter] SLF4J: See http://www.slf4j.org/codes.html#multiple_bindings for an explanation.
   [jmeter] SLF4J: Actual binding is of type [org.apache.logging.slf4j.Log4jLoggerFactory]
   [jmeter] Creating summariser <summary>
   [jmeter] Created the tree successfully using testfiles/JMS_TESTS.jmx
   [jmeter] Starting the test @ Sun Oct 22 20:21:47 UTC 2017 (1508703707707)
   [jmeter] Waiting for possible Shutdown/StopTestNow/Heapdump message on port 4445
   [jmeter] summary =      1 in 00:00:01 =    1.9/s Avg:   380 Min:   380 Max:   380 Err:
    1 (100.00%)
   [jmeter] Tidying up ...    @ Sun Oct 22 20:21:49 UTC 2017 (1508703709494)
   [jmeter] ... end of run
   [concat] 2017-10-22 20:21:49,375 ERROR o.a.j.u.BeanShellInterpreter: Error invoking bsh
method: eval	Sourced file: inline evaluation of: ``import org.apache.activemq.broker.BrokerService;
import org.apache.activemq.brok . . . '' : Typed variable declaration : Method Invocation
BrokerFactory.createBroker
   [concat] 2017-10-22 20:21:49,381 WARN o.a.j.p.j.s.BeanShellSampler: Exception executing
script. org.apache.jorphan.util.JMeterException: Error invoking bsh method: eval	Sourced file:
inline evaluation of: ``import org.apache.activemq.broker.BrokerService; import org.apache.activemq.brok
. . . '' : Typed variable declaration : Method Invocation BrokerFactory.createBroker
Target 'batchtest' failed with message 'CSV Files are not identical.
        <https://builds.apache.org/job/JMeter%20Windows/ws/trunk\bin\testfiles\JMS_TESTS.csv>
        label,responseCode,responseMessage,threadName,dataType,success,grpThreads,allThreads,SampleCount,ErrorCount
BSS_startActiveMQ,200,OK,setUp Thread Group 1-1,text,true,1,1,1,0
JMS-P2P-DefaultCorrelationId,200,OK,TG-JMS-P2P 1-1,text,true,1,1,1,0
JSS-ConsumeUpcomingMessage,200,OK,TG-JMS-P2P 1-1,text,true,1,1,1,0
JMS-P2P-DefaultCorrelationId-TempQueue,200,OK,TG-JMS-P2P 1-1,text,true,1,1,1,0
JMS-P2P-CustomCorrelationId,200,OK,TG-JMS-P2P 1-1,text,true,1,1,1,0
JMS-P2P-DifferentSelector,,No reply message received,TG-JMS-P2P 1-1,text,true,1,1,1,0
JMS-P2P-SameSelector,200,OK,TG-JMS-P2P 1-1,text,true,1,1,1,0
JMS-P2P-RequestOnly,200,OK,TG-JMS-P2P 1-1,text,true,1,1,1,0
JSS-ConsumePreviousMessage,200,OK,TG-JMS-P2P 1-1,text,true,1,1,1,0
JMS Publisher-NonDurable,200,1 messages published,TG-JMS-PS 2-1,,true,1,1,1,0
JMS Subscriber-NonDurable,200,1 message(s) received successfully of 1 expected,TG-JMS-PS 2-1,text,true,1,1,1,0
JMS Publisher-Persistent,200,1 messages published,TG-JMS-PS-Selector-receive 3-1,,true,1,1,1,0
JMS Subscriber-NonMatchingSelector,404,0 message(s) received successfully of 1 expected,TG-JMS-PS-Selector-receive
3-1,text,true,1,1,0,0
JMS Subscriber-at-startup-onMessage,200,1 message(s) received successfully of 1 expected,TG-JMS-PS-Selector-receive
3-1,text,true,1,1,1,0
JMS Publisher-Persistent,200,1 messages published,TG-JMS-PS-Selector-onMessage 4-1,,true,1,1,1,0
JMS Subscriber-NonMatchingSelector-receive,404,0 message(s) received successfully of 1 expected,TG-JMS-PS-Selector-onMessage
4-1,text,true,1,1,0,0
JMS Subscriber-MatchingSelector-receive,200,1 message(s) received successfully of 1 expected,TG-JMS-PS-Selector-onMessage
4-1,text,true,1,1,1,0
JMS Publisher-Persistent,200,1 messages published,TG-JMS-PS-Durable 5-1,,true,1,1,1,0
JMS Subscriber-Durable,200,1 message(s) received successfully of 1 expected,TG-JMS-PS-Durable
5-1,text,true,1,1,1,0
JMS Publisher-NonPersistent,200,1 messages published,TG-JMS-PS-Selector-Non-Persistent 6-1,,true,1,1,1,0
JMS Subscriber-NP-EachSample,404,0 message(s) received successfully of 1 expected,TG-JMS-PS-Selector-Non-Persistent
6-1,text,true,1,1,0,0
JMS Subscriber-NP-OnStartup,200,1 message(s) received successfully of 1 expected,TG-JMS-PS-Selector-Non-Persistent
6-1,text,true,1,1,1,0
BSS_stopActiveMQ,200,OK,tearDown Thread Group 1-1,text,true,1,1,1,0

        <https://builds.apache.org/job/JMeter%20Windows/ws/trunk\bin\JMS_TESTS.csv>
        label,responseCode,responseMessage,threadName,dataType,success,grpThreads,allThreads,SampleCount,ErrorCount
BSS_startActiveMQ,500,org.apache.jorphan.util.JMeterException: Error invoking bsh method:
eval	Sourced file: inline evaluation of: ``import org.apache.activemq.broker.BrokerService;
import org.apache.activemq.brok . . . '' : Typed variable declaration : Method Invocation
BrokerFactory.createBroker,setUp Thread Group 1-1,text,false,1,1,1,1'.
Target 'batch_scripts' failed with message 'The following error occurred while executing this
line:
<https://builds.apache.org/job/JMeter%20Windows/ws/trunk\build.xml>:2619: CSV Files
are not identical.
        <https://builds.apache.org/job/JMeter%20Windows/ws/trunk\bin\testfiles\JMS_TESTS.csv>
        label,responseCode,responseMessage,threadName,dataType,success,grpThreads,allThreads,SampleCount,ErrorCount
BSS_startActiveMQ,200,OK,setUp Thread Group 1-1,text,true,1,1,1,0
JMS-P2P-DefaultCorrelationId,200,OK,TG-JMS-P2P 1-1,text,true,1,1,1,0
JSS-ConsumeUpcomingMessage,200,OK,TG-JMS-P2P 1-1,text,true,1,1,1,0
JMS-P2P-DefaultCorrelationId-TempQueue,200,OK,TG-JMS-P2P 1-1,text,true,1,1,1,0
JMS-P2P-CustomCorrelationId,200,OK,TG-JMS-P2P 1-1,text,true,1,1,1,0
JMS-P2P-DifferentSelector,,No reply message received,TG-JMS-P2P 1-1,text,true,1,1,1,0
JMS-P2P-SameSelector,200,OK,TG-JMS-P2P 1-1,text,true,1,1,1,0
JMS-P2P-RequestOnly,200,OK,TG-JMS-P2P 1-1,text,true,1,1,1,0
JSS-ConsumePreviousMessage,200,OK,TG-JMS-P2P 1-1,text,true,1,1,1,0
JMS Publisher-NonDurable,200,1 messages published,TG-JMS-PS 2-1,,true,1,1,1,0
JMS Subscriber-NonDurable,200,1 message(s) received successfully of 1 expected,TG-JMS-PS 2-1,text,true,1,1,1,0
JMS Publisher-Persistent,200,1 messages published,TG-JMS-PS-Selector-receive 3-1,,true,1,1,1,0
JMS Subscriber-NonMatchingSelector,404,0 message(s) received successfully of 1 expected,TG-JMS-PS-Selector-receive
3-1,text,true,1,1,0,0
JMS Subscriber-at-startup-onMessage,200,1 message(s) received successfully of 1 expected,TG-JMS-PS-Selector-receive
3-1,text,true,1,1,1,0
JMS Publisher-Persistent,200,1 messages published,TG-JMS-PS-Selector-onMessage 4-1,,true,1,1,1,0
JMS Subscriber-NonMatchingSelector-receive,404,0 message(s) received successfully of 1 expected,TG-JMS-PS-Selector-onMessage
4-1,text,true,1,1,0,0
JMS Subscriber-MatchingSelector-receive,200,1 message(s) received successfully of 1 expected,TG-JMS-PS-Selector-onMessage
4-1,text,true,1,1,1,0
JMS Publisher-Persistent,200,1 messages published,TG-JMS-PS-Durable 5-1,,true,1,1,1,0
JMS Subscriber-Durable,200,1 message(s) received successfully of 1 expected,TG-JMS-PS-Durable
5-1,text,true,1,1,1,0
JMS Publisher-NonPersistent,200,1 messages published,TG-JMS-PS-Selector-Non-Persistent 6-1,,true,1,1,1,0
JMS Subscriber-NP-EachSample,404,0 message(s) received successfully of 1 expected,TG-JMS-PS-Selector-Non-Persistent
6-1,text,true,1,1,0,0
JMS Subscriber-NP-OnStartup,200,1 message(s) received successfully of 1 expected,TG-JMS-PS-Selector-Non-Persistent
6-1,text,true,1,1,1,0
BSS_stopActiveMQ,200,OK,tearDown Thread Group 1-1,text,true,1,1,1,0

        <https://builds.apache.org/job/JMeter%20Windows/ws/trunk\bin\JMS_TESTS.csv>
        label,responseCode,responseMessage,threadName,dataType,success,grpThreads,allThreads,SampleCount,ErrorCount
BSS_startActiveMQ,500,org.apache.jorphan.util.JMeterException: Error invoking bsh method:
eval	Sourced file: inline evaluation of: ``import org.apache.activemq.broker.BrokerService;
import org.apache.activemq.brok . . . '' : Typed variable declaration : Method Invocation
BrokerFactory.createBroker,setUp Thread Group 1-1,text,false,1,1,1,1'.
Cannot execute '_allbatchtests' - 'batch_scripts' failed or was not executed.
Cannot execute 'test' - '_allbatchtests' failed or was not executed.

download_checkstyle:

_process_checkstyle_jars:

_check_exists:

_check_jarfile:
     [echo] Checking checkstyle-6.13-all.jar
     [echo] Deleting checkstyle-6.13-all.jar (excluding checkstyle-6.13-all.jar)

setproxy:

_get_jarfile:
     [echo] Fetching: lib/opt/checkstyle-6.13-all.jar
      [get] Getting: http://downloads.sourceforge.net/checkstyle/checkstyle/6.13/checkstyle-6.13-all.jar?ts=1508703383535&use_mirror=autoselect/checkstyle-6.13-all.jar
      [get] To: <https://builds.apache.org/job/JMeter%20Windows/ws/trunk\build\checkstyle-6.13-all.jar>
      [get] http://downloads.sourceforge.net/checkstyle/checkstyle/6.13/checkstyle-6.13-all.jar?ts=1508703383535&use_mirror=autoselect/checkstyle-6.13-all.jar
moved to https://netcologne.dl.sourceforge.net/project/checkstyle/checkstyle/6.13/checkstyle-6.13-all.jar

_checkMD5:
     [echo] Checksum OK: checkstyle-6.13-all.jar
     [move] Moving 1 file to <https://builds.apache.org/job/JMeter%20Windows/ws/trunk\lib\opt>
     [move] Attempting to rename: <https://builds.apache.org/job/JMeter%20Windows/ws/trunk\build\checkstyle-6.13-all.jar>
to <https://builds.apache.org/job/JMeter%20Windows/ws/trunk\lib\opt\checkstyle-6.13-all.jar>

setproxy:

_get_zipfile:

checkstyle:

_process_checkstyle_jars:

_check_exists:

_check_jarfile:
[checkstyle] Running Checkstyle 6.13 on 1056 files

BUILD FAILED
<https://builds.apache.org/job/JMeter%20Windows/ws/trunk\build.xml>:2744: The following
error occurred while executing this line:
<https://builds.apache.org/job/JMeter%20Windows/ws/trunk\build.xml>:2619: CSV Files
are not identical.
        <https://builds.apache.org/job/JMeter%20Windows/ws/trunk\bin\testfiles\JMS_TESTS.csv>
        label,responseCode,responseMessage,threadName,dataType,success,grpThreads,allThreads,SampleCount,ErrorCount
BSS_startActiveMQ,200,OK,setUp Thread Group 1-1,text,true,1,1,1,0
JMS-P2P-DefaultCorrelationId,200,OK,TG-JMS-P2P 1-1,text,true,1,1,1,0
JSS-ConsumeUpcomingMessage,200,OK,TG-JMS-P2P 1-1,text,true,1,1,1,0
JMS-P2P-DefaultCorrelationId-TempQueue,200,OK,TG-JMS-P2P 1-1,text,true,1,1,1,0
JMS-P2P-CustomCorrelationId,200,OK,TG-JMS-P2P 1-1,text,true,1,1,1,0
JMS-P2P-DifferentSelector,,No reply message received,TG-JMS-P2P 1-1,text,true,1,1,1,0
JMS-P2P-SameSelector,200,OK,TG-JMS-P2P 1-1,text,true,1,1,1,0
JMS-P2P-RequestOnly,200,OK,TG-JMS-P2P 1-1,text,true,1,1,1,0
JSS-ConsumePreviousMessage,200,OK,TG-JMS-P2P 1-1,text,true,1,1,1,0
JMS Publisher-NonDurable,200,1 messages published,TG-JMS-PS 2-1,,true,1,1,1,0
JMS Subscriber-NonDurable,200,1 message(s) received successfully of 1 expected,TG-JMS-PS 2-1,text,true,1,1,1,0
JMS Publisher-Persistent,200,1 messages published,TG-JMS-PS-Selector-receive 3-1,,true,1,1,1,0
JMS Subscriber-NonMatchingSelector,404,0 message(s) received successfully of 1 expected,TG-JMS-PS-Selector-receive
3-1,text,true,1,1,0,0
JMS Subscriber-at-startup-onMessage,200,1 message(s) received successfully of 1 expected,TG-JMS-PS-Selector-receive
3-1,text,true,1,1,1,0
JMS Publisher-Persistent,200,1 messages published,TG-JMS-PS-Selector-onMessage 4-1,,true,1,1,1,0
JMS Subscriber-NonMatchingSelector-receive,404,0 message(s) received successfully of 1 expected,TG-JMS-PS-Selector-onMessage
4-1,text,true,1,1,0,0
JMS Subscriber-MatchingSelector-receive,200,1 message(s) received successfully of 1 expected,TG-JMS-PS-Selector-onMessage
4-1,text,true,1,1,1,0
JMS Publisher-Persistent,200,1 messages published,TG-JMS-PS-Durable 5-1,,true,1,1,1,0
JMS Subscriber-Durable,200,1 message(s) received successfully of 1 expected,TG-JMS-PS-Durable
5-1,text,true,1,1,1,0
JMS Publisher-NonPersistent,200,1 messages published,TG-JMS-PS-Selector-Non-Persistent 6-1,,true,1,1,1,0
JMS Subscriber-NP-EachSample,404,0 message(s) received successfully of 1 expected,TG-JMS-PS-Selector-Non-Persistent
6-1,text,true,1,1,0,0
JMS Subscriber-NP-OnStartup,200,1 message(s) received successfully of 1 expected,TG-JMS-PS-Selector-Non-Persistent
6-1,text,true,1,1,1,0
BSS_stopActiveMQ,200,OK,tearDown Thread Group 1-1,text,true,1,1,1,0

        <https://builds.apache.org/job/JMeter%20Windows/ws/trunk\bin\JMS_TESTS.csv>
        label,responseCode,responseMessage,threadName,dataType,success,grpThreads,allThreads,SampleCount,ErrorCount
BSS_startActiveMQ,500,org.apache.jorphan.util.JMeterException: Error invoking bsh method:
eval	Sourced file: inline evaluation of: ``import org.apache.activemq.broker.BrokerService;
import org.apache.activemq.brok . . . '' : Typed variable declaration : Method Invocation
BrokerFactory.createBroker,setUp Thread Group 1-1,text,false,1,1,1,1

Total time: 5 minutes 35 seconds
Build step 'Invoke Ant' marked build as failure

Mime
View raw message