jmeter-dev mailing list archives

Site index · List index
Message view « Date » · « Thread »
Top « Date » · « Thread »
From Philippe Mouawad <philippe.moua...@gmail.com>
Subject Re: Build failed in Jenkins: JMeter Windows #663
Date Wed, 12 Jul 2017 20:54:41 GMT
You're the best !

On Mon, Jul 10, 2017 at 9:13 PM, Felix Schumacher <
felix.schumacher@internetallee.de> wrote:

> Am 08.07.2017 um 11:05 schrieb Philippe Mouawad:
>
>> Hi Felix,
>> There is something weird, as the request has a header to get only a range
>> of bytes from 0-7000.
>> Do you think returned header have changed ?
>>
> Well, I think I have found the missing byte. There are three ip's
> registered for jmeter.apache.org. Two of those servers return "Server:
> Apache/2.4.7 (Ubuntu)" and one "... 2.4.18 ...".
>
> Felix
>
>
>
>> Thanks
>>
>> On Sat, Jul 8, 2017 at 11:03 AM, Felix Schumacher <
>> felix.schumacher@internetallee.de> wrote:
>>
>>   Seems like the length of the start page changed back again :(
>>>
>>> Felix
>>>
>>>
>>> Am 8. Juli 2017 10:49:43 MESZ schrieb Apache Jenkins Server <
>>> jenkins@builds.apache.org>:
>>>
>>>> See
>>>> <https://builds.apache.org/job/JMeter%20Windows/663/display/redirect>
>>>>
>>>> ------------------------------------------
>>>> [...truncated 140.76 KB...]
>>>>   </assertionResult>
>>>>   <assertionResult>
>>>>     <name>JSA-CheckResponseTimeHigherThan5s</name>
>>>>     <failure>false</failure>
>>>>     <error>false</error>
>>>>   </assertionResult>
>>>> </httpSample>
>>>>
>>>> </testResults>'.
>>>> Target 'batch_scripts' failed with message 'The following error
>>>> occurred while executing this line:
>>>> <https://builds.apache.org/job/JMeter%20Windows/ws/trunk\build.xml
>>>> <https://builds.apache.org/job/JMeter%20Windows/ws/trunk%5Cbuild.xml>
>>>> >:2624:
>>>> XML Files are not identical.
>>>> <https://builds.apache.org/job/JMeter%20Windows/ws/trunk\bin\testfiles\
>>>> <https://builds.apache.org/job/JMeter%20Windows/ws/trunk%5Cbin%5Ctestfiles%5C>
>>>>
>>> SlowCharsFeature_HttpClient4.xml>
>>>
>>>>         <?xml version="1.0" encoding="UTF-8"?>
>>>> <testResults version="1.2">
>>>> <sample s="true" lb="JSR223 Sampler" rc="200" rm="OK" tn="setUp Thread
>>>> Group 1-1" dt="text" by="0"/>
>>>> <httpSample s="true" lb="ApacheJMeter-HP-NonSecure" rc="206"
>>>> rm="Partial Content" tn="Thread Group 1-1" dt="text" by="7360">
>>>>   <assertionResult>
>>>>     <name>RA_206</name>
>>>>     <failure>false</failure>
>>>>     <error>false</error>
>>>>   </assertionResult>
>>>>   <assertionResult>
>>>>     <name>RA</name>
>>>>     <failure>false</failure>
>>>>     <error>false</error>
>>>>   </assertionResult>
>>>>   <assertionResult>
>>>>     <name>RA_PartialContent</name>
>>>>     <failure>false</failure>
>>>>     <error>false</error>
>>>>   </assertionResult>
>>>>   <assertionResult>
>>>>     <name>JSA-CheckResponseTimeHigherThan5s</name>
>>>>     <failure>false</failure>
>>>>     <error>false</error>
>>>>   </assertionResult>
>>>> </httpSample>
>>>> <httpSample s="true" lb="ApacheJMeter-HP-Secure" rc="206" rm="Partial
>>>> Content" tn="Thread Group 1-1" dt="text" by="7360">
>>>>   <assertionResult>
>>>>     <name>RA_206</name>
>>>>     <failure>false</failure>
>>>>     <error>false</error>
>>>>   </assertionResult>
>>>>   <assertionResult>
>>>>     <name>RA</name>
>>>>     <failure>false</failure>
>>>>     <error>false</error>
>>>>   </assertionResult>
>>>>   <assertionResult>
>>>>     <name>RA_PartialContent</name>
>>>>     <failure>false</failure>
>>>>     <error>false</error>
>>>>   </assertionResult>
>>>>   <assertionResult>
>>>>     <name>JSA-CheckResponseTimeHigherThan5s</name>
>>>>     <failure>false</failure>
>>>>     <error>false</error>
>>>>   </assertionResult>
>>>> </httpSample>
>>>>
>>>> </testResults>
>>>>
>>>> <https://builds.apache.org/job/JMeter%20Windows/ws/trunk\
>>>> <https://builds.apache.org/job/JMeter%20Windows/ws/trunk%5C>
>>>>
>>> bin\SlowCharsFeature_HttpClient4.xml>
>>>
>>>>         <?xml version="1.0" encoding="UTF-8"?>
>>>> <testResults version="1.2">
>>>> <sample s="true" lb="JSR223 Sampler" rc="200" rm="OK" tn="setUp Thread
>>>> Group 1-1" dt="text" by="0"/>
>>>> <httpSample s="true" lb="ApacheJMeter-HP-NonSecure" rc="206"
>>>> rm="Partial Content" tn="Thread Group 1-1" dt="text" by="7359">
>>>>   <assertionResult>
>>>>     <name>RA_206</name>
>>>>     <failure>false</failure>
>>>>     <error>false</error>
>>>>   </assertionResult>
>>>>   <assertionResult>
>>>>     <name>RA</name>
>>>>     <failure>false</failure>
>>>>     <error>false</error>
>>>>   </assertionResult>
>>>>   <assertionResult>
>>>>     <name>RA_PartialContent</name>
>>>>     <failure>false</failure>
>>>>     <error>false</error>
>>>>   </assertionResult>
>>>>   <assertionResult>
>>>>     <name>JSA-CheckResponseTimeHigherThan5s</name>
>>>>     <failure>false</failure>
>>>>     <error>false</error>
>>>>   </assertionResult>
>>>> </httpSample>
>>>> <httpSample s="true" lb="ApacheJMeter-HP-Secure" rc="206" rm="Partial
>>>> Content" tn="Thread Group 1-1" dt="text" by="7359">
>>>>   <assertionResult>
>>>>     <name>RA_206</name>
>>>>     <failure>false</failure>
>>>>     <error>false</error>
>>>>   </assertionResult>
>>>>   <assertionResult>
>>>>     <name>RA</name>
>>>>     <failure>false</failure>
>>>>     <error>false</error>
>>>>   </assertionResult>
>>>>   <assertionResult>
>>>>     <name>RA_PartialContent</name>
>>>>     <failure>false</failure>
>>>>     <error>false</error>
>>>>   </assertionResult>
>>>>   <assertionResult>
>>>>     <name>JSA-CheckResponseTimeHigherThan5s</name>
>>>>     <failure>false</failure>
>>>>     <error>false</error>
>>>>   </assertionResult>
>>>> </httpSample>
>>>>
>>>> </testResults>'.
>>>> Cannot execute '_allbatchtests' - 'batch_scripts' failed or was not
>>>> executed.
>>>> Cannot execute 'test' - '_allbatchtests' failed or was not executed.
>>>>
>>>> download_checkstyle:
>>>>
>>>> _process_checkstyle_jars:
>>>>
>>>> _check_exists:
>>>>
>>>> _check_jarfile:
>>>>      [echo] Checking checkstyle-6.13-all.jar
>>>> [echo] Deleting checkstyle-6.13-all.jar (excluding
>>>> checkstyle-6.13-all.jar)
>>>>
>>>> setproxy:
>>>>
>>>> _get_jarfile:
>>>>
>>>> setproxy:
>>>>
>>>> _get_zipfile:
>>>>
>>>> checkstyle:
>>>>
>>>> _process_checkstyle_jars:
>>>>
>>>> _check_exists:
>>>>
>>>> _check_jarfile:
>>>> [checkstyle] Running Checkstyle 6.13 on 1048 files
>>>>
>>>> BUILD FAILED
>>>> <https://builds.apache.org/job/JMeter%20Windows/ws/trunk\build.xml
>>>> <https://builds.apache.org/job/JMeter%20Windows/ws/trunk%5Cbuild.xml>
>>>> >:2734:
>>>> The following error occurred while executing this line:
>>>> <https://builds.apache.org/job/JMeter%20Windows/ws/trunk\build.xml
>>>> <https://builds.apache.org/job/JMeter%20Windows/ws/trunk%5Cbuild.xml>
>>>> >:2624:
>>>> XML Files are not identical.
>>>> <https://builds.apache.org/job/JMeter%20Windows/ws/trunk\bin\testfiles\
>>>> <https://builds.apache.org/job/JMeter%20Windows/ws/trunk%5Cbin%5Ctestfiles%5C>
>>>>
>>> SlowCharsFeature_HttpClient4.xml>
>>>
>>>>         <?xml version="1.0" encoding="UTF-8"?>
>>>> <testResults version="1.2">
>>>> <sample s="true" lb="JSR223 Sampler" rc="200" rm="OK" tn="setUp Thread
>>>> Group 1-1" dt="text" by="0"/>
>>>> <httpSample s="true" lb="ApacheJMeter-HP-NonSecure" rc="206"
>>>> rm="Partial Content" tn="Thread Group 1-1" dt="text" by="7360">
>>>>   <assertionResult>
>>>>     <name>RA_206</name>
>>>>     <failure>false</failure>
>>>>     <error>false</error>
>>>>   </assertionResult>
>>>>   <assertionResult>
>>>>     <name>RA</name>
>>>>     <failure>false</failure>
>>>>     <error>false</error>
>>>>   </assertionResult>
>>>>   <assertionResult>
>>>>     <name>RA_PartialContent</name>
>>>>     <failure>false</failure>
>>>>     <error>false</error>
>>>>   </assertionResult>
>>>>   <assertionResult>
>>>>     <name>JSA-CheckResponseTimeHigherThan5s</name>
>>>>     <failure>false</failure>
>>>>     <error>false</error>
>>>>   </assertionResult>
>>>> </httpSample>
>>>> <httpSample s="true" lb="ApacheJMeter-HP-Secure" rc="206" rm="Partial
>>>> Content" tn="Thread Group 1-1" dt="text" by="7360">
>>>>   <assertionResult>
>>>>     <name>RA_206</name>
>>>>     <failure>false</failure>
>>>>     <error>false</error>
>>>>   </assertionResult>
>>>>   <assertionResult>
>>>>     <name>RA</name>
>>>>     <failure>false</failure>
>>>>     <error>false</error>
>>>>   </assertionResult>
>>>>   <assertionResult>
>>>>     <name>RA_PartialContent</name>
>>>>     <failure>false</failure>
>>>>     <error>false</error>
>>>>   </assertionResult>
>>>>   <assertionResult>
>>>>     <name>JSA-CheckResponseTimeHigherThan5s</name>
>>>>     <failure>false</failure>
>>>>     <error>false</error>
>>>>   </assertionResult>
>>>> </httpSample>
>>>>
>>>> </testResults>
>>>>
>>>> <https://builds.apache.org/job/JMeter%20Windows/ws/trunk\
>>>> <https://builds.apache.org/job/JMeter%20Windows/ws/trunk%5C>
>>>>
>>> bin\SlowCharsFeature_HttpClient4.xml>
>>>
>>>>         <?xml version="1.0" encoding="UTF-8"?>
>>>> <testResults version="1.2">
>>>> <sample s="true" lb="JSR223 Sampler" rc="200" rm="OK" tn="setUp Thread
>>>> Group 1-1" dt="text" by="0"/>
>>>> <httpSample s="true" lb="ApacheJMeter-HP-NonSecure" rc="206"
>>>> rm="Partial Content" tn="Thread Group 1-1" dt="text" by="7359">
>>>>   <assertionResult>
>>>>     <name>RA_206</name>
>>>>     <failure>false</failure>
>>>>     <error>false</error>
>>>>   </assertionResult>
>>>>   <assertionResult>
>>>>     <name>RA</name>
>>>>     <failure>false</failure>
>>>>     <error>false</error>
>>>>   </assertionResult>
>>>>   <assertionResult>
>>>>     <name>RA_PartialContent</name>
>>>>     <failure>false</failure>
>>>>     <error>false</error>
>>>>   </assertionResult>
>>>>   <assertionResult>
>>>>     <name>JSA-CheckResponseTimeHigherThan5s</name>
>>>>     <failure>false</failure>
>>>>     <error>false</error>
>>>>   </assertionResult>
>>>> </httpSample>
>>>> <httpSample s="true" lb="ApacheJMeter-HP-Secure" rc="206" rm="Partial
>>>> Content" tn="Thread Group 1-1" dt="text" by="7359">
>>>>   <assertionResult>
>>>>     <name>RA_206</name>
>>>>     <failure>false</failure>
>>>>     <error>false</error>
>>>>   </assertionResult>
>>>>   <assertionResult>
>>>>     <name>RA</name>
>>>>     <failure>false</failure>
>>>>     <error>false</error>
>>>>   </assertionResult>
>>>>   <assertionResult>
>>>>     <name>RA_PartialContent</name>
>>>>     <failure>false</failure>
>>>>     <error>false</error>
>>>>   </assertionResult>
>>>>   <assertionResult>
>>>>     <name>JSA-CheckResponseTimeHigherThan5s</name>
>>>>     <failure>false</failure>
>>>>     <error>false</error>
>>>>   </assertionResult>
>>>> </httpSample>
>>>>
>>>> </testResults>
>>>>
>>>> Total time: 6 minutes 40 seconds
>>>> Build step 'Invoke Ant' marked build as failure
>>>>
>>>
>>
>>
>


-- 
Cordialement.
Philippe Mouawad.

Mime
  • Unnamed multipart/alternative (inline, None, 0 bytes)
View raw message