jmeter-dev mailing list archives

Site index · List index
Message view « Date » · « Thread »
Top « Date » · « Thread »
From Apache Jenkins Server <jenk...@builds.apache.org>
Subject Build failed in Jenkins: JMeter Windows #663
Date Sat, 08 Jul 2017 08:49:43 GMT
See <https://builds.apache.org/job/JMeter%20Windows/663/display/redirect>

------------------------------------------
[...truncated 140.76 KB...]
  </assertionResult>
  <assertionResult>
    <name>JSA-CheckResponseTimeHigherThan5s</name>
    <failure>false</failure>
    <error>false</error>
  </assertionResult>
</httpSample>

</testResults>'.
Target 'batch_scripts' failed with message 'The following error occurred while executing this
line:
<https://builds.apache.org/job/JMeter%20Windows/ws/trunk\build.xml>:2624: XML Files
are not identical.
        <https://builds.apache.org/job/JMeter%20Windows/ws/trunk\bin\testfiles\SlowCharsFeature_HttpClient4.xml>
        <?xml version="1.0" encoding="UTF-8"?>
<testResults version="1.2">
<sample s="true" lb="JSR223 Sampler" rc="200" rm="OK" tn="setUp Thread Group 1-1" dt="text"
by="0"/>
<httpSample s="true" lb="ApacheJMeter-HP-NonSecure" rc="206" rm="Partial Content" tn="Thread
Group 1-1" dt="text" by="7360">
  <assertionResult>
    <name>RA_206</name>
    <failure>false</failure>
    <error>false</error>
  </assertionResult>
  <assertionResult>
    <name>RA</name>
    <failure>false</failure>
    <error>false</error>
  </assertionResult>
  <assertionResult>
    <name>RA_PartialContent</name>
    <failure>false</failure>
    <error>false</error>
  </assertionResult>
  <assertionResult>
    <name>JSA-CheckResponseTimeHigherThan5s</name>
    <failure>false</failure>
    <error>false</error>
  </assertionResult>
</httpSample>
<httpSample s="true" lb="ApacheJMeter-HP-Secure" rc="206" rm="Partial Content" tn="Thread
Group 1-1" dt="text" by="7360">
  <assertionResult>
    <name>RA_206</name>
    <failure>false</failure>
    <error>false</error>
  </assertionResult>
  <assertionResult>
    <name>RA</name>
    <failure>false</failure>
    <error>false</error>
  </assertionResult>
  <assertionResult>
    <name>RA_PartialContent</name>
    <failure>false</failure>
    <error>false</error>
  </assertionResult>
  <assertionResult>
    <name>JSA-CheckResponseTimeHigherThan5s</name>
    <failure>false</failure>
    <error>false</error>
  </assertionResult>
</httpSample>

</testResults>

        <https://builds.apache.org/job/JMeter%20Windows/ws/trunk\bin\SlowCharsFeature_HttpClient4.xml>
        <?xml version="1.0" encoding="UTF-8"?>
<testResults version="1.2">
<sample s="true" lb="JSR223 Sampler" rc="200" rm="OK" tn="setUp Thread Group 1-1" dt="text"
by="0"/>
<httpSample s="true" lb="ApacheJMeter-HP-NonSecure" rc="206" rm="Partial Content" tn="Thread
Group 1-1" dt="text" by="7359">
  <assertionResult>
    <name>RA_206</name>
    <failure>false</failure>
    <error>false</error>
  </assertionResult>
  <assertionResult>
    <name>RA</name>
    <failure>false</failure>
    <error>false</error>
  </assertionResult>
  <assertionResult>
    <name>RA_PartialContent</name>
    <failure>false</failure>
    <error>false</error>
  </assertionResult>
  <assertionResult>
    <name>JSA-CheckResponseTimeHigherThan5s</name>
    <failure>false</failure>
    <error>false</error>
  </assertionResult>
</httpSample>
<httpSample s="true" lb="ApacheJMeter-HP-Secure" rc="206" rm="Partial Content" tn="Thread
Group 1-1" dt="text" by="7359">
  <assertionResult>
    <name>RA_206</name>
    <failure>false</failure>
    <error>false</error>
  </assertionResult>
  <assertionResult>
    <name>RA</name>
    <failure>false</failure>
    <error>false</error>
  </assertionResult>
  <assertionResult>
    <name>RA_PartialContent</name>
    <failure>false</failure>
    <error>false</error>
  </assertionResult>
  <assertionResult>
    <name>JSA-CheckResponseTimeHigherThan5s</name>
    <failure>false</failure>
    <error>false</error>
  </assertionResult>
</httpSample>

</testResults>'.
Cannot execute '_allbatchtests' - 'batch_scripts' failed or was not executed.
Cannot execute 'test' - '_allbatchtests' failed or was not executed.

download_checkstyle:

_process_checkstyle_jars:

_check_exists:

_check_jarfile:
     [echo] Checking checkstyle-6.13-all.jar
     [echo] Deleting checkstyle-6.13-all.jar (excluding checkstyle-6.13-all.jar)

setproxy:

_get_jarfile:

setproxy:

_get_zipfile:

checkstyle:

_process_checkstyle_jars:

_check_exists:

_check_jarfile:
[checkstyle] Running Checkstyle 6.13 on 1048 files

BUILD FAILED
<https://builds.apache.org/job/JMeter%20Windows/ws/trunk\build.xml>:2734: The following
error occurred while executing this line:
<https://builds.apache.org/job/JMeter%20Windows/ws/trunk\build.xml>:2624: XML Files
are not identical.
        <https://builds.apache.org/job/JMeter%20Windows/ws/trunk\bin\testfiles\SlowCharsFeature_HttpClient4.xml>
        <?xml version="1.0" encoding="UTF-8"?>
<testResults version="1.2">
<sample s="true" lb="JSR223 Sampler" rc="200" rm="OK" tn="setUp Thread Group 1-1" dt="text"
by="0"/>
<httpSample s="true" lb="ApacheJMeter-HP-NonSecure" rc="206" rm="Partial Content" tn="Thread
Group 1-1" dt="text" by="7360">
  <assertionResult>
    <name>RA_206</name>
    <failure>false</failure>
    <error>false</error>
  </assertionResult>
  <assertionResult>
    <name>RA</name>
    <failure>false</failure>
    <error>false</error>
  </assertionResult>
  <assertionResult>
    <name>RA_PartialContent</name>
    <failure>false</failure>
    <error>false</error>
  </assertionResult>
  <assertionResult>
    <name>JSA-CheckResponseTimeHigherThan5s</name>
    <failure>false</failure>
    <error>false</error>
  </assertionResult>
</httpSample>
<httpSample s="true" lb="ApacheJMeter-HP-Secure" rc="206" rm="Partial Content" tn="Thread
Group 1-1" dt="text" by="7360">
  <assertionResult>
    <name>RA_206</name>
    <failure>false</failure>
    <error>false</error>
  </assertionResult>
  <assertionResult>
    <name>RA</name>
    <failure>false</failure>
    <error>false</error>
  </assertionResult>
  <assertionResult>
    <name>RA_PartialContent</name>
    <failure>false</failure>
    <error>false</error>
  </assertionResult>
  <assertionResult>
    <name>JSA-CheckResponseTimeHigherThan5s</name>
    <failure>false</failure>
    <error>false</error>
  </assertionResult>
</httpSample>

</testResults>

        <https://builds.apache.org/job/JMeter%20Windows/ws/trunk\bin\SlowCharsFeature_HttpClient4.xml>
        <?xml version="1.0" encoding="UTF-8"?>
<testResults version="1.2">
<sample s="true" lb="JSR223 Sampler" rc="200" rm="OK" tn="setUp Thread Group 1-1" dt="text"
by="0"/>
<httpSample s="true" lb="ApacheJMeter-HP-NonSecure" rc="206" rm="Partial Content" tn="Thread
Group 1-1" dt="text" by="7359">
  <assertionResult>
    <name>RA_206</name>
    <failure>false</failure>
    <error>false</error>
  </assertionResult>
  <assertionResult>
    <name>RA</name>
    <failure>false</failure>
    <error>false</error>
  </assertionResult>
  <assertionResult>
    <name>RA_PartialContent</name>
    <failure>false</failure>
    <error>false</error>
  </assertionResult>
  <assertionResult>
    <name>JSA-CheckResponseTimeHigherThan5s</name>
    <failure>false</failure>
    <error>false</error>
  </assertionResult>
</httpSample>
<httpSample s="true" lb="ApacheJMeter-HP-Secure" rc="206" rm="Partial Content" tn="Thread
Group 1-1" dt="text" by="7359">
  <assertionResult>
    <name>RA_206</name>
    <failure>false</failure>
    <error>false</error>
  </assertionResult>
  <assertionResult>
    <name>RA</name>
    <failure>false</failure>
    <error>false</error>
  </assertionResult>
  <assertionResult>
    <name>RA_PartialContent</name>
    <failure>false</failure>
    <error>false</error>
  </assertionResult>
  <assertionResult>
    <name>JSA-CheckResponseTimeHigherThan5s</name>
    <failure>false</failure>
    <error>false</error>
  </assertionResult>
</httpSample>

</testResults>

Total time: 6 minutes 40 seconds
Build step 'Invoke Ant' marked build as failure

Mime
View raw message