jmeter-dev mailing list archives

Site index · List index
Message view « Date » · « Thread »
Top « Date » · « Thread »
From Apache Jenkins Server <jenk...@builds.apache.org>
Subject Build failed in Jenkins: JMeter Ubuntu #26
Date Fri, 05 May 2017 08:14:50 GMT
See <https://builds.apache.org/job/JMeter%20Ubuntu/26/display/redirect?page=changes>

Changes:

[milamber] No space before colon char

[milamber] HTTP Test Script Recorder : Port field is very small under some Windows LAF
HTTP(S) Test Script Recorder panel have some fields with bad size on HiDPI screen or GTK+
L&F on Linux/XWayland
Not needed to use the MinimumSize or PreferredSize for UI panel/components, let's the UI manager
set the good dimension depending the L&F settings
Using the icon size settings for images on control panel

Bugzilla Id: 60995

------------------------------------------
[...truncated 457.92 KB...]
      [jar] Building jar: <https://builds.apache.org/job/JMeter%20Ubuntu/ws/trunk/lib/ext/ApacheJMeter_components.jar>
      [jar] Building jar: <https://builds.apache.org/job/JMeter%20Ubuntu/ws/trunk/lib/ext/ApacheJMeter_functions.jar>
      [jar] Building jar: <https://builds.apache.org/job/JMeter%20Ubuntu/ws/trunk/lib/ext/ApacheJMeter_http.jar>
      [jar] Building jar: <https://builds.apache.org/job/JMeter%20Ubuntu/ws/trunk/lib/ext/ApacheJMeter_ftp.jar>
      [jar] Building jar: <https://builds.apache.org/job/JMeter%20Ubuntu/ws/trunk/lib/ext/ApacheJMeter_jdbc.jar>
      [jar] Building jar: <https://builds.apache.org/job/JMeter%20Ubuntu/ws/trunk/lib/ext/ApacheJMeter_java.jar>
      [jar] Building jar: <https://builds.apache.org/job/JMeter%20Ubuntu/ws/trunk/lib/bshclient.jar>
      [jar] Building jar: <https://builds.apache.org/job/JMeter%20Ubuntu/ws/trunk/lib/ext/ApacheJMeter_junit.jar>
      [jar] Building jar: <https://builds.apache.org/job/JMeter%20Ubuntu/ws/trunk/lib/junit/test.jar>
      [jar] Building jar: <https://builds.apache.org/job/JMeter%20Ubuntu/ws/trunk/lib/ext/ApacheJMeter_ldap.jar>
      [jar] Building jar: <https://builds.apache.org/job/JMeter%20Ubuntu/ws/trunk/lib/ext/ApacheJMeter_mail.jar>
      [jar] Building jar: <https://builds.apache.org/job/JMeter%20Ubuntu/ws/trunk/lib/ext/ApacheJMeter_tcp.jar>
      [jar] Building jar: <https://builds.apache.org/job/JMeter%20Ubuntu/ws/trunk/lib/ext/ApacheJMeter_jms.jar>
      [jar] Building jar: <https://builds.apache.org/job/JMeter%20Ubuntu/ws/trunk/lib/ext/ApacheJMeter_native.jar>
      [jar] Building jar: <https://builds.apache.org/job/JMeter%20Ubuntu/ws/trunk/lib/ext/ApacheJMeter_mongodb.jar>
      [jar] Building jar: <https://builds.apache.org/job/JMeter%20Ubuntu/ws/trunk/lib/jorphan.jar>

package:

_check_3rdparty:

_message_3rdParty:

init-version:
     [echo] jmeter.version = 3.3-SNAPSHOT
     [echo] display.version = 3.3-SNAPSHOT r1793968
     [echo] implementation.version = 3.3-SNAPSHOT r1793968

compile-jorphan:

compile-core:

compile-components:

compile-functions:

compile-http:

compile-ftp:

compile-jdbc:

compile-java:

compile-ldap:

create-mail-dir:

compile-mail:

compile-tcp:

compile-protocols:

compile-junit:

compile-jms:

compile-native:

compile-mongodb:

compile:

compile-tests:
    [mkdir] Created dir: <https://builds.apache.org/job/JMeter%20Ubuntu/ws/trunk/build/test>
    [javac] Compiling 179 source files to <https://builds.apache.org/job/JMeter%20Ubuntu/ws/trunk/build/test>

prepare-resources:
     [copy] Copying 3 files to <https://builds.apache.org/job/JMeter%20Ubuntu/ws/trunk/build/res/META-INF>

package-only:
      [jar] Building jar: <https://builds.apache.org/job/JMeter%20Ubuntu/ws/trunk/bin/ApacheJMeter.jar>
      [jar] Building jar: <https://builds.apache.org/job/JMeter%20Ubuntu/ws/trunk/lib/ext/ApacheJMeter_core.jar>
      [jar] Building jar: <https://builds.apache.org/job/JMeter%20Ubuntu/ws/trunk/lib/ext/ApacheJMeter_components.jar>
      [jar] Building jar: <https://builds.apache.org/job/JMeter%20Ubuntu/ws/trunk/lib/ext/ApacheJMeter_functions.jar>
      [jar] Building jar: <https://builds.apache.org/job/JMeter%20Ubuntu/ws/trunk/lib/ext/ApacheJMeter_http.jar>
      [jar] Building jar: <https://builds.apache.org/job/JMeter%20Ubuntu/ws/trunk/lib/ext/ApacheJMeter_ftp.jar>
      [jar] Building jar: <https://builds.apache.org/job/JMeter%20Ubuntu/ws/trunk/lib/ext/ApacheJMeter_jdbc.jar>
      [jar] Building jar: <https://builds.apache.org/job/JMeter%20Ubuntu/ws/trunk/lib/ext/ApacheJMeter_java.jar>
      [jar] Building jar: <https://builds.apache.org/job/JMeter%20Ubuntu/ws/trunk/lib/bshclient.jar>
      [jar] Building jar: <https://builds.apache.org/job/JMeter%20Ubuntu/ws/trunk/lib/ext/ApacheJMeter_junit.jar>
      [jar] Building jar: <https://builds.apache.org/job/JMeter%20Ubuntu/ws/trunk/lib/junit/test.jar>
      [jar] Building jar: <https://builds.apache.org/job/JMeter%20Ubuntu/ws/trunk/lib/ext/ApacheJMeter_ldap.jar>
      [jar] Building jar: <https://builds.apache.org/job/JMeter%20Ubuntu/ws/trunk/lib/ext/ApacheJMeter_mail.jar>
      [jar] Building jar: <https://builds.apache.org/job/JMeter%20Ubuntu/ws/trunk/lib/ext/ApacheJMeter_tcp.jar>
      [jar] Building jar: <https://builds.apache.org/job/JMeter%20Ubuntu/ws/trunk/lib/ext/ApacheJMeter_jms.jar>
      [jar] Building jar: <https://builds.apache.org/job/JMeter%20Ubuntu/ws/trunk/lib/ext/ApacheJMeter_native.jar>
      [jar] Building jar: <https://builds.apache.org/job/JMeter%20Ubuntu/ws/trunk/lib/ext/ApacheJMeter_mongodb.jar>
      [jar] Building jar: <https://builds.apache.org/job/JMeter%20Ubuntu/ws/trunk/lib/jorphan.jar>

package:

_test:
     [echo] 
     [echo]    gump.run = false
     [echo]    java.awt.headless = true
     [echo]    test.headless = true
     [echo]    user.dir = <https://builds.apache.org/job/JMeter%20Ubuntu/ws/trunk>
     [echo]    basedir = <https://builds.apache.org/job/JMeter%20Ubuntu/ws/trunk>
     [echo]    test dir = build/test
     [echo]    test dir gump = build/test
     [echo]    testsaveservice.saveout = ${testsaveservice.saveout}
     [echo]    test.encoding = UTF-8
     [echo]     
     [java] Setting JMeterHome: <https://builds.apache.org/job/JMeter%20Ubuntu/ws/trunk>
     [java] Using initializeProperties() from org.apache.jmeter.util.JMeterUtils
     [java] Setting up initial properties using: <https://builds.apache.org/job/JMeter%20Ubuntu/ws/trunk/bin/jmeter.properties>
     [java] Initializing Properties: <https://builds.apache.org/job/JMeter%20Ubuntu/ws/trunk/bin/jmeter.properties>
     [java] JMeterVersion=3.3-SNAPSHOT r1793968
     [java] java.version=1.8.0_121
     [java] java.home=/usr/local/asfpackages/java/jdk1.8.0_121/jre
     [java] file.encoding=UTF-8
     [java] default encoding=UTF-8
     [java] user.dir=<https://builds.apache.org/job/JMeter%20Ubuntu/ws/trunk/bin>
     [java] Locale=en_US
     [java] os.name=Linux
     [java] os.version=4.8.3-std-1
     [java] JCE max key length = 128
     [java] +++++++++++
     [java] java.awt.headless=true
     [java] java.awt.graphicsenv=sun.awt.X11GraphicsEnvironment
     [java] ------------
     [java] Searching junit tests in : build/test
     [java] o.a.j.junit.JMeterTest INFO: JMeterGUIComponent: skipping some tests org.apache.jmeter.testbeans.gui.TestBeanGUI
     [java] o.a.j.junit.JMeterTest Error creating org.apache.jmeter.SplashScreen java.awt.HeadlessException
     [java] o.a.j.junit.JMeterTest Error creating org.apache.jmeter.config.gui.RowDetailDialog
java.awt.HeadlessException
     [java] o.a.j.junit.JMeterTest Error creating org.apache.jmeter.functions.gui.FunctionHelper
java.awt.HeadlessException
     [java] o.a.j.junit.JMeterTest Error creating org.apache.jmeter.gui.MainFrame java.awt.HeadlessException
     [java] o.a.j.junit.JMeterTest Error creating org.apache.jmeter.gui.SavePropertyDialog
java.awt.HeadlessException
     [java] o.a.j.junit.JMeterTest Error creating org.apache.jmeter.gui.action.SearchTreeDialog
java.awt.HeadlessException
     [java] o.a.j.junit.JMeterTest Error creating org.apache.jmeter.gui.action.SelectTemplatesDialog
java.awt.HeadlessException
     [java] o.a.j.junit.JMeterTest Error creating org.apache.jmeter.gui.util.EscapeDialog
java.awt.HeadlessException
     [java] o.a.j.junit.JMeterTest Error creating org.apache.jmeter.gui.util.JSyntaxTextArea
java.awt.HeadlessException
     [java] java.rmi.server.hostname=null
     [java] qnode1/127.0.1.1
     [java] isSiteLocalAddress:false
     [java] isAnyLocalAddress:false
     [java] isLinkLocalAddress:false
     [java] isLoopbackAddress:true
     [java] isMulticastAddress:false
     [java] localhost/127.0.0.1
     [java] isSiteLocalAddress:false
     [java] isAnyLocalAddress:false
     [java] isLinkLocalAddress:false
     [java] isLoopbackAddress:true
     [java] isMulticastAddress:false
     [java] ====================
     [java] qnode1/127.0.1.1
     [java] isSiteLocalAddress:false
     [java] isAnyLocalAddress:false
     [java] isLinkLocalAddress:false
     [java] isLoopbackAddress:true
     [java] isMulticastAddress:false
     [java] ...............................................................................................................I....................................................................................................................................................................................................................................................................................................................................................................................................................................................................................................................................................................................................................................................................................................................................................................................................................................................................................................................................................................................................................................................................................................................................................................................................................................................................................................................................................................................................................................................................................................................................................................................................................................................................................................................................................................................................................................................................................................................................................................................................................................................................................................................................................................................................................................................................................................................................................................................................................................................................................................................................................................................................................................................................................................................................................................................................................................................
     [java] Time: 81.616
     [java] 
     [java] OK (2851 tests)
     [java] 

batchtest:
     [echo] Starting BatchTestLocal with file BatchTestLocal.jmx using -X -Jdummy=dummy
   [jmeter] Creating summariser <summary>
   [jmeter] Created the tree successfully using testfiles/BatchTestLocal.jmx
   [jmeter] Starting the test @ Fri May 05 08:13:50 UTC 2017 (1493972030310)
   [jmeter] Waiting for possible Shutdown/StopTestNow/Heapdump message on port 4445
   [jmeter] summary +     55 in 00:00:40 =    1.4/s Avg:   118 Min:     7 Max:   255 Err:
    8 (14.55%) Active: 1 Started: 2 Finished: 1
   [jmeter] summary +     78 in 00:00:11 =    7.1/s Avg:   136 Min:     1 Max:   256 Err:
    8 (10.26%) Active: 0 Started: 1 Finished: 1
   [jmeter] summary =    133 in 00:00:51 =    2.6/s Avg:   128 Min:     1 Max:   256 Err:
   16 (12.03%)
   [jmeter] Tidying up ...    @ Fri May 05 08:14:42 UTC 2017 (1493972082290)
   [jmeter] ... end of run
     [echo] BatchTestLocal output files compared OK

batchtestserver:

batchtest:
     [echo] Starting BatchTestLocal with file BatchTestLocal.jmx using -Rlocalhost:2682 -Jdummy=dummy
   [server] Created remote object: UnicastServerRef [liveRef: [endpoint:[127.0.1.1:38549](local),objID:[-6e0baf58:15bd7ace87b:-7fff,
-6051424043438802062]]]
   [server] An error occurred: Cannot start. qnode1 is a loopback address.
   [server] Server failed to start: java.rmi.RemoteException: Cannot start. qnode1 is a loopback
address.
   [server] Java Result: 1
   [client] Creating summariser <summary>
   [client] Created the tree successfully using testfiles/BatchTestLocal.jmx
   [client] Configuring remote engine: localhost:2682
   [client] Connection refused to host: localhost; nested exception is: 
   [client] 	java.net.ConnectException: Connection refused (Connection refused)
   [client] Failed to configure localhost:2682
   [client] Stopping remote engines
   [client] Remote engines have been stopped
   [client] Error in NonGUIDriver java.lang.RuntimeException: Following remote engines could
not be configured:[localhost:2682]
   [concat] 2017-05-05 08:14:48,493 ERROR o.a.j.e.DistributedRunner: Failed to create engine
at localhost:2682
   [concat] java.rmi.ConnectException: Connection refused to host: localhost; nested exception
is: 
   [concat] 	java.net.ConnectException: Connection refused (Connection refused)
   [concat] 	at sun.rmi.transport.tcp.TCPEndpoint.newSocket(TCPEndpoint.java:619) ~[?:1.8.0_121]
   [concat] 	at sun.rmi.transport.tcp.TCPChannel.createConnection(TCPChannel.java:216) ~[?:1.8.0_121]
   [concat] 	at sun.rmi.transport.tcp.TCPChannel.newConnection(TCPChannel.java:202) ~[?:1.8.0_121]
   [concat] 	at sun.rmi.server.UnicastRef.newCall(UnicastRef.java:342) ~[?:1.8.0_121]
   [concat] 	at sun.rmi.registry.RegistryImpl_Stub.lookup(Unknown Source) ~[?:1.8.0_121]
   [concat] 	at java.rmi.Naming.lookup(Naming.java:101) ~[?:1.8.0_121]
   [concat] 	at org.apache.jmeter.engine.ClientJMeterEngine.getEngine(ClientJMeterEngine.java:54)
~[ApacheJMeter_core.jar:3.3-SNAPSHOT r1793968]
   [concat] 	at org.apache.jmeter.engine.ClientJMeterEngine.<init>(ClientJMeterEngine.java:67)
~[ApacheJMeter_core.jar:3.3-SNAPSHOT r1793968]
   [concat] 	at org.apache.jmeter.engine.DistributedRunner.createEngine(DistributedRunner.java:237)
~[ApacheJMeter_core.jar:3.3-SNAPSHOT r1793968]
   [concat] 	at org.apache.jmeter.engine.DistributedRunner.getClientEngine(DistributedRunner.java:213)
[ApacheJMeter_core.jar:3.3-SNAPSHOT r1793968]
   [concat] 	at org.apache.jmeter.engine.DistributedRunner.init(DistributedRunner.java:93)
[ApacheJMeter_core.jar:3.3-SNAPSHOT r1793968]
   [concat] 	at org.apache.jmeter.JMeter.runNonGui(JMeter.java:1003) [ApacheJMeter_core.jar:3.3-SNAPSHOT
r1793968]
   [concat] 	at org.apache.jmeter.JMeter.startNonGui(JMeter.java:910) [ApacheJMeter_core.jar:3.3-SNAPSHOT
r1793968]
   [concat] 	at org.apache.jmeter.JMeter.start(JMeter.java:538) [ApacheJMeter_core.jar:3.3-SNAPSHOT
r1793968]
   [concat] 	at sun.reflect.NativeMethodAccessorImpl.invoke0(Native Method) ~[?:1.8.0_121]
   [concat] 	at sun.reflect.NativeMethodAccessorImpl.invoke(NativeMethodAccessorImpl.java:62)
~[?:1.8.0_121]
   [concat] 	at sun.reflect.DelegatingMethodAccessorImpl.invoke(DelegatingMethodAccessorImpl.java:43)
~[?:1.8.0_121]
   [concat] 	at java.lang.reflect.Method.invoke(Method.java:498) ~[?:1.8.0_121]
   [concat] 	at org.apache.jmeter.NewDriver.main(NewDriver.java:248) [ApacheJMeter.jar:3.3-SNAPSHOT
r1793968]
   [concat] Caused by: java.net.ConnectException: Connection refused (Connection refused)
   [concat] 	at java.net.PlainSocketImpl.socketConnect(Native Method) ~[?:1.8.0_121]
   [concat] 	at java.net.AbstractPlainSocketImpl.doConnect(AbstractPlainSocketImpl.java:350)
~[?:1.8.0_121]
   [concat] 	at java.net.AbstractPlainSocketImpl.connectToAddress(AbstractPlainSocketImpl.java:206)
~[?:1.8.0_121]
   [concat] 	at java.net.AbstractPlainSocketImpl.connect(AbstractPlainSocketImpl.java:188)
~[?:1.8.0_121]
   [concat] 	at java.net.SocksSocketImpl.connect(SocksSocketImpl.java:392) ~[?:1.8.0_121]
   [concat] 	at java.net.Socket.connect(Socket.java:589) ~[?:1.8.0_121]
   [concat] 	at java.net.Socket.connect(Socket.java:538) ~[?:1.8.0_121]
   [concat] 	at java.net.Socket.<init>(Socket.java:434) ~[?:1.8.0_121]
   [concat] 	at java.net.Socket.<init>(Socket.java:211) ~[?:1.8.0_121]
   [concat] 	at sun.rmi.transport.proxy.RMIDirectSocketFactory.createSocket(RMIDirectSocketFactory.java:40)
~[?:1.8.0_121]
   [concat] 	at sun.rmi.transport.proxy.RMIMasterSocketFactory.createSocket(RMIMasterSocketFactory.java:148)
~[?:1.8.0_121]
   [concat] 	at sun.rmi.transport.tcp.TCPEndpoint.newSocket(TCPEndpoint.java:613) ~[?:1.8.0_121]
   [concat] 	... 18 more
   [concat] 2017-05-05 08:14:48,507 ERROR o.a.j.u.JMeterUtils: Connection refused to host:
localhost; nested exception is: 
   [concat] 	java.net.ConnectException: Connection refused (Connection refused)
   [concat] 2017-05-05 08:14:48,508 ERROR o.a.j.JMeter: Error in NonGUIDriver
   [concat] java.lang.RuntimeException: Following remote engines could not be configured:[localhost:2682]
   [concat] 	at org.apache.jmeter.engine.DistributedRunner.init(DistributedRunner.java:112)
~[ApacheJMeter_core.jar:3.3-SNAPSHOT r1793968]
   [concat] 	at org.apache.jmeter.JMeter.runNonGui(JMeter.java:1003) [ApacheJMeter_core.jar:3.3-SNAPSHOT
r1793968]
   [concat] 	at org.apache.jmeter.JMeter.startNonGui(JMeter.java:910) [ApacheJMeter_core.jar:3.3-SNAPSHOT
r1793968]
   [concat] 	at org.apache.jmeter.JMeter.start(JMeter.java:538) [ApacheJMeter_core.jar:3.3-SNAPSHOT
r1793968]
   [concat] 	at sun.reflect.NativeMethodAccessorImpl.invoke0(Native Method) ~[?:1.8.0_121]
   [concat] 	at sun.reflect.NativeMethodAccessorImpl.invoke(NativeMethodAccessorImpl.java:62)
~[?:1.8.0_121]
   [concat] 	at sun.reflect.DelegatingMethodAccessorImpl.invoke(DelegatingMethodAccessorImpl.java:43)
~[?:1.8.0_121]
   [concat] 	at java.lang.reflect.Method.invoke(Method.java:498) ~[?:1.8.0_121]
   [concat] 	at org.apache.jmeter.NewDriver.main(NewDriver.java:248) [ApacheJMeter.jar:3.3-SNAPSHOT
r1793968]

BUILD FAILED
<https://builds.apache.org/job/JMeter%20Ubuntu/ws/trunk/build.xml>:2470: The following
error occurred while executing this line:
<https://builds.apache.org/job/JMeter%20Ubuntu/ws/trunk/build.xml>:2593: The following
error occurred while executing this line:
<https://builds.apache.org/job/JMeter%20Ubuntu/ws/trunk/build.xml>:2541: Cannot find
output file <https://builds.apache.org/job/JMeter%20Ubuntu/ws/trunk/bin/BatchTestLocal.csv>

Total time: 3 minutes 36 seconds
Build step 'Invoke Ant' marked build as failure
[locks-and-latches] Releasing all the locks
[locks-and-latches] All the locks released

Mime
View raw message