jmeter-dev mailing list archives

Site index · List index
Message view « Date » · « Thread »
Top « Date » · « Thread »
From Apache Jenkins Server <jenk...@builds.apache.org>
Subject Build failed in Jenkins: JMeter-trunk #6037
Date Mon, 13 Mar 2017 21:00:24 GMT
See <https://builds.apache.org/job/JMeter-trunk/6037/display/redirect?page=changes>

Changes:

[pmouawad] Mention work on quality and tests

[pmouawad] Fix name as per Felix remark

------------------------------------------
[...truncated 94.40 KB...]
  [javadoc] Loading source files for package org.apache.jmeter.assertions...
  [javadoc] Loading source files for package org.apache.jmeter.assertions.gui...
  [javadoc] Loading source files for package org.apache.jmeter.config...
  [javadoc] Loading source files for package org.apache.jmeter.config.gui...
  [javadoc] Loading source files for package org.apache.jmeter.control...
  [javadoc] Loading source files for package org.apache.jmeter.control.gui...
  [javadoc] Loading source files for package org.apache.jmeter.engine...
  [javadoc] Loading source files for package org.apache.jmeter.engine.event...
  [javadoc] Loading source files for package org.apache.jmeter.engine.util...
  [javadoc] Loading source files for package org.apache.jmeter.exceptions...
  [javadoc] Loading source files for package org.apache.jmeter.functions...
  [javadoc] Loading source files for package org.apache.jmeter.functions.gui...
  [javadoc] Loading source files for package org.apache.jmeter.functions.util...
  [javadoc] Loading source files for package org.apache.jmeter.gui...
  [javadoc] Loading source files for package org.apache.jmeter.gui.action...
  [javadoc] Loading source files for package org.apache.jmeter.gui.action.impl...
  [javadoc] Loading source files for package org.apache.jmeter.gui.action.template...
  [javadoc] Loading source files for package org.apache.jmeter.gui.action.thinktime...
  [javadoc] Loading source files for package org.apache.jmeter.gui.action.validation...
  [javadoc] Loading source files for package org.apache.jmeter.gui.logging...
  [javadoc] Loading source files for package org.apache.jmeter.gui.plugin...
  [javadoc] Loading source files for package org.apache.jmeter.gui.tree...
  [javadoc] Loading source files for package org.apache.jmeter.gui.util...
  [javadoc] Loading source files for package org.apache.jmeter.plugin...
  [javadoc] Loading source files for package org.apache.jmeter.processor...
  [javadoc] Loading source files for package org.apache.jmeter.processor.gui...
  [javadoc] Loading source files for package org.apache.jmeter.report.config...
  [javadoc] Loading source files for package org.apache.jmeter.report.core...
  [javadoc] Loading source files for package org.apache.jmeter.report.dashboard...
  [javadoc] Loading source files for package org.apache.jmeter.report.processor...
  [javadoc] Loading source files for package org.apache.jmeter.report.processor.graph...
  [javadoc] Loading source files for package org.apache.jmeter.report.processor.graph.impl...
  [javadoc] Loading source files for package org.apache.jmeter.reporters...
  [javadoc] Loading source files for package org.apache.jmeter.reporters.gui...
  [javadoc] Loading source files for package org.apache.jmeter.samplers...
  [javadoc] Loading source files for package org.apache.jmeter.samplers.gui...
  [javadoc] Loading source files for package org.apache.jmeter.save...
  [javadoc] Loading source files for package org.apache.jmeter.save.converters...
  [javadoc] Loading source files for package org.apache.jmeter.services...
  [javadoc] Loading source files for package org.apache.jmeter.swing...
  [javadoc] Loading source files for package org.apache.jmeter.testbeans...
  [javadoc] Loading source files for package org.apache.jmeter.testbeans.gui...
  [javadoc] Loading source files for package org.apache.jmeter.testelement...
  [javadoc] Loading source files for package org.apache.jmeter.testelement.property...
  [javadoc] Loading source files for package org.apache.jmeter.threads...
  [javadoc] Loading source files for package org.apache.jmeter.threads.gui...
  [javadoc] Loading source files for package org.apache.jmeter.timers...
  [javadoc] Loading source files for package org.apache.jmeter.timers.gui...
  [javadoc] Loading source files for package org.apache.jmeter.util...
  [javadoc] Loading source files for package org.apache.jmeter.util.keystore...
  [javadoc] Loading source files for package org.apache.jmeter.visualizers...
  [javadoc] Loading source files for package org.apache.jmeter.visualizers.backend...
  [javadoc] Loading source files for package org.apache.jmeter.visualizers.gui...
  [javadoc] Loading source files for package org.apache.jmeter.extractor...
  [javadoc] Loading source files for package org.apache.jmeter.extractor.gui...
  [javadoc] Loading source files for package org.apache.jmeter.extractor.json.jsonpath...
  [javadoc] Loading source files for package org.apache.jmeter.extractor.json.jsonpath.gui...
  [javadoc] Loading source files for package org.apache.jmeter.extractor.json.render...
  [javadoc] Loading source files for package org.apache.jmeter.modifiers...
  [javadoc] Loading source files for package org.apache.jmeter.modifiers.gui...
  [javadoc] Loading source files for package org.apache.jmeter.sampler...
  [javadoc] Loading source files for package org.apache.jmeter.sampler.gui...
  [javadoc] Loading source files for package org.apache.jmeter.thinktime...
  [javadoc] Loading source files for package org.apache.jmeter.validation...
  [javadoc] Loading source files for package org.apache.jmeter.visualizers.backend.graphite...
  [javadoc] Loading source files for package org.apache.jmeter.visualizers.backend.influxdb...
  [javadoc] Loading source files for package org.apache.jmeter.visualizers.utils...
  [javadoc] Loading source files for package org.apache.jmeter.protocol.http.config...
  [javadoc] Loading source files for package org.apache.jmeter.protocol.http.config.gui...
  [javadoc] Loading source files for package org.apache.jmeter.protocol.http.control...
  [javadoc] Loading source files for package org.apache.jmeter.protocol.http.control.gui...
  [javadoc] Loading source files for package org.apache.jmeter.protocol.http.gui...
  [javadoc] Loading source files for package org.apache.jmeter.protocol.http.modifier...
  [javadoc] Loading source files for package org.apache.jmeter.protocol.http.modifier.gui...
  [javadoc] Loading source files for package org.apache.jmeter.protocol.http.parser...
  [javadoc] Loading source files for package org.apache.jmeter.protocol.http.proxy...
  [javadoc] Loading source files for package org.apache.jmeter.protocol.http.proxy.gui...
  [javadoc] Loading source files for package org.apache.jmeter.protocol.http.sampler...
  [javadoc] Loading source files for package org.apache.jmeter.protocol.http.sampler.hc...
  [javadoc] Loading source files for package org.apache.jmeter.protocol.http.util...
  [javadoc] Loading source files for package org.apache.jmeter.protocol.http.util.accesslog...
  [javadoc] Loading source files for package org.apache.jmeter.protocol.http.visualizers...
  [javadoc] Loading source files for package org.apache.jmeter.protocol.ftp.config.gui...
  [javadoc] Loading source files for package org.apache.jmeter.protocol.ftp.control.gui...
  [javadoc] Loading source files for package org.apache.jmeter.protocol.ftp.sampler...
  [javadoc] Loading source files for package org.apache.jmeter.protocol.jdbc...
  [javadoc] Loading source files for package org.apache.jmeter.protocol.jdbc.config...
  [javadoc] Loading source files for package org.apache.jmeter.protocol.jdbc.processor...
  [javadoc] Loading source files for package org.apache.jmeter.protocol.jdbc.sampler...
  [javadoc] Loading source files for package org.apache.jmeter.protocol.java.config...
  [javadoc] Loading source files for package org.apache.jmeter.protocol.java.config.gui...
  [javadoc] Loading source files for package org.apache.jmeter.protocol.java.control.gui...
  [javadoc] Loading source files for package org.apache.jmeter.protocol.java.sampler...
  [javadoc] Loading source files for package org.apache.jmeter.protocol.java.test...
  [javadoc] Loading source files for package org.apache.jorphan.collections...
  [javadoc] Loading source files for package org.apache.jorphan.exec...
  [javadoc] Loading source files for package org.apache.jorphan.gui...
  [javadoc] Loading source files for package org.apache.jorphan.gui.layout...
  [javadoc] Loading source files for package org.apache.jorphan.io...
  [javadoc] Loading source files for package org.apache.jorphan.logging...
  [javadoc] Loading source files for package org.apache.jorphan.math...
  [javadoc] Loading source files for package org.apache.jorphan.reflect...
  [javadoc] Loading source files for package org.apache.jorphan.test...
  [javadoc] Loading source files for package org.apache.jorphan.util...
  [javadoc] Loading source files for package org.apache.jmeter.protocol.ldap.config.gui...
  [javadoc] Loading source files for package org.apache.jmeter.protocol.ldap.control.gui...
  [javadoc] Loading source files for package org.apache.jmeter.protocol.ldap.sampler...
  [javadoc] Loading source files for package org.apache.jmeter.protocol.tcp.config.gui...
  [javadoc] Loading source files for package org.apache.jmeter.protocol.tcp.control.gui...
  [javadoc] Loading source files for package org.apache.jmeter.protocol.tcp.sampler...
  [javadoc] Loading source files for package org.apache.jmeter.examples.sampler...
  [javadoc] Loading source files for package org.apache.jmeter.examples.sampler.gui...
  [javadoc] Loading source files for package org.apache.jmeter.examples.testbeans.example1...
  [javadoc] Loading source files for package org.apache.jmeter.examples.testbeans.example2...
  [javadoc] Loading source files for package org.apache.jmeter.examples.testbeans.example3...
  [javadoc] Loading source files for package org.apache.jmeter.protocol.mail.sampler...
  [javadoc] Loading source files for package org.apache.jmeter.protocol.mail.sampler.gui...
  [javadoc] Loading source files for package org.apache.jmeter.protocol.smtp.sampler...
  [javadoc] Loading source files for package org.apache.jmeter.protocol.smtp.sampler.gui...
  [javadoc] Loading source files for package org.apache.jmeter.protocol.smtp.sampler.protocol...
  [javadoc] Loading source files for package org.apache.jmeter.protocol.jms...
  [javadoc] Loading source files for package org.apache.jmeter.protocol.jms.client...
  [javadoc] Loading source files for package org.apache.jmeter.protocol.jms.control.gui...
  [javadoc] Loading source files for package org.apache.jmeter.protocol.jms.sampler...
  [javadoc] Loading source files for package org.apache.jmeter.protocol.jms.sampler.render...
  [javadoc] Loading source files for package org.apache.jmeter.protocol.system...
  [javadoc] Loading source files for package org.apache.jmeter.protocol.system.gui...
  [javadoc] Loading source files for package org.apache.jmeter.protocol.mongodb.config...
  [javadoc] Loading source files for package org.apache.jmeter.protocol.mongodb.mongo...
  [javadoc] Loading source files for package org.apache.jmeter.protocol.mongodb.sampler...
  [javadoc] Constructing Javadoc information...
  [javadoc] Standard Doclet version 1.8.0_121
  [javadoc] Building tree for all the packages and classes...
  [javadoc] Building index for all the packages and classes...
  [javadoc] Building index for all classes...

compile-tests:
    [javac] Compiling 176 source files to <https://builds.apache.org/job/JMeter-trunk/ws/trunk/build/test>

_test:
     [echo] 
     [echo]    gump.run = false
     [echo]    java.awt.headless = true
     [echo]    test.headless = true
     [echo]    user.dir = <https://builds.apache.org/job/JMeter-trunk/ws/trunk>
     [echo]    basedir = <https://builds.apache.org/job/JMeter-trunk/ws/trunk>
     [echo]    test dir = build/test
     [echo]    test dir gump = build/test
     [echo]    testsaveservice.saveout = ${testsaveservice.saveout}
     [echo]    test.encoding = UTF-8
     [echo]     
     [java] Setting JMeterHome: <https://builds.apache.org/job/JMeter-trunk/ws/trunk>
     [java] Using initializeProperties() from org.apache.jmeter.util.JMeterUtils
     [java] Setting up initial properties using: <https://builds.apache.org/job/JMeter-trunk/ws/trunk/bin/jmeter.properties>
     [java] Initializing Properties: <https://builds.apache.org/job/JMeter-trunk/ws/trunk/bin/jmeter.properties>
     [java] JMeterVersion=r1786782
     [java] java.version=1.8.0_121
     [java] java.home=/usr/local/asfpackages/java/jdk1.8.0_121/jre
     [java] file.encoding=UTF-8
     [java] default encoding=UTF-8
     [java] user.dir=<https://builds.apache.org/job/JMeter-trunk/ws/trunk/bin>
     [java] Locale=en_US
     [java] os.name=Linux
     [java] os.version=3.13.0-107-generic
     [java] JCE max key length = 128
     [java] +++++++++++
     [java] java.awt.headless=true
     [java] java.awt.graphicsenv=sun.awt.X11GraphicsEnvironment
     [java] ------------
     [java] Searching junit tests in : build/test
     [java] o.a.j.junit.JMeterTest INFO: JMeterGUIComponent: skipping some tests org.apache.jmeter.testbeans.gui.TestBeanGUI
     [java] o.a.j.junit.JMeterTest Error creating org.apache.jmeter.SplashScreen java.awt.HeadlessException
     [java] o.a.j.junit.JMeterTest Error creating org.apache.jmeter.config.gui.RowDetailDialog
java.awt.HeadlessException
     [java] o.a.j.junit.JMeterTest Error creating org.apache.jmeter.functions.gui.FunctionHelper
java.awt.HeadlessException
     [java] o.a.j.junit.JMeterTest Error creating org.apache.jmeter.gui.MainFrame java.awt.HeadlessException
     [java] o.a.j.junit.JMeterTest Error creating org.apache.jmeter.gui.SavePropertyDialog
java.awt.HeadlessException
     [java] o.a.j.junit.JMeterTest Error creating org.apache.jmeter.gui.action.SearchTreeDialog
java.awt.HeadlessException
     [java] o.a.j.junit.JMeterTest Error creating org.apache.jmeter.gui.action.SelectTemplatesDialog
java.awt.HeadlessException
     [java] o.a.j.junit.JMeterTest Error creating org.apache.jmeter.gui.util.EscapeDialog
java.awt.HeadlessException
     [java] o.a.j.junit.JMeterTest Error creating org.apache.jmeter.gui.util.JSyntaxTextArea
java.awt.HeadlessException
     [java] java.rmi.server.hostname=null
     [java] penates.apache.org/67.195.81.186
     [java] isSiteLocalAddress:false
     [java] isAnyLocalAddress:false
     [java] isLinkLocalAddress:false
     [java] isLoopbackAddress:false
     [java] isMulticastAddress:false
     [java] localhost/127.0.0.1
     [java] isSiteLocalAddress:false
     [java] isAnyLocalAddress:false
     [java] isLinkLocalAddress:false
     [java] isLoopbackAddress:true
     [java] isMulticastAddress:false
     [java] ====================
     [java] penates.apache.org/67.195.81.186
     [java] isSiteLocalAddress:false
     [java] isAnyLocalAddress:false
     [java] isLinkLocalAddress:false
     [java] isLoopbackAddress:false
     [java] isMulticastAddress:false
     [java] ...............................................................................................................I........................................................................................................................................................................................................................................................................................................................................................................................................................................................................................................................................................................................................................................................................................................................................................................................................................................................................................................................................................................................................................................................................................................................................................................................................................................................................................................................................................................................................................................................................................................................................................................................................................................................................................................................................................................................................................................................................................................................................................................................................................................................................E.........................................................................................................................................................................................................................................................................................................................................................................................................................................................................................................................................................................................................................................................................................................................................
     [java] Time: 65.993
     [java] There was 1 failure:
     [java] 1) testSubResultsTrueThread(org.apache.jmeter.samplers.TestSampleResult)
     [java] java.lang.AssertionError: TestElapsed: 304 -  ParentElapsed: 300 = 4 not in [0,3];
nanotime=true
     [java] 	at org.junit.Assert.fail(Assert.java:88)
     [java] 	at org.apache.jmeter.samplers.TestSampleResult.testSubResults(TestSampleResult.java:292)
     [java] 	at org.apache.jmeter.samplers.TestSampleResult.testSubResultsTrueThread(TestSampleResult.java:154)
     [java] 	at sun.reflect.NativeMethodAccessorImpl.invoke0(Native Method)
     [java] 	at sun.reflect.NativeMethodAccessorImpl.invoke(NativeMethodAccessorImpl.java:62)
     [java] 	at sun.reflect.DelegatingMethodAccessorImpl.invoke(DelegatingMethodAccessorImpl.java:43)
     [java] 	at java.lang.reflect.Method.invoke(Method.java:498)
     [java] 	at org.junit.runners.model.FrameworkMethod$1.runReflectiveCall(FrameworkMethod.java:50)
     [java] 	at org.junit.internal.runners.model.ReflectiveCallable.run(ReflectiveCallable.java:12)
     [java] 	at org.junit.runners.model.FrameworkMethod.invokeExplosively(FrameworkMethod.java:47)
     [java] 	at org.junit.internal.runners.statements.InvokeMethod.evaluate(InvokeMethod.java:17)
     [java] 	at org.junit.runners.ParentRunner.runLeaf(ParentRunner.java:325)
     [java] 	at org.junit.runners.BlockJUnit4ClassRunner.runChild(BlockJUnit4ClassRunner.java:78)
     [java] 	at org.junit.runners.BlockJUnit4ClassRunner.runChild(BlockJUnit4ClassRunner.java:57)
     [java] 	at org.junit.runners.ParentRunner$3.run(ParentRunner.java:290)
     [java] 	at org.junit.runners.ParentRunner$1.schedule(ParentRunner.java:71)
     [java] 	at org.junit.runners.ParentRunner.runChildren(ParentRunner.java:288)
     [java] 	at org.junit.runners.ParentRunner.access$000(ParentRunner.java:58)
     [java] 	at org.junit.runners.ParentRunner$2.evaluate(ParentRunner.java:268)
     [java] 	at org.junit.runners.ParentRunner.run(ParentRunner.java:363)
     [java] 	at org.junit.runners.Suite.runChild(Suite.java:128)
     [java] 	at org.junit.runners.Suite.runChild(Suite.java:27)
     [java] 	at org.junit.runners.ParentRunner$3.run(ParentRunner.java:290)
     [java] 	at org.junit.runners.ParentRunner$1.schedule(ParentRunner.java:71)
     [java] 	at org.junit.runners.ParentRunner.runChildren(ParentRunner.java:288)
     [java] 	at org.junit.runners.ParentRunner.access$000(ParentRunner.java:58)
     [java] 	at org.junit.runners.ParentRunner$2.evaluate(ParentRunner.java:268)
     [java] 	at org.junit.runners.ParentRunner.run(ParentRunner.java:363)
     [java] 	at org.junit.runner.JUnitCore.run(JUnitCore.java:137)
     [java] 	at org.junit.runner.JUnitCore.run(JUnitCore.java:115)
     [java] 	at org.apache.jorphan.test.AllTests.main(AllTests.java:215)
     [java] 
     [java] FAILURES!!!
     [java] Tests run: 2816,  Failures: 1
     [java] 

BUILD FAILED
<https://builds.apache.org/job/JMeter-trunk/ws/trunk/build.xml>:2832: Java returned:
1

Total time: 2 minutes 57 seconds
Build step 'Invoke Ant' marked build as failure
[locks-and-latches] Releasing all the locks
[locks-and-latches] All the locks released
Archiving artifacts

Mime
View raw message