jmeter-dev mailing list archives

Site index · List index
Message view « Date » · « Thread »
Top « Date » · « Thread »
From Apache Jenkins Server <jenk...@builds.apache.org>
Subject Build failed in Jenkins: JMeter-trunk #5887
Date Sun, 19 Feb 2017 15:00:42 GMT
See <https://builds.apache.org/job/JMeter-trunk/5887/display/redirect?page=changes>

Changes:

[pmouawad] svn:eol

[pmouawad] Add test for Header Manager merge feature

[pmouawad] Remove disabled elements
Add Response Assertion on request header

[pmouawad] Revert last commit

[pmouawad] Fix sonar warning

[pmouawad] Bug 60747 - Response Assertion : Add Request Headers to "Field to Test"
Bugzilla Id: 60747

------------------------------------------
[...truncated 120.53 KB...]
   [jmeter] Waiting for possible Shutdown/StopTestNow/Heapdump message on port 4445
   [jmeter] summary +      1 in 00:00:00 =    5.6/s Avg:     8 Min:     8 Max:     8 Err:
    0 (0.00%) Active: 1 Started: 1 Finished: 0
   [jmeter] summary +      8 in 00:00:00 =  285.7/s Avg:     0 Min:     0 Max:     1 Err:
    0 (0.00%) Active: 0 Started: 1 Finished: 1
   [jmeter] summary =      9 in 00:00:00 =   43.5/s Avg:     1 Min:     0 Max:     8 Err:
    0 (0.00%)
   [jmeter] Tidying up ...    @ Sun Feb 19 14:58:02 UTC 2017 (1487516282450)
   [jmeter] ... end of run
     [echo] Bug56243 output files compared OK

batchtest:
     [echo] Starting Bug54685 using -X
   [jmeter] Creating summariser <summary>
   [jmeter] Created the tree successfully using testfiles/Bug54685.jmx
   [jmeter] Starting the test @ Sun Feb 19 14:58:04 UTC 2017 (1487516284460)
   [jmeter] Waiting for possible Shutdown/StopTestNow/Heapdump message on port 4445
   [jmeter] summary +      1 in 00:00:00 =    2.4/s Avg:   251 Min:   251 Max:   251 Err:
    0 (0.00%) Active: 1 Started: 1 Finished: 0
   [jmeter] summary =      1 in 00:00:00 =    2.4/s Avg:   251 Min:   251 Max:   251 Err:
    0 (0.00%)
   [jmeter] Tidying up ...    @ Sun Feb 19 14:58:05 UTC 2017 (1487516285397)
   [jmeter] ... end of run
     [echo] Bug54685 output files compared OK

batchtest:
     [echo] Starting Bug55375 using -X
   [jmeter] Creating summariser <summary>
   [jmeter] Created the tree successfully using testfiles/Bug55375.jmx
   [jmeter] Starting the test @ Sun Feb 19 14:58:07 UTC 2017 (1487516287545)
   [jmeter] Waiting for possible Shutdown/StopTestNow/Heapdump message on port 4445
   [jmeter] summary =      1 in 00:00:00 =    2.3/s Avg:   277 Min:   277 Max:   277 Err:
    0 (0.00%)
   [jmeter] Tidying up ...    @ Sun Feb 19 14:58:08 UTC 2017 (1487516288508)
   [jmeter] ... end of run
     [echo] Bug55375 output files compared OK

batchtestserver:

batchtest:
     [echo] Starting Bug54685 using -Rlocalhost:2811
   [server] Created remote object: UnicastServerRef [liveRef: [endpoint:[67.195.81.186:39751](local),objID:[-5fbc81d7:15a56e14cba:-7fff,
6309885530583326598]]]
   [client] Creating summariser <summary>
   [client] Created the tree successfully using testfiles/Bug54685.jmx
   [client] Configuring remote engine: localhost:2811
   [client] Starting remote engines
   [client] Starting the test @ Sun Feb 19 14:58:11 UTC 2017 (1487516291757)
   [server] Starting the test on host localhost:2811 @ Sun Feb 19 14:58:13 UTC 2017 (1487516293344)
   [client] Remote engines have been started
   [client] Waiting for possible Shutdown/StopTestNow/Heapdump message on port 4445
   [server] Finished the test on host localhost:2811 @ Sun Feb 19 14:58:14 UTC 2017 (1487516294175)
- exit requested.
   [client] summary =      1 in 00:00:00 =    3.0/s Avg:   167 Min:   167 Max:   167 Err:
    0 (0.00%)
   [client] Tidying up remote @ Sun Feb 19 14:58:14 UTC 2017 (1487516294175)
   [client] ... end of run
     [echo] Bug54685 output files compared OK

batchtest:
     [echo] Starting Bug56811 using -X
   [jmeter] Creating summariser <summary>
   [jmeter] Created the tree successfully using testfiles/Bug56811.jmx
   [jmeter] Starting the test @ Sun Feb 19 14:58:21 UTC 2017 (1487516301366)
   [jmeter] Waiting for possible Shutdown/StopTestNow/Heapdump message on port 4445
   [jmeter] summary +      1 in 00:00:08 =    0.1/s Avg:   318 Min:   318 Max:   318 Err:
    0 (0.00%) Active: 1 Started: 4 Finished: 3
   [jmeter] summary +      8 in 00:00:01 =    6.1/s Avg:   162 Min:     0 Max:   338 Err:
    3 (37.50%) Active: 0 Started: 4 Finished: 4
   [jmeter] summary =      9 in 00:00:10 =    0.9/s Avg:   180 Min:     0 Max:   338 Err:
    3 (33.33%)
   [jmeter] Tidying up ...    @ Sun Feb 19 14:58:31 UTC 2017 (1487516311570)
   [jmeter] ... end of run
     [echo] Bug56811 output files compared OK

batchtest:

batchtest:
     [echo] Starting Bug60607 using -X
   [jmeter] Creating summariser <summary>
   [jmeter] Created the tree successfully using testfiles/Bug60607.jmx
   [jmeter] Starting the test @ Sun Feb 19 14:58:33 UTC 2017 (1487516313677)
   [jmeter] Waiting for possible Shutdown/StopTestNow/Heapdump message on port 4445
   [jmeter] summary +      1 in 00:00:01 =    1.6/s Avg:   408 Min:   408 Max:   408 Err:
    0 (0.00%) Active: 1 Started: 1 Finished: 0
   [jmeter] summary +      1 in 00:00:30 =    0.0/s Avg: 30075 Min: 30075 Max: 30075 Err:
    0 (0.00%) Active: 1 Started: 2 Finished: 1
   [jmeter] summary =      2 in 00:00:31 =    0.1/s Avg: 15241 Min:   408 Max: 30075 Err:
    0 (0.00%)
   [jmeter] summary =      2 in 00:00:31 =    0.1/s Avg: 15241 Min:   408 Max: 30075 Err:
    0 (0.00%)
   [jmeter] Tidying up ...    @ Sun Feb 19 14:59:04 UTC 2017 (1487516344929)
   [jmeter] ... end of run
     [echo] Bug60607 output files compared OK

batchtest:
     [echo] Starting SlowCharsFeature using -X
   [jmeter] Creating summariser <summary>
   [jmeter] Created the tree successfully using testfiles/SlowCharsFeature.jmx
   [jmeter] Starting the test @ Sun Feb 19 14:59:06 UTC 2017 (1487516346965)
   [jmeter] Waiting for possible Shutdown/StopTestNow/Heapdump message on port 4445
   [jmeter] summary =      3 in 00:00:18 =    0.2/s Avg:  5789 Min:   383 Max: 11170 Err:
    0 (0.00%)
   [jmeter] Tidying up ...    @ Sun Feb 19 14:59:25 UTC 2017 (1487516365502)
   [jmeter] ... end of run
     [echo] SlowCharsFeature output files compared OK

batchtest:
     [echo] Starting Http4ImplPreemptiveBasicAuth using -X
   [jmeter] Creating summariser <summary>
   [jmeter] Created the tree successfully using testfiles/Http4ImplPreemptiveBasicAuth.jmx
   [jmeter] Starting the test @ Sun Feb 19 14:59:27 UTC 2017 (1487516367667)
   [jmeter] Waiting for possible Shutdown/StopTestNow/Heapdump message on port 4445
   [jmeter] summary +      2 in 00:00:02 =    1.2/s Avg:   279 Min:   155 Max:   404 Err:
    0 (0.00%) Active: 1 Started: 1 Finished: 0
   [jmeter] summary +     10 in 00:00:06 =    1.6/s Avg:   417 Min:   154 Max:  1114 Err:
    0 (0.00%) Active: 0 Started: 6 Finished: 6
   [jmeter] summary =     12 in 00:00:08 =    1.5/s Avg:   394 Min:   154 Max:  1114 Err:
    0 (0.00%)
   [jmeter] Tidying up ...    @ Sun Feb 19 14:59:36 UTC 2017 (1487516376398)
   [jmeter] ... end of run
     [echo] Http4ImplPreemptiveBasicAuth output files compared OK

batchtest:
     [echo] Starting TestKeepAlive using -X
   [jmeter] Creating summariser <summary>
   [jmeter] Created the tree successfully using testfiles/TestKeepAlive.jmx
   [jmeter] Starting the test @ Sun Feb 19 14:59:38 UTC 2017 (1487516378606)
   [jmeter] Waiting for possible Shutdown/StopTestNow/Heapdump message on port 4445
   [jmeter] summary =      7 in 00:01:02 =    0.1/s Avg:   268 Min:   153 Max:   403 Err:
    0 (0.00%)
   [jmeter] Tidying up ...    @ Sun Feb 19 15:00:41 UTC 2017 (1487516441783)
   [jmeter] ... end of run

BUILD FAILED
<https://builds.apache.org/job/JMeter-trunk/ws/trunk/build.xml>:2707: The following
error occurred while executing this line:
<https://builds.apache.org/job/JMeter-trunk/ws/trunk/build.xml>:2609: XML Files are
not identical.
        <https://builds.apache.org/job/JMeter-trunk/ws/trunk/bin/testfiles/TestKeepAlive.xml>
        <?xml version="1.0" encoding="UTF-8"?>
<testResults version="1.2">
<sample s="true" lb="JSPP_SetProperties" rc="200" rm="OK" dt="text"/>
<httpSample s="true" lb="HTTP-Warmup" rc="200" rm="OK" dt="text">
  <assertionResult>
    <name>RA_Max100</name>
    <failure>false</failure>
    <error>false</error>
  </assertionResult>
</httpSample>
<httpSample s="true" lb="HTTP_Request_REUSE" rc="200" rm="OK" dt="text">
  <assertionResult>
    <name>RA_Max99</name>
    <failure>false</failure>
    <error>false</error>
  </assertionResult>
</httpSample>
<httpSample s="true" lb="HTTP_Request_REUSE_2" rc="200" rm="OK" dt="text">
  <assertionResult>
    <name>RA_Max99</name>
    <failure>false</failure>
    <error>false</error>
  </assertionResult>
</httpSample>
<httpSample s="true" lb="HTTP_Request_REUSE_AFTER_VALIDATE" rc="200" rm="OK" dt="text">
  <assertionResult>
    <name>RA_Max99</name>
    <failure>false</failure>
    <error>false</error>
  </assertionResult>
</httpSample>
<httpSample s="true" lb="HTTP_Request_NO_REUSE" rc="200" rm="OK" dt="text">
  <assertionResult>
    <name>RA_Max100</name>
    <failure>false</failure>
    <error>false</error>
  </assertionResult>
</httpSample>
<httpSample s="true" lb="HTTP_Request_NO_REUSE" rc="200" rm="OK" dt="text">
  <assertionResult>
    <name>RA_Max100</name>
    <failure>false</failure>
    <error>false</error>
  </assertionResult>
</httpSample>

</testResults>

        <https://builds.apache.org/job/JMeter-trunk/ws/trunk/bin/TestKeepAlive.xml>
        <?xml version="1.0" encoding="UTF-8"?>
<testResults version="1.2">
<sample s="true" lb="JSPP_SetProperties" rc="200" rm="OK" dt="text"/>
<httpSample s="true" lb="HTTP-Warmup" rc="200" rm="OK" dt="text">
  <assertionResult>
    <name>RA_Max100</name>
    <failure>false</failure>
    <error>false</error>
  </assertionResult>
  <assertionResult>
    <name>Response Assertion</name>
    <failure>false</failure>
    <error>false</error>
  </assertionResult>
</httpSample>
<httpSample s="true" lb="HTTP_Request_REUSE" rc="200" rm="OK" dt="text">
  <assertionResult>
    <name>RA_Max99</name>
    <failure>false</failure>
    <error>false</error>
  </assertionResult>
  <assertionResult>
    <name>Response Assertion</name>
    <failure>false</failure>
    <error>false</error>
  </assertionResult>
</httpSample>
<httpSample s="true" lb="HTTP_Request_REUSE_2" rc="200" rm="OK" dt="text">
  <assertionResult>
    <name>RA_Max99</name>
    <failure>false</failure>
    <error>false</error>
  </assertionResult>
  <assertionResult>
    <name>Response Assertion</name>
    <failure>false</failure>
    <error>false</error>
  </assertionResult>
</httpSample>
<httpSample s="true" lb="HTTP_Request_REUSE_AFTER_VALIDATE" rc="200" rm="OK" dt="text">
  <assertionResult>
    <name>RA_Max99</name>
    <failure>false</failure>
    <error>false</error>
  </assertionResult>
  <assertionResult>
    <name>Response Assertion</name>
    <failure>false</failure>
    <error>false</error>
  </assertionResult>
</httpSample>
<httpSample s="true" lb="HTTP_Request_NO_REUSE" rc="200" rm="OK" dt="text">
  <assertionResult>
    <name>RA_Max100</name>
    <failure>false</failure>
    <error>false</error>
  </assertionResult>
  <assertionResult>
    <name>Response Assertion</name>
    <failure>false</failure>
    <error>false</error>
  </assertionResult>
</httpSample>
<httpSample s="true" lb="HTTP_Request_NO_REUSE" rc="200" rm="OK" dt="text">
  <assertionResult>
    <name>RA_Max100</name>
    <failure>false</failure>
    <error>false</error>
  </assertionResult>
  <assertionResult>
    <name>Response Assertion</name>
    <failure>false</failure>
    <error>false</error>
  </assertionResult>
</httpSample>

</testResults>

Total time: 6 minutes 33 seconds
Build step 'Invoke Ant' marked build as failure
[locks-and-latches] Releasing all the locks
[locks-and-latches] All the locks released
Archiving artifacts

Mime
View raw message