jmeter-dev mailing list archives

Site index · List index
Message view « Date » · « Thread »
Top « Date » · « Thread »
From Apache Jenkins Server <jenk...@builds.apache.org>
Subject Build failed in Jenkins: JMeter-trunk #5945
Date Sun, 26 Feb 2017 16:31:57 GMT
See <https://builds.apache.org/job/JMeter-trunk/5945/display/redirect?page=changes>

Changes:

[pmouawad] Plug test for Java Implementation

------------------------------------------
[...truncated 114.32 KB...]
     [echo] BatchTestLocal output files compared OK

batch_scripts:

batchtest:
     [echo] Starting HTMLParserTestFile_2 using -X
   [jmeter] Creating summariser <summary>
   [jmeter] Created the tree successfully using testfiles/HTMLParserTestFile_2.jmx
   [jmeter] Starting the test @ Sun Feb 26 16:28:33 UTC 2017 (1488126513522)
   [jmeter] Waiting for possible Shutdown/StopTestNow/Heapdump message on port 4445
   [jmeter] summary +      1 in 00:00:00 =    3.7/s Avg:   107 Min:   107 Max:   107 Err:
    0 (0.00%) Active: 1 Started: 1 Finished: 0
   [jmeter] summary =      1 in 00:00:00 =    3.7/s Avg:   107 Min:   107 Max:   107 Err:
    0 (0.00%)
   [jmeter] Tidying up ...    @ Sun Feb 26 16:28:34 UTC 2017 (1488126514327)
   [jmeter] ... end of run
     [echo] HTMLParserTestFile_2 output files compared OK

batchtest:
     [echo] Starting Bug52310 using -X
   [jmeter] Creating summariser <summary>
   [jmeter] Created the tree successfully using testfiles/Bug52310.jmx
   [jmeter] Starting the test @ Sun Feb 26 16:28:36 UTC 2017 (1488126516446)
   [jmeter] Waiting for possible Shutdown/StopTestNow/Heapdump message on port 4445
   [jmeter] summary =      3 in 00:00:02 =    1.5/s Avg:   501 Min:    13 Max:  1026 Err:
    0 (0.00%)
   [jmeter] Tidying up ...    @ Sun Feb 26 16:28:38 UTC 2017 (1488126518978)
   [jmeter] ... end of run
     [echo] Bug52310 output files compared OK

batchtest:
     [echo] Starting Bug52968 using -X
   [jmeter] Creating summariser <summary>
   [jmeter] Created the tree successfully using testfiles/Bug52968.jmx
   [jmeter] Starting the test @ Sun Feb 26 16:28:41 UTC 2017 (1488126521230)
   [jmeter] Waiting for possible Shutdown/StopTestNow/Heapdump message on port 4445
   [jmeter] summary =     30 in 00:00:13 =    2.3/s Avg:   244 Min:   102 Max:   350 Err:
    9 (30.00%)
   [jmeter] Tidying up ...    @ Sun Feb 26 16:28:54 UTC 2017 (1488126534636)
   [jmeter] ... end of run
     [echo] Bug52968 output files compared OK

batchtest:
     [echo] Starting Bug50898 using -X
   [jmeter] Creating summariser <summary>
   [jmeter] Created the tree successfully using testfiles/Bug50898.jmx
   [jmeter] Starting the test @ Sun Feb 26 16:28:56 UTC 2017 (1488126536603)
   [jmeter] Waiting for possible Shutdown/StopTestNow/Heapdump message on port 4445
   [jmeter] summary =      2 in 00:00:01 =    3.5/s Avg:   211 Min:   202 Max:   221 Err:
    0 (0.00%)
   [jmeter] Tidying up ...    @ Sun Feb 26 16:28:57 UTC 2017 (1488126537772)
   [jmeter] ... end of run
     [echo] Bug50898 output files compared OK

batchtest:
     [echo] Starting Bug56243 using -X
   [jmeter] Creating summariser <summary>
   [jmeter] Created the tree successfully using testfiles/Bug56243.jmx
   [jmeter] Starting the test @ Sun Feb 26 16:28:59 UTC 2017 (1488126539877)
   [jmeter] Waiting for possible Shutdown/StopTestNow/Heapdump message on port 4445
   [jmeter] summary +      1 in 00:00:00 =    6.5/s Avg:     8 Min:     8 Max:     8 Err:
    0 (0.00%) Active: 1 Started: 1 Finished: 0
   [jmeter] summary +      8 in 00:00:00 =  216.2/s Avg:     0 Min:     0 Max:     1 Err:
    0 (0.00%) Active: 0 Started: 1 Finished: 1
   [jmeter] summary =      9 in 00:00:00 =   46.6/s Avg:     1 Min:     0 Max:     8 Err:
    0 (0.00%)
   [jmeter] Tidying up ...    @ Sun Feb 26 16:29:00 UTC 2017 (1488126540594)
   [jmeter] ... end of run
     [echo] Bug56243 output files compared OK

batchtest:
     [echo] Starting Bug54685 using -X
   [jmeter] Creating summariser <summary>
   [jmeter] Created the tree successfully using testfiles/Bug54685.jmx
   [jmeter] Starting the test @ Sun Feb 26 16:29:02 UTC 2017 (1488126542743)
   [jmeter] Waiting for possible Shutdown/StopTestNow/Heapdump message on port 4445
   [jmeter] summary +      1 in 00:00:00 =    3.1/s Avg:   190 Min:   190 Max:   190 Err:
    0 (0.00%) Active: 1 Started: 1 Finished: 0
   [jmeter] summary =      1 in 00:00:00 =    3.0/s Avg:   190 Min:   190 Max:   190 Err:
    0 (0.00%)
   [jmeter] Tidying up ...    @ Sun Feb 26 16:29:03 UTC 2017 (1488126543625)
   [jmeter] ... end of run
     [echo] Bug54685 output files compared OK

batchtest:
     [echo] Starting Bug55375 using -X
   [jmeter] Creating summariser <summary>
   [jmeter] Created the tree successfully using testfiles/Bug55375.jmx
   [jmeter] Starting the test @ Sun Feb 26 16:29:05 UTC 2017 (1488126545711)
   [jmeter] Waiting for possible Shutdown/StopTestNow/Heapdump message on port 4445
   [jmeter] summary =      1 in 00:00:00 =    2.4/s Avg:   286 Min:   286 Max:   286 Err:
    0 (0.00%)
   [jmeter] Tidying up ...    @ Sun Feb 26 16:29:06 UTC 2017 (1488126546621)
   [jmeter] ... end of run
     [echo] Bug55375 output files compared OK

batchtestserver:
   [server] Created remote object: UnicastServerRef [liveRef: [endpoint:[67.195.81.186:60314](local),objID:[-27662da9:15a7b411944:-7fff,
1282613223042083756]]]

batchtest:
     [echo] Starting Bug54685 using -Rlocalhost:2469
   [client] Creating summariser <summary>
   [client] Created the tree successfully using testfiles/Bug54685.jmx
   [client] Configuring remote engine: localhost:2469
   [client] Starting remote engines
   [client] Starting the test @ Sun Feb 26 16:29:10 UTC 2017 (1488126550771)
   [server] Starting the test on host localhost:2469 @ Sun Feb 26 16:29:12 UTC 2017 (1488126552157)
   [client] Remote engines have been started
   [client] Waiting for possible Shutdown/StopTestNow/Heapdump message on port 4445
   [client] summary =      1 in 00:00:00 =    2.1/s Avg:   351 Min:   351 Max:   351 Err:
    0 (0.00%)
   [client] Tidying up remote @ Sun Feb 26 16:29:13 UTC 2017 (1488126553147)
   [server] Finished the test on host localhost:2469 @ Sun Feb 26 16:29:13 UTC 2017 (1488126553147)
- exit requested.
   [client] ... end of run
     [echo] Bug54685 output files compared OK

batchtest:
     [echo] Starting Bug56811 using -X
   [jmeter] Creating summariser <summary>
   [jmeter] Created the tree successfully using testfiles/Bug56811.jmx
   [jmeter] Starting the test @ Sun Feb 26 16:29:20 UTC 2017 (1488126560261)
   [jmeter] Waiting for possible Shutdown/StopTestNow/Heapdump message on port 4445
   [jmeter] summary =      9 in 00:00:08 =    1.1/s Avg:   130 Min:     1 Max:   308 Err:
    3 (33.33%)
   [jmeter] Tidying up ...    @ Sun Feb 26 16:29:29 UTC 2017 (1488126569099)
   [jmeter] ... end of run
     [echo] Bug56811 output files compared OK

batchtest:

batchtest:
     [echo] Starting Bug60607 using -X
   [jmeter] Creating summariser <summary>
   [jmeter] Created the tree successfully using testfiles/Bug60607.jmx
   [jmeter] Starting the test @ Sun Feb 26 16:29:31 UTC 2017 (1488126571330)
   [jmeter] Waiting for possible Shutdown/StopTestNow/Heapdump message on port 4445
   [jmeter] summary =      2 in 00:00:36 =    0.1/s Avg: 17748 Min:  5419 Max: 30077 Err:
    0 (0.00%)
   [jmeter] Tidying up ...    @ Sun Feb 26 16:30:07 UTC 2017 (1488126607604)
   [jmeter] ... end of run
     [echo] Bug60607 output files compared OK

batchtest:
     [echo] Starting SlowCharsFeature using -X
   [jmeter] Creating summariser <summary>
   [jmeter] Created the tree successfully using testfiles/SlowCharsFeature.jmx
   [jmeter] Starting the test @ Sun Feb 26 16:30:09 UTC 2017 (1488126609713)
   [jmeter] Waiting for possible Shutdown/StopTestNow/Heapdump message on port 4445
   [jmeter] summary =      3 in 00:00:18 =    0.2/s Avg:  5790 Min:   378 Max: 11162 Err:
    0 (0.00%)
   [jmeter] Tidying up ...    @ Sun Feb 26 16:30:28 UTC 2017 (1488126628264)
   [jmeter] ... end of run
     [echo] SlowCharsFeature output files compared OK

batchtest:
     [echo] Starting Http4ImplPreemptiveBasicAuth using -X
   [jmeter] Creating summariser <summary>
   [jmeter] Created the tree successfully using testfiles/Http4ImplPreemptiveBasicAuth.jmx
   [jmeter] Starting the test @ Sun Feb 26 16:30:30 UTC 2017 (1488126630426)
   [jmeter] Waiting for possible Shutdown/StopTestNow/Heapdump message on port 4445
   [jmeter] summary +      1 in 00:00:01 =    0.7/s Avg:   403 Min:   403 Max:   403 Err:
    0 (0.00%) Active: 1 Started: 1 Finished: 0
   [jmeter] summary +     11 in 00:00:07 =    1.7/s Avg:   393 Min:   153 Max:  1122 Err:
    0 (0.00%) Active: 0 Started: 6 Finished: 6
   [jmeter] summary =     12 in 00:00:08 =    1.5/s Avg:   394 Min:   153 Max:  1122 Err:
    0 (0.00%)
   [jmeter] Tidying up ...    @ Sun Feb 26 16:30:39 UTC 2017 (1488126639263)
   [jmeter] ... end of run
     [echo] Http4ImplPreemptiveBasicAuth output files compared OK

batchtest:
     [echo] Starting TestKeepAlive using -X
   [jmeter] Creating summariser <summary>
   [jmeter] Created the tree successfully using testfiles/TestKeepAlive.jmx
   [jmeter] Starting the test @ Sun Feb 26 16:30:41 UTC 2017 (1488126641361)
   [jmeter] Waiting for possible Shutdown/StopTestNow/Heapdump message on port 4445
   [jmeter] summary =      7 in 00:01:02 =    0.1/s Avg:   269 Min:   154 Max:   403 Err:
    0 (0.00%)
   [jmeter] Tidying up ...    @ Sun Feb 26 16:31:44 UTC 2017 (1488126704430)
   [jmeter] ... end of run
     [echo] TestKeepAlive output files compared OK

batchtest:
     [echo] Starting TestHeaderManager using -X
   [jmeter] Creating summariser <summary>
   [jmeter] Created the tree successfully using testfiles/TestHeaderManager.jmx
   [jmeter] Starting the test @ Sun Feb 26 16:31:46 UTC 2017 (1488126706559)
   [jmeter] Waiting for possible Shutdown/StopTestNow/Heapdump message on port 4445
   [jmeter] summary =      3 in 00:00:00 =   10.3/s Avg:    18 Min:     1 Max:    54 Err:
    0 (0.00%)
   [jmeter] Tidying up ...    @ Sun Feb 26 16:31:47 UTC 2017 (1488126707379)
   [jmeter] ... end of run
     [echo] TestHeaderManager output files compared OK

batchtest:
     [echo] Starting TEST_HTTP using -X
   [jmeter] Creating summariser <summary>
   [jmeter] Created the tree successfully using testfiles/TEST_HTTP.jmx
   [jmeter] Starting the test @ Sun Feb 26 16:31:49 UTC 2017 (1488126709482)
   [jmeter] Waiting for possible Shutdown/StopTestNow/Heapdump message on port 4445
   [jmeter] summary =     16 in 00:00:01 =   15.9/s Avg:    37 Min:     1 Max:   385 Err:
    0 (0.00%)
   [jmeter] Tidying up ...    @ Sun Feb 26 16:31:51 UTC 2017 (1488126711359)
   [jmeter] ... end of run
     [echo] TEST_HTTP output files compared OK

batchtest:
     [echo] Starting TEST_HTTP using -X
   [jmeter] Creating summariser <summary>
   [jmeter] Created the tree successfully using testfiles/TEST_HTTP.jmx
   [jmeter] Starting the test @ Sun Feb 26 16:31:54 UTC 2017 (1488126714438)
   [jmeter] Waiting for possible Shutdown/StopTestNow/Heapdump message on port 4445
   [jmeter] Uncaught Exception java.lang.StringIndexOutOfBoundsException: String index out
of range: -1. See log file for details.
   [jmeter] summary =     16 in 00:00:01 =   21.4/s Avg:    31 Min:     1 Max:   367 Err:
    9 (56.25%)
   [jmeter] Tidying up ...    @ Sun Feb 26 16:31:56 UTC 2017 (1488126716044)
   [jmeter] ... end of run
   [concat] 2017-02-26 16:31:55,997 ERROR o.a.j.p.h.s.HTTPJavaImpl: readResponse: java.net.ProtocolException:
Server redirected too many  times (20)
   [concat] 2017-02-26 16:31:55,999 ERROR o.a.j.p.h.s.HTTPJavaImpl: Cause: java.net.ProtocolException:
Server redirected too many  times (20)
   [concat] 2017-02-26 16:31:56,000 ERROR o.a.j.JMeter: Uncaught exception: 
   [concat] java.lang.StringIndexOutOfBoundsException: String index out of range: -1
   [concat] 	at java.lang.String.substring(String.java:1967) ~[?:1.8.0_121]
   [concat] 	at org.apache.jmeter.protocol.http.control.HttpMirrorThread.run(HttpMirrorThread.java:113)
~[ApacheJMeter_http.jar:r1784466]
   [concat] 	at java.util.concurrent.ThreadPoolExecutor.runWorker(ThreadPoolExecutor.java:1142)
~[?:1.8.0_121]
   [concat] 	at java.util.concurrent.ThreadPoolExecutor$Worker.run(ThreadPoolExecutor.java:617)
~[?:1.8.0_121]
   [concat] 	at java.lang.Thread.run(Thread.java:745) [?:1.8.0_121]

BUILD FAILED
<https://builds.apache.org/job/JMeter-trunk/ws/trunk/build.xml>:2725: The following
error occurred while executing this line:
<https://builds.apache.org/job/JMeter-trunk/ws/trunk/build.xml>:2599: CSV Files are
not identical.
        <https://builds.apache.org/job/JMeter-trunk/ws/trunk/bin/testfiles/TEST_HTTP.csv>
        JSS_startMirror,200,setUp Thread Group 1-1,text,true
GET_NO_PARAMETERS,200,TG_TEST_GET_COMBINATIONS 1-1,text,true
GET_WITH_PARAMETERS_IN_URL,200,TG_TEST_GET_COMBINATIONS 1-1,text,true
GET_WITH_PARAMETERS,200,TG_TEST_GET_COMBINATIONS 1-1,text,true
GET_WITH_BODY,200,TG_TEST_GET_COMBINATIONS 1-1,text,true
HR-Gzip,200,TG_TEST_GZIP 2-1,text,true
HR-NoGzip,200,TG_TEST_GZIP 2-1,text,true
HR-NoFollowRedirect,302,TG_TEST_REDIRECT 3-1,text,true
HR-GET_WITH_BODY_NoFollowRedirect,302,TG_TEST_REDIRECT 3-1,text,true
HR-FollowRedirect,Non HTTP response code: java.io.IOException,TG_TEST_REDIRECT 3-1,text,true
HR-FollowRedirect,Non HTTP response code: org.apache.http.client.ClientProtocolException,TG_TEST_REDIRECT
3-1,text,true
HR-POST_WITH_PARAMETERS,200,TG_TEST_POST 4-1,text,true
HR-POST_WITH_PARAMETERS,200,TG_TEST_POST 4-1,text,true
HR-POST_WITH_PARAMETERS,200,TG_TEST_POST 4-1,text,true
HR-POST_WITH_PARAMETERS,200,TG_TEST_POST 4-1,text,true
JSS_stopMirror,200,tearDown Thread Group 1-1,text,true

        <https://builds.apache.org/job/JMeter-trunk/ws/trunk/bin/TEST_HTTP.csv>
        JSS_startMirror,200,setUp Thread Group 1-1,text,true
GET_NO_PARAMETERS,200,TG_TEST_GET_COMBINATIONS 1-1,text,false
GET_WITH_PARAMETERS_IN_URL,200,TG_TEST_GET_COMBINATIONS 1-1,text,false
GET_WITH_PARAMETERS,200,TG_TEST_GET_COMBINATIONS 1-1,text,false
GET_WITH_BODY,200,TG_TEST_GET_COMBINATIONS 1-1,text,false
HR-Gzip,200,TG_TEST_GZIP 2-1,text,true
HR-NoGzip,200,TG_TEST_GZIP 2-1,text,true
HR-NoFollowRedirect,302,TG_TEST_REDIRECT 3-1,text,true
HR-GET_WITH_BODY_NoFollowRedirect,302,TG_TEST_REDIRECT 3-1,text,false
HR-FollowRedirect,Non HTTP response code: java.io.IOException,TG_TEST_REDIRECT 3-1,text,true
HR-FollowRedirect,Non HTTP response code: java.net.ProtocolException,TG_TEST_REDIRECT 3-1,text,true
HR-POST_WITH_PARAMETERS,200,TG_TEST_POST 4-1,text,false
HR-POST_WITH_PARAMETERS,200,TG_TEST_POST 4-1,text,false
HR-POST_WITH_PARAMETERS,200,TG_TEST_POST 4-1,text,false
HR-POST_WITH_PARAMETERS,200,TG_TEST_POST 4-1,text,false
JSS_stopMirror,200,tearDown Thread Group 1-1,text,true

Total time: 8 minutes 2 seconds
Build step 'Invoke Ant' marked build as failure
[locks-and-latches] Releasing all the locks
[locks-and-latches] All the locks released
Archiving artifacts

Mime
View raw message