jmeter-dev mailing list archives

Site index · List index
Message view « Date » · « Thread »
Top « Date » · « Thread »
From Apache Jenkins Server <jenk...@builds.apache.org>
Subject Build failed in Jenkins: JMeter-trunk #5760
Date Thu, 26 Jan 2017 22:39:18 GMT
See <https://builds.apache.org/job/JMeter-trunk/5760/changes>

Changes:

[pmouawad] Add Test of Slow connection feature to detect any regression, see Bug 59902 for
example
svn:eol

[pmouawad] Add Test of Slow connection feature to detect any regression, see Bug 59902 for
example

------------------------------------------
[...truncated 1346 lines...]
   [jmeter] Starting the test @ Thu Jan 26 22:37:37 UTC 2017 (1485470257235)
   [jmeter] Waiting for possible Shutdown/StopTestNow/Heapdump message on port 4445
   [jmeter] summary =      3 in 00:00:02 =    1.3/s Avg:   605 Min:     9 Max:   938 Err:
    0 (0.00%)
   [jmeter] Tidying up ...    @ Thu Jan 26 22:37:39 UTC 2017 (1485470259715)
   [jmeter] ... end of run
     [echo] Bug52310 output files compared OK

batchtest:
     [echo] Starting Bug52968 using -X
   [jmeter] Writing log file to: <https://builds.apache.org/job/JMeter-trunk/ws/trunk/bin/Bug52968.log>
   [jmeter] Creating summariser <summary>
   [jmeter] Created the tree successfully using testfiles/Bug52968.jmx
   [jmeter] Starting the test @ Thu Jan 26 22:37:41 UTC 2017 (1485470261282)
   [jmeter] Waiting for possible Shutdown/StopTestNow/Heapdump message on port 4445
   [jmeter] summary =     30 in 00:00:12 =    2.5/s Avg:   208 Min:   102 Max:   313 Err:
    9 (30.00%)
   [jmeter] Tidying up ...    @ Thu Jan 26 22:37:53 UTC 2017 (1485470273368)
   [jmeter] ... end of run
     [echo] Bug52968 output files compared OK

batchtest:
     [echo] Starting Bug50898 using -X
   [jmeter] Writing log file to: <https://builds.apache.org/job/JMeter-trunk/ws/trunk/bin/Bug50898.log>
   [jmeter] Creating summariser <summary>
   [jmeter] Created the tree successfully using testfiles/Bug50898.jmx
   [jmeter] Starting the test @ Thu Jan 26 22:37:55 UTC 2017 (1485470275014)
   [jmeter] Waiting for possible Shutdown/StopTestNow/Heapdump message on port 4445
   [jmeter] summary =      2 in 00:00:01 =    3.3/s Avg:   231 Min:   227 Max:   235 Err:
    0 (0.00%)
   [jmeter] Tidying up ...    @ Thu Jan 26 22:37:55 UTC 2017 (1485470275755)
   [jmeter] ... end of run
     [echo] Bug50898 output files compared OK

batchtest:
     [echo] Starting Bug56243 using -X
   [jmeter] Writing log file to: <https://builds.apache.org/job/JMeter-trunk/ws/trunk/bin/Bug56243.log>
   [jmeter] Creating summariser <summary>
   [jmeter] Created the tree successfully using testfiles/Bug56243.jmx
   [jmeter] Starting the test @ Thu Jan 26 22:37:57 UTC 2017 (1485470277244)
   [jmeter] Waiting for possible Shutdown/StopTestNow/Heapdump message on port 4445
   [jmeter] summary =      9 in 00:00:00 =   54.5/s Avg:     1 Min:     0 Max:     5 Err:
    0 (0.00%)
   [jmeter] Tidying up ...    @ Thu Jan 26 22:37:57 UTC 2017 (1485470277541)
   [jmeter] ... end of run
     [echo] Bug56243 output files compared OK

batchtest:
     [echo] Starting Bug54685 using -X
   [jmeter] Writing log file to: <https://builds.apache.org/job/JMeter-trunk/ws/trunk/bin/Bug54685.log>
   [jmeter] Creating summariser <summary>
   [jmeter] Created the tree successfully using testfiles/Bug54685.jmx
   [jmeter] Starting the test @ Thu Jan 26 22:37:58 UTC 2017 (1485470278935)
   [jmeter] Waiting for possible Shutdown/StopTestNow/Heapdump message on port 4445
   [jmeter] summary =      1 in 00:00:00 =    2.4/s Avg:   315 Min:   315 Max:   315 Err:
    0 (0.00%)
   [jmeter] Tidying up ...    @ Thu Jan 26 22:37:59 UTC 2017 (1485470279510)
   [jmeter] ... end of run
     [echo] Bug54685 output files compared OK

batchtest:
     [echo] Starting Bug55375 using -X
   [jmeter] Writing log file to: <https://builds.apache.org/job/JMeter-trunk/ws/trunk/bin/Bug55375.log>
   [jmeter] Creating summariser <summary>
   [jmeter] Created the tree successfully using testfiles/Bug55375.jmx
   [jmeter] Starting the test @ Thu Jan 26 22:38:00 UTC 2017 (1485470280958)
   [jmeter] Waiting for possible Shutdown/StopTestNow/Heapdump message on port 4445
   [jmeter] summary +      1 in 00:00:00 =    2.9/s Avg:   256 Min:   256 Max:   256 Err:
    0 (0.00%) Active: 1 Started: 1 Finished: 0
   [jmeter] summary =      1 in 00:00:00 =    2.8/s Avg:   256 Min:   256 Max:   256 Err:
    0 (0.00%)
   [jmeter] Tidying up ...    @ Thu Jan 26 22:38:01 UTC 2017 (1485470281437)
   [jmeter] ... end of run
     [echo] Bug55375 output files compared OK

batchtestserver:
   [server] Writing log file to: <https://builds.apache.org/job/JMeter-trunk/ws/trunk/bin/BatchTestServer.log>
   [server] Created remote object: UnicastServerRef [liveRef: [endpoint:[67.195.81.186:50442](local),objID:[-33ea00c9:159dcedb2f5:-7fff,
-6227698334383521554]]]

batchtest:
     [echo] Starting Bug54685 using -Rlocalhost:13704
   [client] Writing log file to: <https://builds.apache.org/job/JMeter-trunk/ws/trunk/bin/Bug54685.log>
   [client] Creating summariser <summary>
   [client] Created the tree successfully using testfiles/Bug54685.jmx
   [client] Configuring remote engine: localhost:13704
   [client] Starting remote engines
   [client] Starting the test @ Thu Jan 26 22:38:04 UTC 2017 (1485470284055)
   [server] Starting the test on host localhost:13704 @ Thu Jan 26 22:38:05 UTC 2017 (1485470285032)
   [client] Remote engines have been started
   [client] Waiting for possible Shutdown/StopTestNow/Heapdump message on port 4445
   [server] Finished the test on host localhost:13704 @ Thu Jan 26 22:38:05 UTC 2017 (1485470285645)
- exit requested.
   [client] summary +      1 in 00:00:00 =    2.2/s Avg:   303 Min:   303 Max:   303 Err:
    0 (0.00%) Active: 1 Started: 1 Finished: 0
   [client] summary =      1 in 00:00:00 =    2.2/s Avg:   303 Min:   303 Max:   303 Err:
    0 (0.00%)
   [client] Tidying up remote @ Thu Jan 26 22:38:05 UTC 2017 (1485470285644)
   [client] ... end of run
     [echo] Bug54685 output files compared OK

batchtest:
     [echo] Starting Bug56811 using -X
   [jmeter] Writing log file to: <https://builds.apache.org/job/JMeter-trunk/ws/trunk/bin/Bug56811.log>
   [jmeter] Creating summariser <summary>
   [jmeter] Created the tree successfully using testfiles/Bug56811.jmx
   [jmeter] Starting the test @ Thu Jan 26 22:38:12 UTC 2017 (1485470292292)
   [jmeter] Waiting for possible Shutdown/StopTestNow/Heapdump message on port 4445
   [jmeter] summary =      9 in 00:00:09 =    1.0/s Avg:   163 Min:     1 Max:   346 Err:
    3 (33.33%)
   [jmeter] Tidying up ...    @ Thu Jan 26 22:38:21 UTC 2017 (1485470301680)
   [jmeter] ... end of run
     [echo] Bug56811 output files compared OK

batchtest:
     [echo] Starting TEST_HTTPS using -X
   [jmeter] Writing log file to: <https://builds.apache.org/job/JMeter-trunk/ws/trunk/bin/TEST_HTTPS.log>
   [jmeter] Creating summariser <summary>
   [jmeter] Created the tree successfully using testfiles/TEST_HTTPS.jmx
   [jmeter] Starting the test @ Thu Jan 26 22:38:23 UTC 2017 (1485470303136)
   [jmeter] Waiting for possible Shutdown/StopTestNow/Heapdump message on port 4445
   [jmeter] summary =      2 in 00:00:03 =    0.6/s Avg:  1471 Min:  1150 Max:  1793 Err:
    0 (0.00%)
   [jmeter] Tidying up ...    @ Thu Jan 26 22:38:26 UTC 2017 (1485470306438)
   [jmeter] ... end of run
     [echo] TEST_HTTPS output files compared OK

batchtest:
     [echo] Starting Bug60607 using -X
   [jmeter] Writing log file to: <https://builds.apache.org/job/JMeter-trunk/ws/trunk/bin/Bug60607.log>
   [jmeter] Creating summariser <summary>
   [jmeter] Created the tree successfully using testfiles/Bug60607.jmx
   [jmeter] Starting the test @ Thu Jan 26 22:38:27 UTC 2017 (1485470307885)
   [jmeter] Waiting for possible Shutdown/StopTestNow/Heapdump message on port 4445
   [jmeter] summary =      2 in 00:00:31 =    0.1/s Avg: 15241 Min:   409 Max: 30073 Err:
    0 (0.00%)
   [jmeter] Tidying up ...    @ Thu Jan 26 22:38:58 UTC 2017 (1485470338745)
   [jmeter] ... end of run
     [echo] Bug60607 output files compared OK

batchtest:
     [echo] Starting SlowCharsFeature using -X
   [jmeter] Writing log file to: <https://builds.apache.org/job/JMeter-trunk/ws/trunk/bin/SlowCharsFeature.log>
   [jmeter] Creating summariser <summary>
   [jmeter] Created the tree successfully using testfiles/SlowCharsFeature.jmx
   [jmeter] Starting the test @ Thu Jan 26 22:39:00 UTC 2017 (1485470340168)
   [jmeter] Waiting for possible Shutdown/StopTestNow/Heapdump message on port 4445
   [jmeter] summary +      1 in 00:00:00 =    2.6/s Avg:   355 Min:   355 Max:   355 Err:
    0 (0.00%) Active: 1 Started: 1 Finished: 0
   [jmeter] summary +      2 in 00:00:17 =    0.1/s Avg:  8549 Min:  5808 Max: 11291 Err:
    0 (0.00%) Active: 0 Started: 1 Finished: 1
   [jmeter] summary =      3 in 00:00:18 =    0.2/s Avg:  5818 Min:   355 Max: 11291 Err:
    0 (0.00%)
   [jmeter] Tidying up ...    @ Thu Jan 26 22:39:18 UTC 2017 (1485470358366)
   [jmeter] ... end of run

BUILD FAILED
<https://builds.apache.org/job/JMeter-trunk/ws/trunk/build.xml>:2717: The following
error occurred while executing this line:
<https://builds.apache.org/job/JMeter-trunk/ws/trunk/build.xml>:2627: XML Files are
not identical.
        <https://builds.apache.org/job/JMeter-trunk/ws/trunk/bin/testfiles/SlowCharsFeature.xml>
        <?xml version="1.0" encoding="UTF-8"?>
<testResults version="1.2">
<sample s="true" lb="JSR223 Sampler" rc="200" rm="OK" tn="setUp Thread Group 1-1" dt="text"
by="4"/>
<httpSample s="true" lb="ApacheJMeter-HP-NonSecure" rc="206" rm="Partial Content" tn="Thread
Group 1-1" dt="text" by="7359">
  <assertionResult>
    <name>RA_206</name>
    <failure>false</failure>
    <error>false</error>
  </assertionResult>
  <assertionResult>
    <name>RA</name>
    <failure>false</failure>
    <error>false</error>
  </assertionResult>
  <assertionResult>
    <name>RA_PartialContent</name>
    <failure>false</failure>
    <error>false</error>
  </assertionResult>
  <assertionResult>
    <name>JSA-CheckResponseTimeHigherThan5s</name>
    <failure>false</failure>
    <error>false</error>
  </assertionResult>
</httpSample>
<httpSample s="true" lb="ApacheJMeter-HP-Secure" rc="206" rm="Partial Content" tn="Thread
Group 1-1" dt="text" by="7359">
  <assertionResult>
    <name>RA_206</name>
    <failure>false</failure>
    <error>false</error>
  </assertionResult>
  <assertionResult>
    <name>RA</name>
    <failure>false</failure>
    <error>false</error>
  </assertionResult>
  <assertionResult>
    <name>RA_PartialContent</name>
    <failure>false</failure>
    <error>false</error>
  </assertionResult>
  <assertionResult>
    <name>JSA-CheckResponseTimeHigherThan5s</name>
    <failure>false</failure>
    <error>false</error>
  </assertionResult>
</httpSample>

</testResults>

        <https://builds.apache.org/job/JMeter-trunk/ws/trunk/bin/SlowCharsFeature.xml>
        <?xml version="1.0" encoding="UTF-8"?>
<testResults version="1.2">
<sample s="true" lb="JSR223 Sampler" rc="200" rm="OK" tn="setUp Thread Group 1-1" dt="text"
by="0"/>
<httpSample s="true" lb="ApacheJMeter-HP-NonSecure" rc="206" rm="Partial Content" tn="Thread
Group 1-1" dt="text" by="7359">
  <assertionResult>
    <name>RA_206</name>
    <failure>false</failure>
    <error>false</error>
  </assertionResult>
  <assertionResult>
    <name>RA</name>
    <failure>false</failure>
    <error>false</error>
  </assertionResult>
  <assertionResult>
    <name>RA_PartialContent</name>
    <failure>false</failure>
    <error>false</error>
  </assertionResult>
  <assertionResult>
    <name>JSA-CheckResponseTimeHigherThan5s</name>
    <failure>false</failure>
    <error>false</error>
  </assertionResult>
</httpSample>
<httpSample s="true" lb="ApacheJMeter-HP-Secure" rc="206" rm="Partial Content" tn="Thread
Group 1-1" dt="text" by="7359">
  <assertionResult>
    <name>RA_206</name>
    <failure>false</failure>
    <error>false</error>
  </assertionResult>
  <assertionResult>
    <name>RA</name>
    <failure>false</failure>
    <error>false</error>
  </assertionResult>
  <assertionResult>
    <name>RA_PartialContent</name>
    <failure>false</failure>
    <error>false</error>
  </assertionResult>
  <assertionResult>
    <name>JSA-CheckResponseTimeHigherThan5s</name>
    <failure>false</failure>
    <error>false</error>
  </assertionResult>
</httpSample>

</testResults>

Total time: 5 minutes 20 seconds
Build step 'Invoke Ant' marked build as failure
[locks-and-latches] Releasing all the locks
[locks-and-latches] All the locks released
Archiving artifacts

Mime
View raw message