jmeter-dev mailing list archives

Site index · List index
Message view « Date » · « Thread »
Top « Date » · « Thread »
From Apache Jenkins Server <jenk...@builds.apache.org>
Subject Build failed in Jenkins: JMeter-trunk #5577
Date Sun, 27 Nov 2016 17:30:11 GMT
See <https://builds.apache.org/job/JMeter-trunk/5577/changes>

Changes:

[pmouawad] Bug 60423 - Drop Monitor Results listener Part 5
Fix sha
Bugzilla Id: 60423

[pmouawad] Bug 60423 - Drop Monitor Results listener Part 4
Fix eclipse build

[pmouawad] Bug 60423 - Drop Monitor Results listener Part 3
Remove monitor building parts
Bugzilla Id: 60423

[pmouawad] Bug 60423 - Drop Monitor Results listener Part 2
Bugzilla Id: 60423

[pmouawad] Bug 60423 - Drop Monitor Results listener Part 1
Bugzilla Id: 60423

------------------------------------------
[...truncated 1166 lines...]
  [javadoc]      * @throws MalformedURLException
  [javadoc]        ^
  [javadoc] <https://builds.apache.org/job/JMeter-trunk/ws/trunk/src/core/org/apache/jmeter/gui/action/AbstractActionWithNoRunningTest.java>:51:
warning: no description for @throws
  [javadoc]      * @throws IllegalUserActionException
  [javadoc]        ^
  [javadoc] <https://builds.apache.org/job/JMeter-trunk/ws/trunk/src/core/org/apache/jmeter/gui/util/JSyntaxTextArea.java>:69:
warning: no @return
  [javadoc]     public static JSyntaxTextArea getInstance(int rows, int cols, boolean disableUndo)
{
  [javadoc]                                   ^
  [javadoc] <https://builds.apache.org/job/JMeter-trunk/ws/trunk/src/core/org/apache/jmeter/gui/util/JSyntaxTextArea.java>:118:
warning: no @return
  [javadoc]     public static JSyntaxTextArea getInstance(int rows, int cols) {
  [javadoc]                                   ^
  [javadoc] <https://builds.apache.org/job/JMeter-trunk/ws/trunk/src/core/org/apache/jmeter/gui/util/JTextScrollPane.java>:64:
warning: no description for @param
  [javadoc]      * @param scriptField
  [javadoc]        ^
  [javadoc] <https://builds.apache.org/job/JMeter-trunk/ws/trunk/src/core/org/apache/jmeter/gui/util/JTextScrollPane.java>:74:
warning: no description for @param
  [javadoc]      * @param scriptField
  [javadoc]        ^
  [javadoc] <https://builds.apache.org/job/JMeter-trunk/ws/trunk/src/core/org/apache/jmeter/gui/util/JTextScrollPane.java>:78:
warning: no @param for foldIndicatorEnabled
  [javadoc]     public JTextScrollPane(JSyntaxTextArea scriptField, boolean foldIndicatorEnabled)
{
  [javadoc]            ^
  [javadoc] <https://builds.apache.org/job/JMeter-trunk/ws/trunk/src/core/org/apache/jmeter/report/core/Sample.java>:105:
warning: no @param for <TData>
  [javadoc]     public <TData> TData getData(Class<TData> clazz, int index, String
fieldName) {
  [javadoc]                          ^
  [javadoc] <https://builds.apache.org/job/JMeter-trunk/ws/trunk/src/core/org/apache/jmeter/report/core/Sample.java>:123:
warning: no @param for <TData>
  [javadoc]     public <TData> TData getData(Class<TData> clazz, String name)
{
  [javadoc]                          ^
  [javadoc] <https://builds.apache.org/job/JMeter-trunk/ws/trunk/src/core/org/apache/jmeter/report/dashboard/AbstractDataExporter.java>:50:
warning: no @param for <TValue>
  [javadoc]     protected static <TValue> TValue findValue(Class<TValue> clazz,
String data,
  [javadoc]                                      ^
  [javadoc] <https://builds.apache.org/job/JMeter-trunk/ws/trunk/src/core/org/apache/jmeter/report/processor/AbstractSummaryConsumer.java>:189:
warning: no @param for info
  [javadoc]     protected abstract void updateData(SummaryInfo info, Sample sample);
  [javadoc]                             ^
  [javadoc] <https://builds.apache.org/job/JMeter-trunk/ws/trunk/src/core/org/apache/jmeter/report/processor/ResultData.java>:33:
warning: no @param for <TVisit>
  [javadoc]     <TVisit> TVisit accept(ResultDataVisitor<TVisit> visitor);
  [javadoc]                     ^
  [javadoc] <https://builds.apache.org/job/JMeter-trunk/ws/trunk/src/core/org/apache/jmeter/report/processor/ResultData.java>:33:
warning: no @return
  [javadoc]     <TVisit> TVisit accept(ResultDataVisitor<TVisit> visitor);
  [javadoc]                     ^
  [javadoc] <https://builds.apache.org/job/JMeter-trunk/ws/trunk/src/core/org/apache/jmeter/report/processor/StatisticsSummaryData.java>:191:
warning: no @param for percentileIndex1
  [javadoc]     public StatisticsSummaryData(long percentileIndex1, long percentileIndex2,
  [javadoc]            ^
  [javadoc] <https://builds.apache.org/job/JMeter-trunk/ws/trunk/src/core/org/apache/jmeter/report/processor/StatisticsSummaryData.java>:191:
warning: no @param for percentileIndex2
  [javadoc]     public StatisticsSummaryData(long percentileIndex1, long percentileIndex2,
  [javadoc]            ^
  [javadoc] <https://builds.apache.org/job/JMeter-trunk/ws/trunk/src/core/org/apache/jmeter/report/processor/StatisticsSummaryData.java>:191:
warning: no @param for percentileIndex3
  [javadoc]     public StatisticsSummaryData(long percentileIndex1, long percentileIndex2,
  [javadoc]            ^
  [javadoc] <https://builds.apache.org/job/JMeter-trunk/ws/trunk/src/core/org/apache/jmeter/report/processor/Top5ErrorsBySamplerConsumer.java>:185:
warning: no description for @param
  [javadoc]      * @param ignoreTCFromTop5ErrorsBySampler
  [javadoc]        ^
  [javadoc] <https://builds.apache.org/job/JMeter-trunk/ws/trunk/src/components/org/apache/jmeter/visualizers/SearchTextExtension.java>:274:
warning: no @param for pattern
  [javadoc]         boolean executeAndShowTextFind(Pattern pattern);
  [javadoc]                 ^
  [javadoc] <https://builds.apache.org/job/JMeter-trunk/ws/trunk/src/components/org/apache/jmeter/extractor/RegexExtractor.java>:470:
warning: no @return
  [javadoc]     public boolean isEmptyDefaultValue() {
  [javadoc]                    ^
  [javadoc] <https://builds.apache.org/job/JMeter-trunk/ws/trunk/src/components/org/apache/jmeter/extractor/json/jsonpath/JSONManager.java>:75:
warning: no description for @throws
  [javadoc]      * @throws ParseException
  [javadoc]        ^
  [javadoc] <https://builds.apache.org/job/JMeter-trunk/ws/trunk/src/protocol/http/org/apache/jmeter/protocol/http/parser/LinkExtractorParser.java>:48:
warning: no @throws for org.apache.jmeter.protocol.http.parser.LinkExtractorParseException
  [javadoc]     Iterator<URL> getEmbeddedResourceURLs(
  [javadoc]                   ^
  [javadoc] <https://builds.apache.org/job/JMeter-trunk/ws/trunk/src/protocol/http/org/apache/jmeter/protocol/http/parser/LinkExtractorParseException.java>:39:
warning: no description for @param
  [javadoc]      * @param message
  [javadoc]        ^
  [javadoc] <https://builds.apache.org/job/JMeter-trunk/ws/trunk/src/protocol/http/org/apache/jmeter/protocol/http/parser/LinkExtractorParseException.java>:53:
warning: no description for @param
  [javadoc]      * @param message
  [javadoc]        ^
  [javadoc] <https://builds.apache.org/job/JMeter-trunk/ws/trunk/src/protocol/http/org/apache/jmeter/protocol/http/parser/LinkExtractorParseException.java>:54:
warning: no description for @param
  [javadoc]      * @param cause
  [javadoc]        ^
  [javadoc] <https://builds.apache.org/job/JMeter-trunk/ws/trunk/src/protocol/http/org/apache/jmeter/protocol/http/parser/LinkExtractorParseException.java>:61:
warning: no description for @param
  [javadoc]      * @param message
  [javadoc]        ^
  [javadoc] <https://builds.apache.org/job/JMeter-trunk/ws/trunk/src/protocol/http/org/apache/jmeter/protocol/http/parser/LinkExtractorParseException.java>:62:
warning: no description for @param
  [javadoc]      * @param cause
  [javadoc]        ^
  [javadoc] <https://builds.apache.org/job/JMeter-trunk/ws/trunk/src/protocol/http/org/apache/jmeter/protocol/http/parser/LinkExtractorParseException.java>:63:
warning: no description for @param
  [javadoc]      * @param enableSuppression
  [javadoc]        ^
  [javadoc] <https://builds.apache.org/job/JMeter-trunk/ws/trunk/src/protocol/http/org/apache/jmeter/protocol/http/parser/LinkExtractorParseException.java>:64:
warning: no description for @param
  [javadoc]      * @param writableStackTrace
  [javadoc]        ^
  [javadoc] <https://builds.apache.org/job/JMeter-trunk/ws/trunk/src/protocol/http/org/apache/jmeter/protocol/http/parser/LinkExtractorParseException.java>:46:
warning: no description for @param
  [javadoc]      * @param cause
  [javadoc]        ^
  [javadoc] <https://builds.apache.org/job/JMeter-trunk/ws/trunk/src/protocol/http/org/apache/jmeter/protocol/http/sampler/HTTPSamplerBase.java>:545:
warning: no @return
  [javadoc]     public String getMonitor() {
  [javadoc]                   ^
  [javadoc] <https://builds.apache.org/job/JMeter-trunk/ws/trunk/src/protocol/http/org/apache/jmeter/protocol/http/sampler/HTTPSamplerBase.java>:553:
warning: no @return
  [javadoc]     public boolean isMonitor() {
  [javadoc]                    ^
  [javadoc] <https://builds.apache.org/job/JMeter-trunk/ws/trunk/src/protocol/http/org/apache/jmeter/protocol/http/sampler/LazySchemeSocketFactory.java>:72:
warning: no description for @param
  [javadoc]      * @param params
  [javadoc]        ^
  [javadoc] <https://builds.apache.org/job/JMeter-trunk/ws/trunk/src/protocol/http/org/apache/jmeter/protocol/http/sampler/LazySchemeSocketFactory.java>:74:
warning: no description for @throws
  [javadoc]      * @throws IOException
  [javadoc]        ^
  [javadoc] <https://builds.apache.org/job/JMeter-trunk/ws/trunk/src/protocol/http/org/apache/jmeter/protocol/http/sampler/LazySchemeSocketFactory.java>:83:
warning: no description for @param
  [javadoc]      * @param sock
  [javadoc]        ^
  [javadoc] <https://builds.apache.org/job/JMeter-trunk/ws/trunk/src/protocol/http/org/apache/jmeter/protocol/http/sampler/LazySchemeSocketFactory.java>:84:
warning: no description for @param
  [javadoc]      * @param remoteAddress
  [javadoc]        ^
  [javadoc] <https://builds.apache.org/job/JMeter-trunk/ws/trunk/src/protocol/http/org/apache/jmeter/protocol/http/sampler/LazySchemeSocketFactory.java>:85:
warning: no description for @param
  [javadoc]      * @param localAddress
  [javadoc]        ^
  [javadoc] <https://builds.apache.org/job/JMeter-trunk/ws/trunk/src/protocol/http/org/apache/jmeter/protocol/http/sampler/LazySchemeSocketFactory.java>:86:
warning: no description for @param
  [javadoc]      * @param params
  [javadoc]        ^
  [javadoc] <https://builds.apache.org/job/JMeter-trunk/ws/trunk/src/protocol/http/org/apache/jmeter/protocol/http/sampler/LazySchemeSocketFactory.java>:88:
warning: no description for @throws
  [javadoc]      * @throws IOException
  [javadoc]        ^
  [javadoc] <https://builds.apache.org/job/JMeter-trunk/ws/trunk/src/protocol/http/org/apache/jmeter/protocol/http/sampler/LazySchemeSocketFactory.java>:89:
warning: no description for @throws
  [javadoc]      * @throws UnknownHostException
  [javadoc]        ^
  [javadoc] <https://builds.apache.org/job/JMeter-trunk/ws/trunk/src/protocol/http/org/apache/jmeter/protocol/http/sampler/LazySchemeSocketFactory.java>:90:
warning: no description for @throws
  [javadoc]      * @throws ConnectTimeoutException
  [javadoc]        ^
  [javadoc] <https://builds.apache.org/job/JMeter-trunk/ws/trunk/src/protocol/http/org/apache/jmeter/protocol/http/sampler/LazySchemeSocketFactory.java>:101:
warning: no description for @param
  [javadoc]      * @param sock
  [javadoc]        ^
  [javadoc] <https://builds.apache.org/job/JMeter-trunk/ws/trunk/src/protocol/http/org/apache/jmeter/protocol/http/sampler/LazySchemeSocketFactory.java>:103:
warning: no description for @throws
  [javadoc]      * @throws IllegalArgumentException
  [javadoc]        ^
  [javadoc] <https://builds.apache.org/job/JMeter-trunk/ws/trunk/src/protocol/http/org/apache/jmeter/protocol/http/sampler/LazySchemeSocketFactory.java>:113:
warning: no description for @param
  [javadoc]      * @param target 
  [javadoc]        ^
  [javadoc] <https://builds.apache.org/job/JMeter-trunk/ws/trunk/src/protocol/http/org/apache/jmeter/protocol/http/sampler/LazySchemeSocketFactory.java>:114:
warning: no description for @param
  [javadoc]      * @param port 
  [javadoc]        ^
  [javadoc] <https://builds.apache.org/job/JMeter-trunk/ws/trunk/src/jorphan/org/apache/jorphan/math/StatCalculator.java>:98:
warning: no description for @param
  [javadoc]      * @param newValue 
  [javadoc]        ^
  [javadoc] <https://builds.apache.org/job/JMeter-trunk/ws/trunk/src/jorphan/org/apache/jorphan/math/StatCalculator.java>:106:
warning: no description for @param
  [javadoc]      * @param newValue
  [javadoc]        ^
  [javadoc] Building index for all the packages and classes...
  [javadoc] Building index for all classes...
  [javadoc] Generating <https://builds.apache.org/job/JMeter-trunk/ws/trunk/docs/api/help-doc.html...>
  [javadoc] 48 warnings

compile-tests:
    [javac] Compiling 138 source files to <https://builds.apache.org/job/JMeter-trunk/ws/trunk/build/test>
    [javac] Note: Some input files use or override a deprecated API.
    [javac] Note: Recompile with -Xlint:deprecation for details.

_test:
     [echo] 
     [echo]    gump.run = false
     [echo]    java.awt.headless = true
     [echo]    test.headless = true
     [echo]    user.dir = <https://builds.apache.org/job/JMeter-trunk/ws/trunk>
     [echo]    basedir = <https://builds.apache.org/job/JMeter-trunk/ws/trunk>
     [echo]    test dir = build/test
     [echo]    test dir gump = build/test
     [echo]    testsaveservice.saveout = ${testsaveservice.saveout}
     [echo]    test.encoding = UTF-8
     [echo]     
     [java] Setting JMeterHome: <https://builds.apache.org/job/JMeter-trunk/ws/trunk>
     [java] Setting up logging props using file: <https://builds.apache.org/job/JMeter-trunk/ws/trunk/bin/jmeter.properties>
     [java] Writing log file to: <https://builds.apache.org/job/JMeter-trunk/ws/trunk/bin/jmeter.log>
     [java] Using initializeProperties() from org.apache.jmeter.util.JMeterUtils
     [java] Setting up initial properties using: <https://builds.apache.org/job/JMeter-trunk/ws/trunk/bin/jmeter.properties>
     [java] Initializing Properties: <https://builds.apache.org/job/JMeter-trunk/ws/trunk/bin/jmeter.properties>
     [java] Writing log file to: <https://builds.apache.org/job/JMeter-trunk/ws/trunk/bin/jmeter.log>
     [java] JMeterVersion=r1771614
     [java] java.version=1.8.0_102
     [java] java.home=/usr/local/asfpackages/java/jdk1.8.0_102/jre
     [java] file.encoding=UTF-8
     [java] default encoding=UTF-8
     [java] user.dir=<https://builds.apache.org/job/JMeter-trunk/ws/trunk/bin>
     [java] Locale=en_US
     [java] os.name=Linux
     [java] os.version=3.13.0-98-generic
     [java] JCE max key length = 128
     [java] +++++++++++
     [java] java.awt.headless=true
     [java] java.awt.graphicsenv=sun.awt.X11GraphicsEnvironment
     [java] ------------
     [java] Searching junit tests in : build/test
     [java] o.a.j.junit.JMeterTest INFO: JMeterGUIComponent: skipping some tests org.apache.jmeter.testbeans.gui.TestBeanGUI
     [java] o.a.j.junit.JMeterTest Error creating org.apache.jmeter.config.gui.RowDetailDialog
java.awt.HeadlessException
     [java] o.a.j.junit.JMeterTest Error creating org.apache.jmeter.functions.gui.FunctionHelper
java.awt.HeadlessException
     [java] o.a.j.junit.JMeterTest Error creating org.apache.jmeter.gui.MainFrame java.awt.HeadlessException
     [java] o.a.j.junit.JMeterTest Error creating org.apache.jmeter.gui.SavePropertyDialog
java.awt.HeadlessException
     [java] o.a.j.junit.JMeterTest Error creating org.apache.jmeter.gui.action.SearchTreeDialog
java.awt.HeadlessException
     [java] o.a.j.junit.JMeterTest Error creating org.apache.jmeter.gui.action.SelectTemplatesDialog
java.awt.HeadlessException
     [java] o.a.j.junit.JMeterTest Error creating org.apache.jmeter.gui.util.EscapeDialog
java.awt.HeadlessException
     [java] o.a.j.junit.JMeterTest Error creating org.apache.jmeter.gui.util.JSyntaxTextArea
java.awt.HeadlessException
     [java] o.a.j.junit.JMeterTest WARN: java.io.Serializable: NoSuchMethodException  org.apache.jmeter.protocol.http.parser.CSSParseExceptionCallback,
missing empty Constructor or Constructor with Object parameter
     [java] .....................................................................................................................................................................................................................................................................................................................................................................................................................................................................................................................................................................................................................................................................................................................................................................................................................................................................................................................................................................................................................................................................................................................................................................................................................................................................................................................................................................................................................................................................................................................................................................................................................................................................................................................................................................................................................................................................................................................................................................................................................................................................
     [java] Loading file testfiles/GuiTest231.jmx and saving it back changes its size from
65524 to 65512.
     [java] 
     [java] Loading file testfiles/GenTest27.jmx and saving it back changes its size from
80080 to 80068.
     [java] 
     [java] Loading file testfiles/GenTest210.jmx and saving it back changes its size from
86542 to 86530.
     [java] 
     [java] Loading file testfiles/GenTest2_13.jmx and saving it back changes its size from
87197 to 87185.
     [java] 
     [java] Loading file testfiles/GenTest3_0.jmx and saving it back changes its size from
83879 to 83867.
     [java] E.....................................................................................................................................................................................................................................................................................................................................................................................................I......................................................................................................................................................................................................................................................
     [java] Time: 67.405
     [java] There was 1 failure:
     [java] 1) testLoadAndSave(org.apache.jmeter.save.TestSaveService)
     [java] java.lang.AssertionError: One or more failures detected
     [java] 	at org.junit.Assert.fail(Assert.java:88)
     [java] 	at org.apache.jmeter.save.TestSaveService.testLoadAndSave(TestSaveService.java:118)
     [java] 	at sun.reflect.NativeMethodAccessorImpl.invoke0(Native Method)
     [java] 	at sun.reflect.NativeMethodAccessorImpl.invoke(NativeMethodAccessorImpl.java:62)
     [java] 	at sun.reflect.DelegatingMethodAccessorImpl.invoke(DelegatingMethodAccessorImpl.java:43)
     [java] 	at java.lang.reflect.Method.invoke(Method.java:498)
     [java] 	at org.junit.runners.model.FrameworkMethod$1.runReflectiveCall(FrameworkMethod.java:50)
     [java] 	at org.junit.internal.runners.model.ReflectiveCallable.run(ReflectiveCallable.java:12)
     [java] 	at org.junit.runners.model.FrameworkMethod.invokeExplosively(FrameworkMethod.java:47)
     [java] 	at org.junit.internal.runners.statements.InvokeMethod.evaluate(InvokeMethod.java:17)
     [java] 	at org.junit.runners.ParentRunner.runLeaf(ParentRunner.java:325)
     [java] 	at org.junit.runners.BlockJUnit4ClassRunner.runChild(BlockJUnit4ClassRunner.java:78)
     [java] 	at org.junit.runners.BlockJUnit4ClassRunner.runChild(BlockJUnit4ClassRunner.java:57)
     [java] 	at org.junit.runners.ParentRunner$3.run(ParentRunner.java:290)
     [java] 	at org.junit.runners.ParentRunner$1.schedule(ParentRunner.java:71)
     [java] 	at org.junit.runners.ParentRunner.runChildren(ParentRunner.java:288)
     [java] 	at org.junit.runners.ParentRunner.access$000(ParentRunner.java:58)
     [java] 	at org.junit.runners.ParentRunner$2.evaluate(ParentRunner.java:268)
     [java] 	at org.junit.runners.ParentRunner.run(ParentRunner.java:363)
     [java] 	at org.junit.runners.Suite.runChild(Suite.java:128)
     [java] 	at org.junit.runners.Suite.runChild(Suite.java:27)
     [java] 	at org.junit.runners.ParentRunner$3.run(ParentRunner.java:290)
     [java] 	at org.junit.runners.ParentRunner$1.schedule(ParentRunner.java:71)
     [java] 	at org.junit.runners.ParentRunner.runChildren(ParentRunner.java:288)
     [java] 	at org.junit.runners.ParentRunner.access$000(ParentRunner.java:58)
     [java] 	at org.junit.runners.ParentRunner$2.evaluate(ParentRunner.java:268)
     [java] 	at org.junit.runners.ParentRunner.run(ParentRunner.java:363)
     [java] 	at org.junit.runner.JUnitCore.run(JUnitCore.java:137)
     [java] 	at org.junit.runner.JUnitCore.run(JUnitCore.java:115)
     [java] 	at org.apache.jorphan.test.AllTests.main(AllTests.java:222)
     [java] 
     [java] FAILURES!!!
     [java] Tests run: 2624,  Failures: 1
     [java] 

BUILD FAILED
<https://builds.apache.org/job/JMeter-trunk/ws/trunk/build.xml>:2755: Java returned:
1

Total time: 2 minutes 56 seconds
Build step 'Invoke Ant' marked build as failure
[locks-and-latches] Releasing all the locks
[locks-and-latches] All the locks released
Archiving artifacts

Mime
View raw message