jmeter-dev mailing list archives

Site index · List index
Message view « Date » · « Thread »
Top « Date » · « Thread »
From Apache Jenkins Server <jenk...@builds.apache.org>
Subject Build failed in Jenkins: JMeter-trunk #5481
Date Sat, 08 Oct 2016 12:07:18 GMT
See <https://builds.apache.org/job/JMeter-trunk/5481/changes>

Changes:

[pmouawad] Bug 60220 - Rename JSON Path Post Processor to JSON Extractor
Bugzilla Id: 60220

------------------------------------------
[...truncated 1779 lines...]
_check_exists:

_checkMD5:
     [echo] Checksum OK: xmlgraphics-commons-2.1.jar

_check_jarfile:

_check_exists:

_checkMD5:
     [echo] Checksum OK: xmlpull-1.1.3.1.jar

_check_jarfile:

_check_exists:

_checkMD5:
     [echo] Checksum OK: xpp3_min-1.1.4c.jar

_check_jarfile:

_check_exists:

_checkMD5:
     [echo] Checksum OK: xstream-1.4.9.jar

_check_jarfile:

_distribution:
     [echo] Creating JMeter distribution apache-jmeter-r1763891 1763891

_filter:
      [tar] Building tar: <https://builds.apache.org/job/JMeter-trunk/5481/artifact/trunk/dist/apache-jmeter-r1763891.tar>
     [gzip] Building: <https://builds.apache.org/job/JMeter-trunk/5481/artifact/trunk/dist/apache-jmeter-r1763891.tgz>
   [delete] Deleting: <https://builds.apache.org/job/JMeter-trunk/5481/artifact/trunk/dist/apache-jmeter-r1763891.tar>

_hash:
     [echo] Creating MD5 for dist/apache-jmeter-r1763891.tgz
     [echo] Creating SHA for dist/apache-jmeter-r1763891.tgz

_filter:
     [echo] Converting work files to eol=crlf in dist/crlf
    [mkdir] Created dir: <https://builds.apache.org/job/JMeter-trunk/ws/trunk/dist/crlf>
     [copy] Copying 1567 files to <https://builds.apache.org/job/JMeter-trunk/ws/trunk/dist/crlf>
      [zip] Building zip: <https://builds.apache.org/job/JMeter-trunk/5481/artifact/trunk/dist/apache-jmeter-r1763891.zip>

_hash:
     [echo] Creating MD5 for dist/apache-jmeter-r1763891.zip
     [echo] Creating SHA for dist/apache-jmeter-r1763891.zip
   [delete] Deleting directory <https://builds.apache.org/job/JMeter-trunk/ws/trunk/dist/crlf>

_filter:
      [tar] Building tar: <https://builds.apache.org/job/JMeter-trunk/5481/artifact/trunk/dist/apache-jmeter-r1763891_src.tar>
     [gzip] Building: <https://builds.apache.org/job/JMeter-trunk/5481/artifact/trunk/dist/apache-jmeter-r1763891_src.tgz>
   [delete] Deleting: <https://builds.apache.org/job/JMeter-trunk/5481/artifact/trunk/dist/apache-jmeter-r1763891_src.tar>

_hash:
     [echo] Creating MD5 for dist/apache-jmeter-r1763891_src.tgz
     [echo] Creating SHA for dist/apache-jmeter-r1763891_src.tgz

_filter:
     [echo] Converting work files to eol=crlf in dist/crlf
    [mkdir] Created dir: <https://builds.apache.org/job/JMeter-trunk/ws/trunk/dist/crlf>
     [copy] Copying 1621 files to <https://builds.apache.org/job/JMeter-trunk/ws/trunk/dist/crlf>
      [zip] Building zip: <https://builds.apache.org/job/JMeter-trunk/5481/artifact/trunk/dist/apache-jmeter-r1763891_src.zip>

_hash:
     [echo] Creating MD5 for dist/apache-jmeter-r1763891_src.zip
     [echo] Creating SHA for dist/apache-jmeter-r1763891_src.zip
   [delete] Deleting directory <https://builds.apache.org/job/JMeter-trunk/ws/trunk/dist/crlf>

nightly:

_check_3rdparty:

_message_3rdParty:

compile-slf4j_logkit:

init-version:
     [echo] jmeter.version = r1763891
     [echo] display.version = r1763891
     [echo] implementation.version = r1763891

compile-jorphan:

compile-core:

compile-components:

compile-functions:

compile-http:

compile-ftp:

compile-jdbc:

compile-java:

compile-ldap:

create-mail-dir:

compile-mail:

compile-tcp:

compile-protocols:

compile-monitor-model:

compile-monitor-components:

compile-monitor:

compile-junit:

compile-jms:

compile-native:

compile-mongodb:

compile:

compile-tests:

prepare-resources:
     [copy] Copying 3 files to <https://builds.apache.org/job/JMeter-trunk/ws/trunk/build/res/META-INF>

package-only:
      [jar] Building jar: <https://builds.apache.org/job/JMeter-trunk/ws/trunk/bin/ApacheJMeter.jar>
      [jar] Building jar: <https://builds.apache.org/job/JMeter-trunk/ws/trunk/lib/ext/ApacheJMeter_core.jar>
      [jar] Building jar: <https://builds.apache.org/job/JMeter-trunk/ws/trunk/lib/ext/ApacheJMeter_components.jar>
      [jar] Building jar: <https://builds.apache.org/job/JMeter-trunk/ws/trunk/lib/ext/ApacheJMeter_functions.jar>
      [jar] Building jar: <https://builds.apache.org/job/JMeter-trunk/ws/trunk/lib/ext/ApacheJMeter_http.jar>
      [jar] Building jar: <https://builds.apache.org/job/JMeter-trunk/ws/trunk/lib/ext/ApacheJMeter_ftp.jar>
      [jar] Building jar: <https://builds.apache.org/job/JMeter-trunk/ws/trunk/lib/ext/ApacheJMeter_jdbc.jar>
      [jar] Building jar: <https://builds.apache.org/job/JMeter-trunk/ws/trunk/lib/ext/ApacheJMeter_java.jar>
      [jar] Building jar: <https://builds.apache.org/job/JMeter-trunk/ws/trunk/lib/bshclient.jar>
      [jar] Building jar: <https://builds.apache.org/job/JMeter-trunk/ws/trunk/lib/ext/ApacheJMeter_junit.jar>
      [jar] Building jar: <https://builds.apache.org/job/JMeter-trunk/ws/trunk/lib/junit/test.jar>
      [jar] Building jar: <https://builds.apache.org/job/JMeter-trunk/ws/trunk/lib/ext/ApacheJMeter_ldap.jar>
      [jar] Building jar: <https://builds.apache.org/job/JMeter-trunk/ws/trunk/lib/ext/ApacheJMeter_mail.jar>
      [jar] Building jar: <https://builds.apache.org/job/JMeter-trunk/ws/trunk/lib/ext/ApacheJMeter_tcp.jar>
      [jar] Building jar: <https://builds.apache.org/job/JMeter-trunk/ws/trunk/lib/ext/ApacheJMeter_monitors.jar>
      [jar] Building jar: <https://builds.apache.org/job/JMeter-trunk/ws/trunk/lib/ext/ApacheJMeter_jms.jar>
      [jar] Building jar: <https://builds.apache.org/job/JMeter-trunk/ws/trunk/lib/ext/ApacheJMeter_native.jar>
      [jar] Building jar: <https://builds.apache.org/job/JMeter-trunk/ws/trunk/lib/ext/ApacheJMeter_mongodb.jar>
      [jar] Building jar: <https://builds.apache.org/job/JMeter-trunk/ws/trunk/lib/ApacheJMeter_slf4j_logkit.jar>
      [jar] Building jar: <https://builds.apache.org/job/JMeter-trunk/ws/trunk/lib/jorphan.jar>

package:

_test:
     [echo] 
     [echo]    gump.run = false
     [echo]    java.awt.headless = true
     [echo]    test.headless = true
     [echo]    user.dir = <https://builds.apache.org/job/JMeter-trunk/ws/trunk>
     [echo]    basedir = <https://builds.apache.org/job/JMeter-trunk/ws/trunk>
     [echo]    test dir = build/test
     [echo]    test dir gump = build/test
     [echo]    testsaveservice.saveout = ${testsaveservice.saveout}
     [echo]    test.encoding = UTF-8
     [echo]     
     [java] Setting JMeterHome: <https://builds.apache.org/job/JMeter-trunk/ws/trunk>
     [java] Setting up logging props using file: <https://builds.apache.org/job/JMeter-trunk/ws/trunk/bin/jmeter.properties>
     [java] Writing log file to: <https://builds.apache.org/job/JMeter-trunk/ws/trunk/bin/jmeter.log>
     [java] Using initializeProperties() from org.apache.jmeter.util.JMeterUtils
     [java] Setting up initial properties using: <https://builds.apache.org/job/JMeter-trunk/ws/trunk/bin/jmeter.properties>
     [java] Initializing Properties: <https://builds.apache.org/job/JMeter-trunk/ws/trunk/bin/jmeter.properties>
     [java] Writing log file to: <https://builds.apache.org/job/JMeter-trunk/ws/trunk/bin/jmeter.log>
     [java] JMeterVersion=r1763891
     [java] java.version=1.7.0_80
     [java] java.home=/usr/local/asfpackages/java/jdk1.7.0_80/jre
     [java] file.encoding=UTF-8
     [java] default encoding=UTF-8
     [java] user.dir=<https://builds.apache.org/job/JMeter-trunk/ws/trunk/bin>
     [java] Locale=en_US
     [java] os.name=Linux
     [java] os.version=3.13.0-92-generic
     [java] JCE max key length = 128
     [java] +++++++++++
     [java] java.awt.headless=true
     [java] java.awt.graphicsenv=sun.awt.X11GraphicsEnvironment
     [java] ------------
     [java] Searching junit tests in : build/test
     [java] o.a.j.junit.JMeterTest INFO: JMeterGUIComponent: skipping some tests org.apache.jmeter.testbeans.gui.TestBeanGUI
     [java] o.a.j.junit.JMeterTest Error creating org.apache.jmeter.config.gui.RowDetailDialog
java.awt.HeadlessException
     [java] o.a.j.junit.JMeterTest Error creating org.apache.jmeter.functions.gui.FunctionHelper
java.awt.HeadlessException
     [java] o.a.j.junit.JMeterTest Error creating org.apache.jmeter.gui.MainFrame java.awt.HeadlessException
     [java] o.a.j.junit.JMeterTest Error creating org.apache.jmeter.gui.SavePropertyDialog
java.awt.HeadlessException
     [java] o.a.j.junit.JMeterTest Error creating org.apache.jmeter.gui.action.SearchTreeDialog
java.awt.HeadlessException
     [java] o.a.j.junit.JMeterTest Error creating org.apache.jmeter.gui.action.SelectTemplatesDialog
java.awt.HeadlessException
     [java] o.a.j.junit.JMeterTest Error creating org.apache.jmeter.gui.util.EscapeDialog
java.awt.HeadlessException
     [java] o.a.j.junit.JMeterTest Error creating org.apache.jmeter.gui.util.JSyntaxTextArea
java.awt.HeadlessException
     [java] ................................................................................................................................................................................................................................................................................................................................................................................................................................................................................................................................................................................................................................................................................................................................................................................................................................................................................................................................................................................................................................................................................................................................................................................................................................................................................................................................................................................................................................................................................................................................................................................................................................................................................................................................................................................................................................................................................................................................................................................................................................................E..............................................................................................................................................................................................................................................................................................................................................................................................................................I.....................................................................................................................................................................................................................................................
     [java] Time: 82.746
     [java] There was 1 failure:
     [java] 1) testSubResultsTruePause(org.apache.jmeter.samplers.TestSampleResult)
     [java] java.lang.AssertionError: ParentElapsed: 405 -  sum(samples): 401 = 4 not in [0,3];
nanotime=true
     [java] 	at org.junit.Assert.fail(Assert.java:88)
     [java] 	at org.apache.jmeter.samplers.TestSampleResult.testSubResults(TestSampleResult.java:287)
     [java] 	at org.apache.jmeter.samplers.TestSampleResult.testSubResults(TestSampleResult.java:202)
     [java] 	at org.apache.jmeter.samplers.TestSampleResult.testSubResultsTruePause(TestSampleResult.java:175)
     [java] 	at sun.reflect.NativeMethodAccessorImpl.invoke0(Native Method)
     [java] 	at sun.reflect.NativeMethodAccessorImpl.invoke(NativeMethodAccessorImpl.java:57)
     [java] 	at sun.reflect.DelegatingMethodAccessorImpl.invoke(DelegatingMethodAccessorImpl.java:43)
     [java] 	at java.lang.reflect.Method.invoke(Method.java:606)
     [java] 	at org.junit.runners.model.FrameworkMethod$1.runReflectiveCall(FrameworkMethod.java:50)
     [java] 	at org.junit.internal.runners.model.ReflectiveCallable.run(ReflectiveCallable.java:12)
     [java] 	at org.junit.runners.model.FrameworkMethod.invokeExplosively(FrameworkMethod.java:47)
     [java] 	at org.junit.internal.runners.statements.InvokeMethod.evaluate(InvokeMethod.java:17)
     [java] 	at org.junit.runners.ParentRunner.runLeaf(ParentRunner.java:325)
     [java] 	at org.junit.runners.BlockJUnit4ClassRunner.runChild(BlockJUnit4ClassRunner.java:78)
     [java] 	at org.junit.runners.BlockJUnit4ClassRunner.runChild(BlockJUnit4ClassRunner.java:57)
     [java] 	at org.junit.runners.ParentRunner$3.run(ParentRunner.java:290)
     [java] 	at org.junit.runners.ParentRunner$1.schedule(ParentRunner.java:71)
     [java] 	at org.junit.runners.ParentRunner.runChildren(ParentRunner.java:288)
     [java] 	at org.junit.runners.ParentRunner.access$000(ParentRunner.java:58)
     [java] 	at org.junit.runners.ParentRunner$2.evaluate(ParentRunner.java:268)
     [java] 	at org.junit.runners.ParentRunner.run(ParentRunner.java:363)
     [java] 	at org.junit.runners.Suite.runChild(Suite.java:128)
     [java] 	at org.junit.runners.Suite.runChild(Suite.java:27)
     [java] 	at org.junit.runners.ParentRunner$3.run(ParentRunner.java:290)
     [java] 	at org.junit.runners.ParentRunner$1.schedule(ParentRunner.java:71)
     [java] 	at org.junit.runners.ParentRunner.runChildren(ParentRunner.java:288)
     [java] 	at org.junit.runners.ParentRunner.access$000(ParentRunner.java:58)
     [java] 	at org.junit.runners.ParentRunner$2.evaluate(ParentRunner.java:268)
     [java] 	at org.junit.runners.ParentRunner.run(ParentRunner.java:363)
     [java] 	at org.junit.runner.JUnitCore.run(JUnitCore.java:137)
     [java] 	at org.junit.runner.JUnitCore.run(JUnitCore.java:115)
     [java] 	at org.apache.jorphan.test.AllTests.main(AllTests.java:222)
     [java] 
     [java] FAILURES!!!
     [java] Tests run: 2627,  Failures: 1
     [java] 

BUILD FAILED
<https://builds.apache.org/job/JMeter-trunk/ws/trunk/build.xml>:2746: Java returned:
1

Total time: 9 minutes 5 seconds
Build step 'Invoke Ant' marked build as failure
[locks-and-latches] Releasing all the locks
[locks-and-latches] All the locks released
Archiving artifacts
Compressed 117.32 MB of artifacts by 27.6% relative to #5480

Mime
View raw message