jmeter-dev mailing list archives

Site index · List index
Message view « Date » · « Thread »
Top « Date » · « Thread »
From Apache Jenkins Server <jenk...@builds.apache.org>
Subject Build failed in Jenkins: JMeter-trunk #4961
Date Wed, 17 Feb 2016 22:13:39 GMT
See <https://builds.apache.org/job/JMeter-trunk/4961/changes>

Changes:

[pmouawad] Bug 58099 - Performance : Lazily initialize HttpClient SSL Context to avoid its
initialization even for HTTP only scenarios
Bugzilla Id: 58099

------------------------------------------
[...truncated 934 lines...]

compile-monitor-model:
    [javac] Compiling 21 source files to <https://builds.apache.org/job/JMeter-trunk/ws/trunk/build/monitor/model>

compile-monitor-components:
    [javac] Compiling 13 source files to <https://builds.apache.org/job/JMeter-trunk/ws/trunk/build/monitor/components>

compile-monitor:

compile-junit:
    [javac] Compiling 14 source files to <https://builds.apache.org/job/JMeter-trunk/ws/trunk/build/junit>

compile-jms:
    [javac] Compiling 20 source files to <https://builds.apache.org/job/JMeter-trunk/ws/trunk/build/protocol/jms>

compile-native:
    [javac] Compiling 3 source files to <https://builds.apache.org/job/JMeter-trunk/ws/trunk/build/protocol/native>

compile-mongodb:
    [javac] Compiling 9 source files to <https://builds.apache.org/job/JMeter-trunk/ws/trunk/build/protocol/mongodb>

compile:

prepare-resources:
     [copy] Copying 2 files to <https://builds.apache.org/job/JMeter-trunk/ws/trunk/build/res/META-INF>

package-only:
      [jar] Building jar: <https://builds.apache.org/job/JMeter-trunk/ws/trunk/bin/ApacheJMeter.jar>
      [jar] Building jar: <https://builds.apache.org/job/JMeter-trunk/ws/trunk/lib/ext/ApacheJMeter_core.jar>
      [jar] Building jar: <https://builds.apache.org/job/JMeter-trunk/ws/trunk/lib/ext/ApacheJMeter_components.jar>
      [jar] Building jar: <https://builds.apache.org/job/JMeter-trunk/ws/trunk/lib/ext/ApacheJMeter_functions.jar>
      [jar] Building jar: <https://builds.apache.org/job/JMeter-trunk/ws/trunk/lib/ext/ApacheJMeter_http.jar>
      [jar] Building jar: <https://builds.apache.org/job/JMeter-trunk/ws/trunk/lib/ext/ApacheJMeter_ftp.jar>
      [jar] Building jar: <https://builds.apache.org/job/JMeter-trunk/ws/trunk/lib/ext/ApacheJMeter_jdbc.jar>
      [jar] Building jar: <https://builds.apache.org/job/JMeter-trunk/ws/trunk/lib/ext/ApacheJMeter_java.jar>
      [jar] Building jar: <https://builds.apache.org/job/JMeter-trunk/ws/trunk/lib/bshclient.jar>
      [jar] Building jar: <https://builds.apache.org/job/JMeter-trunk/ws/trunk/lib/ext/ApacheJMeter_junit.jar>
      [jar] Building jar: <https://builds.apache.org/job/JMeter-trunk/ws/trunk/lib/junit/test.jar>
      [jar] Building jar: <https://builds.apache.org/job/JMeter-trunk/ws/trunk/lib/ext/ApacheJMeter_ldap.jar>
      [jar] Building jar: <https://builds.apache.org/job/JMeter-trunk/ws/trunk/lib/ext/ApacheJMeter_mail.jar>
      [jar] Building jar: <https://builds.apache.org/job/JMeter-trunk/ws/trunk/lib/ext/ApacheJMeter_tcp.jar>
      [jar] Building jar: <https://builds.apache.org/job/JMeter-trunk/ws/trunk/lib/ext/ApacheJMeter_monitors.jar>
      [jar] Building jar: <https://builds.apache.org/job/JMeter-trunk/ws/trunk/lib/ext/ApacheJMeter_jms.jar>
      [jar] Building jar: <https://builds.apache.org/job/JMeter-trunk/ws/trunk/lib/ext/ApacheJMeter_native.jar>
      [jar] Building jar: <https://builds.apache.org/job/JMeter-trunk/ws/trunk/lib/ext/ApacheJMeter_mongodb.jar>
      [jar] Building jar: <https://builds.apache.org/job/JMeter-trunk/ws/trunk/lib/jorphan.jar>

package:

check-anakia:

report-old-velocity:

report-anakia-missing:

init-docs:
     [echo] eclipse.anakia = .

docs-printable:
   [anakia] Transforming into: <https://builds.apache.org/job/JMeter-trunk/ws/trunk/printable_docs>
   [anakia] Input:  building.xml
   [anakia] Output: <https://builds.apache.org/job/JMeter-trunk/ws/trunk/printable_docs/building.html>
   [anakia] Input:  changes.xml
   [anakia] Output: <https://builds.apache.org/job/JMeter-trunk/ws/trunk/printable_docs/changes.html>
   [anakia] Input:  changes_history.xml
   [anakia] Output: <https://builds.apache.org/job/JMeter-trunk/ws/trunk/printable_docs/changes_history.html>
   [anakia] Input:  devguide-dashboard.xml
   [anakia] Output: <https://builds.apache.org/job/JMeter-trunk/ws/trunk/printable_docs/devguide-dashboard.html>
   [anakia] Input:  download_jmeter.xml
   [anakia] Output: <https://builds.apache.org/job/JMeter-trunk/ws/trunk/printable_docs/download_jmeter.html>
   [anakia] Input:  index.xml
   [anakia] Output: <https://builds.apache.org/job/JMeter-trunk/ws/trunk/printable_docs/index.html>
   [anakia] Input:  issues.xml
   [anakia] Output: <https://builds.apache.org/job/JMeter-trunk/ws/trunk/printable_docs/issues.html>
   [anakia] Input:  jmeter_irc.xml
   [anakia] Output: <https://builds.apache.org/job/JMeter-trunk/ws/trunk/printable_docs/jmeter_irc.html>
   [anakia] Input:  localising/index.xml
   [anakia] Output: <https://builds.apache.org/job/JMeter-trunk/ws/trunk/printable_docs/localising/index.html>
   [anakia] Input:  mail.xml
   [anakia] Output: <https://builds.apache.org/job/JMeter-trunk/ws/trunk/printable_docs/mail.html>
   [anakia] Input:  mail2.xml
   [anakia] Output: <https://builds.apache.org/job/JMeter-trunk/ws/trunk/printable_docs/mail2.html>
   [anakia] Input:  nightly.xml
   [anakia] Output: <https://builds.apache.org/job/JMeter-trunk/ws/trunk/printable_docs/nightly.html>
   [anakia] Input:  svnindex.xml
   [anakia] Output: <https://builds.apache.org/job/JMeter-trunk/ws/trunk/printable_docs/svnindex.html>
   [anakia] Input:  usermanual/best-practices.xml
   [anakia] Output: <https://builds.apache.org/job/JMeter-trunk/ws/trunk/printable_docs/usermanual/best-practices.html>
   [anakia] Input:  usermanual/boss.xml
   [anakia] Output: <https://builds.apache.org/job/JMeter-trunk/ws/trunk/printable_docs/usermanual/boss.html>
   [anakia] Input:  usermanual/build-adv-web-test-plan.xml
   [anakia] Output: <https://builds.apache.org/job/JMeter-trunk/ws/trunk/printable_docs/usermanual/build-adv-web-test-plan.html>
   [anakia] Input:  usermanual/build-db-test-plan.xml
   [anakia] Output: <https://builds.apache.org/job/JMeter-trunk/ws/trunk/printable_docs/usermanual/build-db-test-plan.html>
   [anakia] Input:  usermanual/build-ftp-test-plan.xml
   [anakia] Output: <https://builds.apache.org/job/JMeter-trunk/ws/trunk/printable_docs/usermanual/build-ftp-test-plan.html>
   [anakia] Input:  usermanual/build-jms-point-to-point-test-plan.xml
   [anakia] Output: <https://builds.apache.org/job/JMeter-trunk/ws/trunk/printable_docs/usermanual/build-jms-point-to-point-test-plan.html>
   [anakia] Input:  usermanual/build-jms-topic-test-plan.xml
   [anakia] Output: <https://builds.apache.org/job/JMeter-trunk/ws/trunk/printable_docs/usermanual/build-jms-topic-test-plan.html>
   [anakia] Input:  usermanual/build-ldap-test-plan.xml
   [anakia] Output: <https://builds.apache.org/job/JMeter-trunk/ws/trunk/printable_docs/usermanual/build-ldap-test-plan.html>
   [anakia] Input:  usermanual/build-ldapext-test-plan.xml
   [anakia] Output: <https://builds.apache.org/job/JMeter-trunk/ws/trunk/printable_docs/usermanual/build-ldapext-test-plan.html>
   [anakia] Input:  usermanual/build-monitor-test-plan.xml
   [anakia] Output: <https://builds.apache.org/job/JMeter-trunk/ws/trunk/printable_docs/usermanual/build-monitor-test-plan.html>
   [anakia] Input:  usermanual/build-test-plan.xml
   [anakia] Output: <https://builds.apache.org/job/JMeter-trunk/ws/trunk/printable_docs/usermanual/build-test-plan.html>
   [anakia] Input:  usermanual/build-web-test-plan.xml
   [anakia] Output: <https://builds.apache.org/job/JMeter-trunk/ws/trunk/printable_docs/usermanual/build-web-test-plan.html>
   [anakia] Input:  usermanual/build-ws-test-plan.xml
   [anakia] Output: <https://builds.apache.org/job/JMeter-trunk/ws/trunk/printable_docs/usermanual/build-ws-test-plan.html>
   [anakia] Input:  usermanual/component_reference.xml
   [anakia] Output: <https://builds.apache.org/job/JMeter-trunk/ws/trunk/printable_docs/usermanual/component_reference.html>
   [anakia] Input:  usermanual/functions.xml
   [anakia] Output: <https://builds.apache.org/job/JMeter-trunk/ws/trunk/printable_docs/usermanual/functions.html>
   [anakia] Input:  usermanual/generating-dashboard.xml
   [anakia] Output: <https://builds.apache.org/job/JMeter-trunk/ws/trunk/printable_docs/usermanual/generating-dashboard.html>
   [anakia] Input:  usermanual/get-started.xml
   [anakia] Output: <https://builds.apache.org/job/JMeter-trunk/ws/trunk/printable_docs/usermanual/get-started.html>
   [anakia] Input:  usermanual/glossary.xml
   [anakia] Output: <https://builds.apache.org/job/JMeter-trunk/ws/trunk/printable_docs/usermanual/glossary.html>
   [anakia] Input:  usermanual/hints_and_tips.xml
   [anakia] Output: <https://builds.apache.org/job/JMeter-trunk/ws/trunk/printable_docs/usermanual/hints_and_tips.html>
   [anakia] Input:  usermanual/index.xml
   [anakia] Output: <https://builds.apache.org/job/JMeter-trunk/ws/trunk/printable_docs/usermanual/index.html>
   [anakia] Input:  usermanual/intro.xml
   [anakia] Output: <https://builds.apache.org/job/JMeter-trunk/ws/trunk/printable_docs/usermanual/intro.html>
   [anakia] Input:  usermanual/ldapanswer_xml.xml
   [anakia] Output: <https://builds.apache.org/job/JMeter-trunk/ws/trunk/printable_docs/usermanual/ldapanswer_xml.html>
   [anakia] Input:  usermanual/ldapops_tutor.xml
   [anakia] Output: <https://builds.apache.org/job/JMeter-trunk/ws/trunk/printable_docs/usermanual/ldapops_tutor.html>
   [anakia] Input:  usermanual/listeners.xml
   [anakia] Output: <https://builds.apache.org/job/JMeter-trunk/ws/trunk/printable_docs/usermanual/listeners.html>
   [anakia] Input:  usermanual/realtime-results.xml
   [anakia] Output: <https://builds.apache.org/job/JMeter-trunk/ws/trunk/printable_docs/usermanual/realtime-results.html>
   [anakia] Input:  usermanual/regular_expressions.xml
   [anakia] Output: <https://builds.apache.org/job/JMeter-trunk/ws/trunk/printable_docs/usermanual/regular_expressions.html>
   [anakia] Input:  usermanual/remote-test.xml
   [anakia] Output: <https://builds.apache.org/job/JMeter-trunk/ws/trunk/printable_docs/usermanual/remote-test.html>
   [anakia] Input:  usermanual/test_plan.xml
   [anakia] Output: <https://builds.apache.org/job/JMeter-trunk/ws/trunk/printable_docs/usermanual/test_plan.html>
     [echo] Fixing EOL
     [echo] Removing unnecessary </br> tags
     [echo] Copying files
     [copy] Copying 16 files to <https://builds.apache.org/job/JMeter-trunk/ws/trunk/printable_docs/demos>
     [copy] Copying 5 files to <https://builds.apache.org/job/JMeter-trunk/ws/trunk/printable_docs/usermanual>
     [copy] Copying 1 file to <https://builds.apache.org/job/JMeter-trunk/ws/trunk/printable_docs/extending>

pack-nightly:

_pack-binaries:
      [tar] Building tar: <https://builds.apache.org/job/JMeter-trunk/4961/artifact/trunk/dist/apache-jmeter-r1730947_bin.tar>
     [gzip] Building: <https://builds.apache.org/job/JMeter-trunk/4961/artifact/trunk/dist/apache-jmeter-r1730947_bin.tgz>
   [delete] Deleting: <https://builds.apache.org/job/JMeter-trunk/4961/artifact/trunk/dist/apache-jmeter-r1730947_bin.tar>
      [zip] Building zip: <https://builds.apache.org/job/JMeter-trunk/4961/artifact/trunk/dist/apache-jmeter-r1730947_bin.zip>

_pack-libraries:
      [tar] Building tar: <https://builds.apache.org/job/JMeter-trunk/4961/artifact/trunk/dist/apache-jmeter-r1730947_lib.tar>
     [gzip] Building: <https://builds.apache.org/job/JMeter-trunk/4961/artifact/trunk/dist/apache-jmeter-r1730947_lib.tgz>
   [delete] Deleting: <https://builds.apache.org/job/JMeter-trunk/4961/artifact/trunk/dist/apache-jmeter-r1730947_lib.tar>
      [zip] Building zip: <https://builds.apache.org/job/JMeter-trunk/4961/artifact/trunk/dist/apache-jmeter-r1730947_lib.zip>

_pack-source:
      [tar] Building tar: <https://builds.apache.org/job/JMeter-trunk/4961/artifact/trunk/dist/apache-jmeter-r1730947_src.tar>
     [gzip] Building: <https://builds.apache.org/job/JMeter-trunk/4961/artifact/trunk/dist/apache-jmeter-r1730947_src.tgz>
   [delete] Deleting: <https://builds.apache.org/job/JMeter-trunk/4961/artifact/trunk/dist/apache-jmeter-r1730947_src.tar>
      [zip] Building zip: <https://builds.apache.org/job/JMeter-trunk/4961/artifact/trunk/dist/apache-jmeter-r1730947_src.zip>

nightly:

compile-tests:
    [javac] Compiling 124 source files to <https://builds.apache.org/job/JMeter-trunk/ws/trunk/build/test>
    [javac] Note: <https://builds.apache.org/job/JMeter-trunk/ws/trunk/test/src/org/apache/jmeter/protocol/http/control/TestCookieManager.java>
uses or overrides a deprecated API.
    [javac] Note: Recompile with -Xlint:deprecation for details.

_test:
     [echo] 
     [echo]    gump.run = false
     [echo]    java.awt.headless = true
     [echo]    test.headless = true
     [echo]    user.dir = <https://builds.apache.org/job/JMeter-trunk/ws/trunk>
     [echo]    basedir = <https://builds.apache.org/job/JMeter-trunk/ws/trunk>
     [echo]    test dir = build/test
     [echo]    test dir gump = build/test
     [echo]    testsaveservice.saveout = ${testsaveservice.saveout}
     [echo]    test.encoding = UTF-8
     [echo]    
     [java] Setting JMeterHome: <https://builds.apache.org/job/JMeter-trunk/ws/trunk>
     [java] Setting up logging props using file: <https://builds.apache.org/job/JMeter-trunk/ws/trunk/bin/testfiles/jmetertest.properties>
     [java] Writing log file to:<https://builds.apache.org/job/JMeter-trunk/ws/trunk/bin/jmeter-test.log>
     [java] Using initializeProperties() from org.apache.jmeter.util.JMeterUtils
     [java] Setting up initial properties using: <https://builds.apache.org/job/JMeter-trunk/ws/trunk/bin/testfiles/jmetertest.properties>
     [java] Initializing Properties: <https://builds.apache.org/job/JMeter-trunk/ws/trunk/bin/testfiles/jmetertest.properties>
     [java] Writing log file to:<https://builds.apache.org/job/JMeter-trunk/ws/trunk/bin/jmeter-test.log>
     [java] JMeterVersion=r1730947
     [java] java.version=1.7.0_80
     [java] java.home=/home/jenkins/jenkins-slave/tools/hudson.model.JDK/latest1.7/jre
     [java] file.encoding=UTF-8
     [java] default encoding=UTF-8
     [java] user.dir=<https://builds.apache.org/job/JMeter-trunk/ws/trunk/bin>
     [java] Locale=en_US
     [java] os.name=Linux
     [java] os.version=3.13.0-36-lowlatency
     [java] +++++++++++
     [java] java.awt.headless=true
     [java] java.awt.graphicsenv=sun.awt.X11GraphicsEnvironment
     [java] ------------
     [java] Searching junit tests in : build/test
     [java] Skipping test:org.apache.jmeter.junit.JMeterTest, cannot run in Headless mode
     [java] .............................................................................................................................................................................................................................................................................................................................................................................................................................................................................................................................Uncomment
assertEquals(0,c.size()) when migrating to httpclient-4.5.2
     [java] ........E................................................................................................................................................................................................................Uncomment
testPostRequest_FormMultipart3() when migrating to HTTPCLIENT 4.5.2
     [java] ....Uncomment testPostRequest_FileUpload3() when migrating to HTTPCLIENT 4.5.2
     [java] ...............................................................................................................................................................................................................................................................................................................................................................................................................................................................................................................................................................................................................................................................................................................................................................................................................................................................................................................................I.............................................................................................................................................................................................................................................
     [java] Time: 102.201
     [java] There was 1 failure:
     [java] 1) org.apache.jmeter.protocol.http.control.TestHTTPMirrorThread(org.apache.jmeter.protocol.http.control.TestHTTPMirrorThread$1)
     [java] java.lang.Exception: Could not start mirror server on port: 8181. java.net.BindException:
Address already in use
     [java] 	at org.apache.jmeter.protocol.http.control.TestHTTPMirrorThread.startHttpMirror(TestHTTPMirrorThread.java:96)
     [java] 	at org.apache.jmeter.protocol.http.control.TestHTTPMirrorThread$1.setUp(TestHTTPMirrorThread.java:61)
     [java] 	at junit.extensions.TestSetup$1.protect(TestSetup.java:22)
     [java] 	at junit.framework.TestResult.runProtected(TestResult.java:142)
     [java] 	at junit.extensions.TestSetup.run(TestSetup.java:27)
     [java] 	at org.junit.internal.runners.JUnit38ClassRunner.run(JUnit38ClassRunner.java:86)
     [java] 	at org.junit.runners.Suite.runChild(Suite.java:128)
     [java] 	at org.junit.runners.Suite.runChild(Suite.java:27)
     [java] 	at org.junit.runners.ParentRunner$3.run(ParentRunner.java:290)
     [java] 	at org.junit.runners.ParentRunner$1.schedule(ParentRunner.java:71)
     [java] 	at org.junit.runners.ParentRunner.runChildren(ParentRunner.java:288)
     [java] 	at org.junit.runners.ParentRunner.access$000(ParentRunner.java:58)
     [java] 	at org.junit.runners.ParentRunner$2.evaluate(ParentRunner.java:268)
     [java] 	at org.junit.runners.ParentRunner.run(ParentRunner.java:363)
     [java] 	at org.junit.runner.JUnitCore.run(JUnitCore.java:137)
     [java] 	at org.junit.runner.JUnitCore.run(JUnitCore.java:115)
     [java] 	at org.apache.jorphan.test.AllTests.main(AllTests.java:213)
     [java] 
     [java] FAILURES!!!
     [java] Tests run: 1861,  Failures: 1
     [java] 

BUILD FAILED
<https://builds.apache.org/job/JMeter-trunk/ws/trunk/build.xml>:2631: Java returned:
1

Total time: 3 minutes 24 seconds
Build step 'Invoke Ant' marked build as failure
[locks-and-latches] Releasing all the locks
[locks-and-latches] All the locks released
Archiving artifacts
Compressed 102.73 MB of artifacts by 28.1% relative to #4960

Mime
View raw message