jmeter-dev mailing list archives

Site index · List index
Message view « Date » · « Thread »
Top « Date » · « Thread »
From Apache Jenkins Server <jenk...@builds.apache.org>
Subject Build failed in Jenkins: JMeter-trunk #3632
Date Wed, 08 Jan 2014 01:00:06 GMT
See <https://builds.apache.org/job/JMeter-trunk/3632/changes>

Changes:

[milamber] ApacheJMeter_mongodb is missing from maven central for 2.10 and 2.11
fixed for next release
Bugzilla Id: 55965

------------------------------------------
[...truncated 823 lines...]
   [anakia] Output: /x1/jenkins/jenkins-slave/workspace/JMeter-trunk/trunk/printable_docs/usermanual/hints_and_tips.html
   [anakia] Input:  usermanual/index.xml
   [anakia] Output: /x1/jenkins/jenkins-slave/workspace/JMeter-trunk/trunk/printable_docs/usermanual/index.html
   [anakia] Input:  usermanual/intro.xml
   [anakia] Output: /x1/jenkins/jenkins-slave/workspace/JMeter-trunk/trunk/printable_docs/usermanual/intro.html
   [anakia] Input:  usermanual/ldapanswer_xml.xml
   [anakia] Output: /x1/jenkins/jenkins-slave/workspace/JMeter-trunk/trunk/printable_docs/usermanual/ldapanswer_xml.html
   [anakia] Input:  usermanual/ldapops_tutor.xml
   [anakia] Output: /x1/jenkins/jenkins-slave/workspace/JMeter-trunk/trunk/printable_docs/usermanual/ldapops_tutor.html
   [anakia] Input:  usermanual/listeners.xml
   [anakia] Output: /x1/jenkins/jenkins-slave/workspace/JMeter-trunk/trunk/printable_docs/usermanual/listeners.html
   [anakia] Input:  usermanual/regular_expressions.xml
   [anakia] Output: /x1/jenkins/jenkins-slave/workspace/JMeter-trunk/trunk/printable_docs/usermanual/regular_expressions.html
   [anakia] Input:  usermanual/remote-test.xml
   [anakia] Output: /x1/jenkins/jenkins-slave/workspace/JMeter-trunk/trunk/printable_docs/usermanual/remote-test.html
   [anakia] Input:  usermanual/test_plan.xml
   [anakia] Output: /x1/jenkins/jenkins-slave/workspace/JMeter-trunk/trunk/printable_docs/usermanual/test_plan.html
     [echo] Fixing EOL
     [echo] Removing unnecessary </br> tags
     [echo] Copying files
     [copy] Copying 16 files to /x1/jenkins/jenkins-slave/workspace/JMeter-trunk/trunk/printable_docs/demos
     [copy] Copying 5 files to /x1/jenkins/jenkins-slave/workspace/JMeter-trunk/trunk/printable_docs/usermanual
     [copy] Copying 1 file to /x1/jenkins/jenkins-slave/workspace/JMeter-trunk/trunk/printable_docs/extending

pack-nightly:

_pack-binaries:
      [tar] Building tar: /x1/jenkins/jenkins-slave/workspace/JMeter-trunk/trunk/dist/apache-jmeter-r1556410_bin.tar
     [gzip] Building: /x1/jenkins/jenkins-slave/workspace/JMeter-trunk/trunk/dist/apache-jmeter-r1556410_bin.tgz
   [delete] Deleting: /x1/jenkins/jenkins-slave/workspace/JMeter-trunk/trunk/dist/apache-jmeter-r1556410_bin.tar
      [zip] Building zip: /x1/jenkins/jenkins-slave/workspace/JMeter-trunk/trunk/dist/apache-jmeter-r1556410_bin.zip

_pack-libraries:
      [tar] Building tar: /x1/jenkins/jenkins-slave/workspace/JMeter-trunk/trunk/dist/apache-jmeter-r1556410_lib.tar
     [gzip] Building: /x1/jenkins/jenkins-slave/workspace/JMeter-trunk/trunk/dist/apache-jmeter-r1556410_lib.tgz
   [delete] Deleting: /x1/jenkins/jenkins-slave/workspace/JMeter-trunk/trunk/dist/apache-jmeter-r1556410_lib.tar
      [zip] Building zip: /x1/jenkins/jenkins-slave/workspace/JMeter-trunk/trunk/dist/apache-jmeter-r1556410_lib.zip

_pack-source:
      [tar] Building tar: /x1/jenkins/jenkins-slave/workspace/JMeter-trunk/trunk/dist/apache-jmeter-r1556410_src.tar
     [gzip] Building: /x1/jenkins/jenkins-slave/workspace/JMeter-trunk/trunk/dist/apache-jmeter-r1556410_src.tgz
   [delete] Deleting: /x1/jenkins/jenkins-slave/workspace/JMeter-trunk/trunk/dist/apache-jmeter-r1556410_src.tar
      [zip] Building zip: /x1/jenkins/jenkins-slave/workspace/JMeter-trunk/trunk/dist/apache-jmeter-r1556410_src.zip

nightly:

compile-tests:
    [javac] Compiling 100 source files to /x1/jenkins/jenkins-slave/workspace/JMeter-trunk/trunk/build/test

_test:
     [echo] 
     [echo]    gump.run = false
     [echo]    java.awt.headless = true
     [echo]    test.headless = true
     [echo]    user.dir = /x1/jenkins/jenkins-slave/workspace/JMeter-trunk/trunk
     [echo]    basedir = /x1/jenkins/jenkins-slave/workspace/JMeter-trunk/trunk
     [echo]    test dir = build/test
     [echo]    test dir gump = build/test
     [echo]    testsaveservice.saveout = ${testsaveservice.saveout}
     [echo]    test.encoding = UTF-8
     [echo]    
     [java] Setting JMeterHome: /x1/jenkins/jenkins-slave/workspace/JMeter-trunk/trunk
     [java] Setting up logging props using file: /x1/jenkins/jenkins-slave/workspace/JMeter-trunk/trunk/bin/testfiles/jmetertest.properties
     [java] Using initializeProperties() from org.apache.jmeter.util.JMeterUtils
     [java] Setting up initial properties using: /x1/jenkins/jenkins-slave/workspace/JMeter-trunk/trunk/bin/testfiles/jmetertest.properties
     [java] Initializing Properties: /x1/jenkins/jenkins-slave/workspace/JMeter-trunk/trunk/bin/testfiles/jmetertest.properties
     [java] JMeterVersion=r1556410
     [java] java.version=1.6.0_45
     [java] java.home=/x1/jenkins/tools/java/jdk1.6.0_45-32/jre
     [java] file.encoding=UTF-8
     [java] default encoding=UTF-8
     [java] user.dir=/x1/jenkins/jenkins-slave/workspace/JMeter-trunk/trunk/bin
     [java] Locale=en_US
     [java] os.name=Linux
     [java] os.version=3.2.0-57-generic
     [java] +++++++++++
     [java] java.awt.headless=true
     [java] java.awt.graphicsenv=sun.awt.X11GraphicsEnvironment
     [java] ------------
     [java] Creating test suite
     [java] Scanning build/test for test cases
     [java] ClassFinder found: 89 TestCase classes
     [java] o.a.j.junit.JMeterTest Error creating org.apache.jmeter.assertions.gui.BeanShellAssertionGui
java.awt.HeadlessException
     [java] o.a.j.junit.JMeterTest Error creating org.apache.jmeter.assertions.gui.XPathAssertionGui
java.awt.HeadlessException
     [java] o.a.j.junit.JMeterTest Error creating org.apache.jmeter.protocol.http.control.gui.AjpSamplerGui
java.awt.HeadlessException
     [java] o.a.j.junit.JMeterTest Error creating org.apache.jmeter.protocol.http.control.gui.HttpTestSampleGui
java.awt.HeadlessException
     [java] o.a.j.junit.JMeterTest Error creating org.apache.jmeter.protocol.java.control.gui.BeanShellSamplerGui
java.awt.HeadlessException
     [java] o.a.j.junit.JMeterTest Error creating org.apache.jmeter.protocol.jms.control.gui.JMSPublisherGui
java.awt.HeadlessException
     [java] o.a.j.junit.JMeterTest Error creating org.apache.jmeter.protocol.jms.control.gui.JMSSamplerGui
java.awt.HeadlessException
     [java] o.a.j.junit.JMeterTest Error creating org.apache.jmeter.protocol.tcp.config.gui.TCPConfigGui
java.awt.HeadlessException
     [java] o.a.j.junit.JMeterTest Error creating org.apache.jmeter.protocol.tcp.control.gui.TCPSamplerGui
java.awt.HeadlessException
     [java] Last class=org.apache.jmeter.visualizers.ViewResultsFullVisualizer
     [java] objects.size=97
     [java] Last error=java.awt.HeadlessException
     [java] ERROR: (see logfile) could not add test for class org.apache.jmeter.junit.JMeterTest
java.lang.reflect.InvocationTargetException
     [java] 	at sun.reflect.NativeMethodAccessorImpl.invoke0(Native Method)
     [java] 	at sun.reflect.NativeMethodAccessorImpl.invoke(NativeMethodAccessorImpl.java:39)
     [java] 	at sun.reflect.DelegatingMethodAccessorImpl.invoke(DelegatingMethodAccessorImpl.java:25)
     [java] 	at java.lang.reflect.Method.invoke(Method.java:597)
     [java] 	at org.apache.jorphan.test.AllTests.suite(AllTests.java:356)
     [java] 	at org.apache.jorphan.test.AllTests.main(AllTests.java:213)
     [java] Caused by: java.lang.ExceptionInInitializerError
     [java] 	at org.apache.jmeter.visualizers.SearchTextExtension.createSearchTextPanel(SearchTextExtension.java:208)
     [java] 	at org.apache.jmeter.visualizers.SearchTextExtension.createSearchTextExtensionPane(SearchTextExtension.java:220)
     [java] 	at org.apache.jmeter.visualizers.SamplerResultTab.createResponseDataPanel(SamplerResultTab.java:462)
     [java] 	at org.apache.jmeter.visualizers.SamplerResultTab.init(SamplerResultTab.java:208)
     [java] 	at org.apache.jmeter.visualizers.ViewResultsFullVisualizer.init(ViewResultsFullVisualizer.java:229)
     [java] 	at org.apache.jmeter.visualizers.ViewResultsFullVisualizer.<init>(ViewResultsFullVisualizer.java:122)
     [java] 	at sun.reflect.NativeConstructorAccessorImpl.newInstance0(Native Method)
     [java] 	at sun.reflect.NativeConstructorAccessorImpl.newInstance(NativeConstructorAccessorImpl.java:39)
     [java] 	at sun.reflect.DelegatingConstructorAccessorImpl.newInstance(DelegatingConstructorAccessorImpl.java:27)
     [java] 	at java.lang.reflect.Constructor.newInstance(Constructor.java:513)
     [java] 	at java.lang.Class.newInstance0(Class.java:357)
     [java] 	at java.lang.Class.newInstance(Class.java:310)
     [java] 	at org.apache.jmeter.junit.JMeterTest.getObjects(JMeterTest.java:578)
     [java] 	at org.apache.jmeter.junit.JMeterTest.suiteGUIComponents(JMeterTest.java:279)
     [java] 	at org.apache.jmeter.junit.JMeterTest.suite(JMeterTest.java:141)
     [java] 	... 6 more
     [java] Caused by: java.awt.HeadlessException
     [java] 	at sun.awt.HeadlessToolkit.getMenuShortcutKeyMask(HeadlessToolkit.java:213)
     [java] 	at org.apache.jmeter.gui.action.KeyStrokes.<clinit>(KeyStrokes.java:37)
     [java] 	... 21 more
     [java] 
     [java] Created: 88 tests including 7 suites
     [java] Starting test run, test count = 1545
     [java] .........................................
     [java] .........................................
     [java] .........................................
     [java] .........................................
     [java] .........................................
     [java] .........................................
     [java] .........................................
     [java] .........................................
     [java] .........................................
     [java] ..................Skipping test:org.apache.jmeter.protocol.http.control.gui.TestHttpTestSampleGui,
cannot run in Headless mode
     [java] Skipping test:org.apache.jmeter.protocol.http.control.gui.TestHttpTestSampleGui#testCloneSampler,
cannot run in Headless mode
     [java] .......................
     [java] .........................................
     [java] .........................................
     [java] .........................................
     [java] .................o.a.j.junit.JMeterTest Error running testConfiguring due to Headless
mode, java.awt.HeadlessException
     [java] ........................
     [java] .........................................
     [java] .........................................
     [java] .........................................
     [java] .........................................
     [java] .........................................
     [java] .........................................
     [java] .........................................
     [java] .........................................
     [java] .........................................
     [java] .........................................
     [java] .........................................
     [java] .........................................
     [java] .........................................
     [java] .........................................
     [java] .........................................
     [java] .........................................
     [java] .........................................
     [java] .........................................
     [java] .........................................
     [java] .........................................
     [java] .........................................
     [java] .........................................
     [java] .........................................
     [java] ............................
     [java] Time: 55.905
     [java] 
     [java] OK (1545 tests)
     [java] 

batchtest:
     [echo] Starting BatchTestLocal using -X
   [jmeter] Creating summariser <summary>
   [jmeter] Created the tree successfully using testfiles/BatchTestLocal.jmx
   [jmeter] Starting the test @ Wed Jan 08 00:59:19 UTC 2014 (1389142759841)
   [jmeter] Waiting for possible shutdown message on port 4445
   [jmeter] summary +     40 in    10s =    4.0/s Avg:   240 Min:   115 Max:   349 Err:  
  4 (10.00%) Active: 1 Started: 1 Finished: 0
   [jmeter] summary +     93 in  27.3s =    3.4/s Avg:   210 Min:     1 Max:   352 Err:  
 12 (12.90%) Active: 0 Started: 1 Finished: 1
   [jmeter] summary =    133 in  37.3s =    3.6/s Avg:   219 Min:     1 Max:   352 Err:  
 16 (12.03%)
   [jmeter] Tidying up ...    @ Wed Jan 08 00:59:57 UTC 2014 (1389142797581)
   [jmeter] ... end of run
     [echo] BatchTestLocal output files compared OK

batchtestserver:
   [server] Created remote object: UnicastServerRef [liveRef: [endpoint:[140.211.11.27:48134](local),objID:[19fa00b7:1436f5cf1ce:-7fff,
5484217546330635210]]]
   [server] Problem creating registry: java.rmi.server.ExportException: Port already in use:
2099; nested exception is: 
   [server] 	java.net.BindException: Address already in use
   [server] Continuing...
   [server] An error occurred: Cannot start. See server log file.; nested exception is: 
   [server] 	java.rmi.ServerException: RemoteException occurred in server thread; nested exception
is: 
   [server] 	java.rmi.UnmarshalException: error unmarshalling arguments; nested exception
is: 
   [server] 	java.lang.ClassNotFoundException: org.apache.jmeter.engine.RemoteJMeterEngineImpl_Stub
(no security manager: RMI class loader disabled)
   [server] Server failed to start: java.rmi.RemoteException: Cannot start. See server log
file.; nested exception is: 
   [server] 	java.rmi.ServerException: RemoteException occurred in server thread; nested exception
is: 
   [server] 	java.rmi.UnmarshalException: error unmarshalling arguments; nested exception
is: 
   [server] 	java.lang.ClassNotFoundException: org.apache.jmeter.engine.RemoteJMeterEngineImpl_Stub
(no security manager: RMI class loader disabled)

batchtest:
     [echo] Starting BatchTestLocal using -Rlocalhost:2099
   [server] Java Result: 1
   [client] Creating summariser <summary>
   [client] Created the tree successfully using testfiles/BatchTestLocal.jmx
   [client] Configuring remote engine for localhost:2099
   [client] Failed to configurFailure connecting to remote host: localhost:2099 java.rmi.NotBoundException:
JMeterEngine
   [client] e localhost:2099
   [client] No remote engines were started.
   [concat] 2014/01/08 01:00:00 FATAL - jmeter.JMeter: Failure connecting to remote host:
localhost:2099 java.rmi.NotBoundException: JMeterEngine
   [concat] 	at sun.rmi.registry.RegistryImpl.lookup(RegistryImpl.java:114)
   [concat] 	at sun.rmi.registry.RegistryImpl_Skel.dispatch(Unknown Source)
   [concat] 	at sun.rmi.server.UnicastServerRef.oldDispatch(UnicastServerRef.java:390)
   [concat] 	at sun.rmi.server.UnicastServerRef.dispatch(UnicastServerRef.java:248)
   [concat] 	at sun.rmi.transport.Transport$1.run(Transport.java:159)
   [concat] 	at java.security.AccessController.doPrivileged(Native Method)
   [concat] 	at sun.rmi.transport.Transport.serviceCall(Transport.java:155)
   [concat] 	at sun.rmi.transport.tcp.TCPTransport.handleMessages(TCPTransport.java:535)
   [concat] 	at sun.rmi.transport.tcp.TCPTransport$ConnectionHandler.run0(TCPTransport.java:790)
   [concat] 	at sun.rmi.transport.tcp.TCPTransport$ConnectionHandler.run(TCPTransport.java:649)
   [concat] 	at java.util.concurrent.ThreadPoolExecutor$Worker.runTask(ThreadPoolExecutor.java:895)
   [concat] 	at java.util.concurrent.ThreadPoolExecutor$Worker.run(ThreadPoolExecutor.java:918)
   [concat] 	at java.lang.Thread.run(Thread.java:662)
   [concat] 	at sun.rmi.transport.StreamRemoteCall.exceptionReceivedFromServer(StreamRemoteCall.java:255)
   [concat] 	at sun.rmi.transport.StreamRemoteCall.executeCall(StreamRemoteCall.java:233)
   [concat] 	at sun.rmi.server.UnicastRef.invoke(UnicastRef.java:359)
   [concat] 	at sun.rmi.registry.RegistryImpl_Stub.lookup(Unknown Source)
   [concat] 	at java.rmi.Naming.lookup(Naming.java:84)
   [concat] 	at org.apache.jmeter.engine.ClientJMeterEngine.getEngine(ClientJMeterEngine.java:54)
   [concat] 	at org.apache.jmeter.engine.ClientJMeterEngine.<init>(ClientJMeterEngine.java:67)
   [concat] 	at org.apache.jmeter.JMeter.doRemoteInit(JMeter.java:926)
   [concat] 	at org.apache.jmeter.JMeter.runNonGui(JMeter.java:810)
   [concat] 	at org.apache.jmeter.JMeter.startNonGui(JMeter.java:732)
   [concat] 	at org.apache.jmeter.JMeter.start(JMeter.java:390)
   [concat] 	at sun.reflect.NativeMethodAccessorImpl.invoke0(Native Method)
   [concat] 	at sun.reflect.NativeMethodAccessorImpl.invoke(NativeMethodAccessorImpl.java:39)
   [concat] 	at sun.reflect.DelegatingMethodAccessorImpl.invoke(DelegatingMethodAccessorImpl.java:25)
   [concat] 	at java.lang.reflect.Method.invoke(Method.java:597)
   [concat] 	at org.apache.jmeter.NewDriver.main(NewDriver.java:259)
   [concat] 

BUILD FAILED
/x1/jenkins/jenkins-slave/workspace/JMeter-trunk/trunk/build.xml:2441: The following error
occurred while executing this line:
/x1/jenkins/jenkins-slave/workspace/JMeter-trunk/trunk/build.xml:2546: The following error
occurred while executing this line:
/x1/jenkins/jenkins-slave/workspace/JMeter-trunk/trunk/build.xml:2508: Cannot find output
file /x1/jenkins/jenkins-slave/workspace/JMeter-trunk/trunk/bin/BatchTestLocal.csv

Total time: 2 minutes 13 seconds
Build step 'Invoke Ant' marked build as failure
[locks-and-latches] Releasing all the locks
[locks-and-latches] All the locks released
Archiving artifacts

Mime
View raw message