jmeter-dev mailing list archives

Site index · List index
Message view « Date » · « Thread »
Top « Date » · « Thread »
From Apache Jenkins Server <jenk...@builds.apache.org>
Subject Build failed in Jenkins: JMeter-trunk #3473
Date Mon, 14 Oct 2013 21:48:33 GMT
See <https://builds.apache.org/job/JMeter-trunk/3473/changes>

Changes:

[pmouawad] Bug 55653 - HTTP(S) Test Script Recorder should set TransactionController property
"Include duration of timer and pre-post processors in generated sample" to false
Bugzilla Id: 55653

[pmouawad] Add constant

[pmouawad] Bug 55507 - Proxy SSL recording does not handle external embedded resources well
Add more information for user
Bugzilla Id: 55507

------------------------------------------
[...truncated 826 lines...]
   [anakia] Output: <https://builds.apache.org/job/JMeter-trunk/ws/trunk/printable_docs/usermanual/glossary.html>
   [anakia] Input:  usermanual/hints_and_tips.xml
   [anakia] Output: <https://builds.apache.org/job/JMeter-trunk/ws/trunk/printable_docs/usermanual/hints_and_tips.html>
   [anakia] Input:  usermanual/index.xml
   [anakia] Output: <https://builds.apache.org/job/JMeter-trunk/ws/trunk/printable_docs/usermanual/index.html>
   [anakia] Input:  usermanual/intro.xml
   [anakia] Output: <https://builds.apache.org/job/JMeter-trunk/ws/trunk/printable_docs/usermanual/intro.html>
   [anakia] Input:  usermanual/ldapanswer_xml.xml
   [anakia] Output: <https://builds.apache.org/job/JMeter-trunk/ws/trunk/printable_docs/usermanual/ldapanswer_xml.html>
   [anakia] Input:  usermanual/ldapops_tutor.xml
   [anakia] Output: <https://builds.apache.org/job/JMeter-trunk/ws/trunk/printable_docs/usermanual/ldapops_tutor.html>
   [anakia] Input:  usermanual/listeners.xml
   [anakia] Output: <https://builds.apache.org/job/JMeter-trunk/ws/trunk/printable_docs/usermanual/listeners.html>
   [anakia] Input:  usermanual/regular_expressions.xml
   [anakia] Output: <https://builds.apache.org/job/JMeter-trunk/ws/trunk/printable_docs/usermanual/regular_expressions.html>
   [anakia] Input:  usermanual/remote-test.xml
   [anakia] Output: <https://builds.apache.org/job/JMeter-trunk/ws/trunk/printable_docs/usermanual/remote-test.html>
   [anakia] Input:  usermanual/test_plan.xml
   [anakia] Output: <https://builds.apache.org/job/JMeter-trunk/ws/trunk/printable_docs/usermanual/test_plan.html>
     [echo] Fixing EOL
     [echo] Removing unnecessary </br> tags
     [echo] Copying files
     [copy] Copying 16 files to <https://builds.apache.org/job/JMeter-trunk/ws/trunk/printable_docs/demos>
     [copy] Copying 5 files to <https://builds.apache.org/job/JMeter-trunk/ws/trunk/printable_docs/usermanual>
     [copy] Copying 1 file to <https://builds.apache.org/job/JMeter-trunk/ws/trunk/printable_docs/extending>

pack-nightly:

_pack-binaries:
      [tar] Building tar: <https://builds.apache.org/job/JMeter-trunk/3473/artifact/trunk/dist/apache-jmeter-r1532091_bin.tar>
     [gzip] Building: <https://builds.apache.org/job/JMeter-trunk/3473/artifact/trunk/dist/apache-jmeter-r1532091_bin.tgz>
   [delete] Deleting: <https://builds.apache.org/job/JMeter-trunk/3473/artifact/trunk/dist/apache-jmeter-r1532091_bin.tar>
      [zip] Building zip: <https://builds.apache.org/job/JMeter-trunk/3473/artifact/trunk/dist/apache-jmeter-r1532091_bin.zip>

_pack-libraries:
      [tar] Building tar: <https://builds.apache.org/job/JMeter-trunk/3473/artifact/trunk/dist/apache-jmeter-r1532091_lib.tar>
     [gzip] Building: <https://builds.apache.org/job/JMeter-trunk/3473/artifact/trunk/dist/apache-jmeter-r1532091_lib.tgz>
   [delete] Deleting: <https://builds.apache.org/job/JMeter-trunk/3473/artifact/trunk/dist/apache-jmeter-r1532091_lib.tar>
      [zip] Building zip: <https://builds.apache.org/job/JMeter-trunk/3473/artifact/trunk/dist/apache-jmeter-r1532091_lib.zip>

_pack-source:
      [tar] Building tar: <https://builds.apache.org/job/JMeter-trunk/3473/artifact/trunk/dist/apache-jmeter-r1532091_src.tar>
     [gzip] Building: <https://builds.apache.org/job/JMeter-trunk/3473/artifact/trunk/dist/apache-jmeter-r1532091_src.tgz>
   [delete] Deleting: <https://builds.apache.org/job/JMeter-trunk/3473/artifact/trunk/dist/apache-jmeter-r1532091_src.tar>
      [zip] Building zip: <https://builds.apache.org/job/JMeter-trunk/3473/artifact/trunk/dist/apache-jmeter-r1532091_src.zip>

nightly:

compile-tests:
    [javac] Compiling 99 source files to <https://builds.apache.org/job/JMeter-trunk/ws/trunk/build/test>

_test:
     [echo] 
     [echo]    gump.run = false
     [echo]    java.awt.headless = true
     [echo]    test.headless = true
     [echo]    user.dir = <https://builds.apache.org/job/JMeter-trunk/ws/trunk>
     [echo]    basedir = <https://builds.apache.org/job/JMeter-trunk/ws/trunk>
     [echo]    test dir = build/test
     [echo]    test dir gump = build/test
     [echo]    testsaveservice.saveout = ${testsaveservice.saveout}
     [echo]    test.encoding = UTF-8
     [echo]    
     [java] Setting JMeterHome: <https://builds.apache.org/job/JMeter-trunk/ws/trunk>
     [java] Setting up logging props using file: <https://builds.apache.org/job/JMeter-trunk/ws/trunk/bin/testfiles/jmetertest.properties>
     [java] Using initializeProperties() from org.apache.jmeter.util.JMeterUtils
     [java] Setting up initial properties using: <https://builds.apache.org/job/JMeter-trunk/ws/trunk/bin/testfiles/jmetertest.properties>
     [java] Initializing Properties: <https://builds.apache.org/job/JMeter-trunk/ws/trunk/bin/testfiles/jmetertest.properties>
     [java] JMeterVersion=r1532091
     [java] java.version=1.6.0_45
     [java] java.home=/home/jenkins/tools/java/jdk1.6.0_45-32/jre
     [java] file.encoding=UTF-8
     [java] default encoding=UTF-8
     [java] user.dir=<https://builds.apache.org/job/JMeter-trunk/ws/trunk/bin>
     [java] Locale=en_US
     [java] os.name=Linux
     [java] os.version=3.2.0-51-generic
     [java] +++++++++++
     [java] java.awt.headless=true
     [java] java.awt.graphicsenv=sun.awt.X11GraphicsEnvironment
     [java] ------------
     [java] Creating test suite
     [java] Scanning build/test for test cases
     [java] ClassFinder found: 88 TestCase classes
     [java] o.a.j.junit.JMeterTest Error creating org.apache.jmeter.assertions.gui.BeanShellAssertionGui
java.awt.HeadlessException
     [java] o.a.j.junit.JMeterTest Error creating org.apache.jmeter.assertions.gui.XPathAssertionGui
java.awt.HeadlessException
     [java] o.a.j.junit.JMeterTest Error creating org.apache.jmeter.protocol.http.control.gui.AjpSamplerGui
java.awt.HeadlessException
     [java] o.a.j.junit.JMeterTest Error creating org.apache.jmeter.protocol.http.control.gui.HttpTestSampleGui
java.awt.HeadlessException
     [java] o.a.j.junit.JMeterTest Error creating org.apache.jmeter.protocol.java.control.gui.BeanShellSamplerGui
java.awt.HeadlessException
     [java] o.a.j.junit.JMeterTest Error creating org.apache.jmeter.protocol.jms.control.gui.JMSPublisherGui
java.awt.HeadlessException
     [java] o.a.j.junit.JMeterTest Error creating org.apache.jmeter.protocol.jms.control.gui.JMSSamplerGui
java.awt.HeadlessException
     [java] o.a.j.junit.JMeterTest Error creating org.apache.jmeter.protocol.tcp.config.gui.TCPConfigGui
java.awt.HeadlessException
     [java] o.a.j.junit.JMeterTest Error creating org.apache.jmeter.protocol.tcp.control.gui.TCPSamplerGui
java.awt.HeadlessException
     [java] Last class=org.apache.jmeter.visualizers.ViewResultsFullVisualizer
     [java] objects.size=97
     [java] Last error=java.awt.HeadlessException
     [java] ERROR: (see logfile) could not add test for class org.apache.jmeter.junit.JMeterTest
java.lang.reflect.InvocationTargetException
     [java] 	at sun.reflect.NativeMethodAccessorImpl.invoke0(Native Method)
     [java] 	at sun.reflect.NativeMethodAccessorImpl.invoke(NativeMethodAccessorImpl.java:39)
     [java] 	at sun.reflect.DelegatingMethodAccessorImpl.invoke(DelegatingMethodAccessorImpl.java:25)
     [java] 	at java.lang.reflect.Method.invoke(Method.java:597)
     [java] 	at org.apache.jorphan.test.AllTests.suite(AllTests.java:356)
     [java] 	at org.apache.jorphan.test.AllTests.main(AllTests.java:213)
     [java] Caused by: java.lang.ExceptionInInitializerError
     [java] 	at org.apache.jmeter.visualizers.SearchTextExtension.createSearchTextPanel(SearchTextExtension.java:208)
     [java] 	at org.apache.jmeter.visualizers.SearchTextExtension.createSearchTextExtensionPane(SearchTextExtension.java:220)
     [java] 	at org.apache.jmeter.visualizers.SamplerResultTab.createResponseDataPanel(SamplerResultTab.java:462)
     [java] 	at org.apache.jmeter.visualizers.SamplerResultTab.init(SamplerResultTab.java:208)
     [java] 	at org.apache.jmeter.visualizers.ViewResultsFullVisualizer.init(ViewResultsFullVisualizer.java:229)
     [java] 	at org.apache.jmeter.visualizers.ViewResultsFullVisualizer.<init>(ViewResultsFullVisualizer.java:122)
     [java] 	at sun.reflect.NativeConstructorAccessorImpl.newInstance0(Native Method)
     [java] 	at sun.reflect.NativeConstructorAccessorImpl.newInstance(NativeConstructorAccessorImpl.java:39)
     [java] 	at sun.reflect.DelegatingConstructorAccessorImpl.newInstance(DelegatingConstructorAccessorImpl.java:27)
     [java] 	at java.lang.reflect.Constructor.newInstance(Constructor.java:513)
     [java] 	at java.lang.Class.newInstance0(Class.java:357)
     [java] 	at java.lang.Class.newInstance(Class.java:310)
     [java] 	at org.apache.jmeter.junit.JMeterTest.getObjects(JMeterTest.java:578)
     [java] 	at org.apache.jmeter.junit.JMeterTest.suiteGUIComponents(JMeterTest.java:279)
     [java] 	at org.apache.jmeter.junit.JMeterTest.suite(JMeterTest.java:141)
     [java] 	... 6 more
     [java] Caused by: java.awt.HeadlessException
     [java] 	at sun.awt.HeadlessToolkit.getMenuShortcutKeyMask(HeadlessToolkit.java:213)
     [java] 	at org.apache.jmeter.gui.action.KeyStrokes.<clinit>(KeyStrokes.java:37)
     [java] 	... 21 more
     [java] 
     [java] Created: 87 tests including 7 suites
     [java] Starting test run, test count = 1542
     [java] .........................................
     [java] .........................................
     [java] .........................................
     [java] .........................................
     [java] .........................................
     [java] .........................................
     [java] .........................................
     [java] .........................................
     [java] .........................................
     [java] ................Skipping test:org.apache.jmeter.protocol.http.control.gui.TestHttpTestSampleGui,
cannot run in Headless mode
     [java] Skipping test:org.apache.jmeter.protocol.http.control.gui.TestHttpTestSampleGui#testCloneSampler,
cannot run in Headless mode
     [java] .........................
     [java] .........................................
     [java] ...............................SLF4J: Failed to load class "org.slf4j.impl.StaticLoggerBinder".
     [java] SLF4J: Defaulting to no-operation (NOP) logger implementation
     [java] SLF4J: See http://www.slf4j.org/codes.html#StaticLoggerBinder for further details.
     [java] ..........
     [java] .........................................
     [java] ...............o.a.j.junit.JMeterTest Error running testConfiguring due to Headless
mode, java.awt.HeadlessException
     [java] ..........................
     [java] .........................................
     [java] .........................................
     [java] .........................................
     [java] .........................................
     [java] .........................................
     [java] .........................................
     [java] .........................................
     [java] .........................................
     [java] .........................................
     [java] .........................................
     [java] .........................................
     [java] .........................................
     [java] .........................................
     [java] .........................................
     [java] .........................................
     [java] .........................................
     [java] .........................................
     [java] .........................................
     [java] .........................................
     [java] .........................................
     [java] .........................................
     [java] .........................................
     [java] .........................................
     [java] .........................
     [java] Time: 56.981
     [java] 
     [java] OK (1542 tests)
     [java] 

batchtest:
     [echo] Starting BatchTestLocal using -X
   [jmeter] Created the tree successfully using testfiles/BatchTestLocal.jmx
   [jmeter] Starting the test @ Mon Oct 14 21:47:36 UTC 2013 (1381787256619)
   [jmeter] Waiting for possible shutdown message on port 4445
   [jmeter] Tidying up ...    @ Mon Oct 14 21:48:15 UTC 2013 (1381787295097)
   [jmeter] ... end of run
     [echo] BatchTestLocal output files compared OK

batchtestserver:
   [server] Created remote object: UnicastServerRef [liveRef: [endpoint:[67.195.138.8:58376](local),objID:[7737c36e:141b8f0e239:-7fff,
-3559385369896719355]]]
   [server] Problem creating registry: java.rmi.server.ExportException: Port already in use:
2099; nested exception is: 
   [server] 	java.net.BindException: Address already in use
   [server] Continuing...
   [server] An error occurred: Cannot start. See server log file.; nested exception is: 
   [server] 	java.rmi.ServerException: RemoteException occurred in server thread; nested exception
is: 
   [server] 	java.rmi.UnmarshalException: error unmarshalling arguments; nested exception
is: 
   [server] 	java.lang.ClassNotFoundException: org.apache.jmeter.engine.RemoteJMeterEngineImpl_Stub
(no security manager: RMI class loader disabled)
   [server] Server failed to start: java.rmi.RemoteException: Cannot start. See server log
file.; nested exception is: 
   [server] 	java.rmi.ServerException: RemoteException occurred in server thread; nested exception
is: 
   [server] 	java.rmi.UnmarshalException: error unmarshalling arguments; nested exception
is: 
   [server] 	java.lang.ClassNotFoundException: org.apache.jmeter.engine.RemoteJMeterEngineImpl_Stub
(no security manager: RMI class loader disabled)

batchtest:
     [echo] Starting BatchTestLocal using -Rlocalhost:2099
   [server] Java Result: 1
   [client] Created the tree successfully using testfiles/BatchTestLocal.jmx
   [client] Configuring remote engine for localhost:2099
   [client] Failed to configure localhost:2099
   [client] No remote engines were started.
   [client] Failure connecting to remote host: localhost:2099 java.rmi.NotBoundException:
JMeterEngine
   [concat] 2013/10/14 21:48:17 FATAL - jmeter.JMeter: Failure connecting to remote host:
localhost:2099 java.rmi.NotBoundException: JMeterEngine
   [concat] 	at sun.rmi.registry.RegistryImpl.lookup(RegistryImpl.java:114)
   [concat] 	at sun.rmi.registry.RegistryImpl_Skel.dispatch(Unknown Source)
   [concat] 	at sun.rmi.server.UnicastServerRef.oldDispatch(UnicastServerRef.java:390)
   [concat] 	at sun.rmi.server.UnicastServerRef.dispatch(UnicastServerRef.java:248)
   [concat] 	at sun.rmi.transport.Transport$1.run(Transport.java:159)
   [concat] 	at java.security.AccessController.doPrivileged(Native Method)
   [concat] 	at sun.rmi.transport.Transport.serviceCall(Transport.java:155)
   [concat] 	at sun.rmi.transport.tcp.TCPTransport.handleMessages(TCPTransport.java:535)
   [concat] 	at sun.rmi.transport.tcp.TCPTransport$ConnectionHandler.run0(TCPTransport.java:790)
   [concat] 	at sun.rmi.transport.tcp.TCPTransport$ConnectionHandler.run(TCPTransport.java:649)
   [concat] 	at java.util.concurrent.ThreadPoolExecutor$Worker.runTask(ThreadPoolExecutor.java:895)
   [concat] 	at java.util.concurrent.ThreadPoolExecutor$Worker.run(ThreadPoolExecutor.java:918)
   [concat] 	at java.lang.Thread.run(Thread.java:662)
   [concat] 	at sun.rmi.transport.StreamRemoteCall.exceptionReceivedFromServer(StreamRemoteCall.java:255)
   [concat] 	at sun.rmi.transport.StreamRemoteCall.executeCall(StreamRemoteCall.java:233)
   [concat] 	at sun.rmi.server.UnicastRef.invoke(UnicastRef.java:359)
   [concat] 	at sun.rmi.registry.RegistryImpl_Stub.lookup(Unknown Source)
   [concat] 	at java.rmi.Naming.lookup(Naming.java:84)
   [concat] 	at org.apache.jmeter.engine.ClientJMeterEngine.getEngine(ClientJMeterEngine.java:54)
   [concat] 	at org.apache.jmeter.engine.ClientJMeterEngine.<init>(ClientJMeterEngine.java:67)
   [concat] 	at org.apache.jmeter.JMeter.doRemoteInit(JMeter.java:926)
   [concat] 	at org.apache.jmeter.JMeter.runNonGui(JMeter.java:810)
   [concat] 	at org.apache.jmeter.JMeter.startNonGui(JMeter.java:732)
   [concat] 	at org.apache.jmeter.JMeter.start(JMeter.java:390)
   [concat] 	at sun.reflect.NativeMethodAccessorImpl.invoke0(Native Method)
   [concat] 	at sun.reflect.NativeMethodAccessorImpl.invoke(NativeMethodAccessorImpl.java:39)
   [concat] 	at sun.reflect.DelegatingMethodAccessorImpl.invoke(DelegatingMethodAccessorImpl.java:25)
   [concat] 	at java.lang.reflect.Method.invoke(Method.java:597)
   [concat] 	at org.apache.jmeter.NewDriver.main(NewDriver.java:259)
   [concat] 

BUILD FAILED
<https://builds.apache.org/job/JMeter-trunk/ws/trunk/build.xml>:2431: The following
error occurred while executing this line:
<https://builds.apache.org/job/JMeter-trunk/ws/trunk/build.xml>:2536: The following
error occurred while executing this line:
<https://builds.apache.org/job/JMeter-trunk/ws/trunk/build.xml>:2498: Cannot find output
file <https://builds.apache.org/job/JMeter-trunk/ws/trunk/bin/BatchTestLocal.csv>

Total time: 2 minutes 33 seconds
Build step 'Invoke Ant' marked build as failure
[locks-and-latches] Releasing all the locks
[locks-and-latches] All the locks released
Archiving artifacts

Mime
View raw message