jmeter-dev mailing list archives

Site index · List index
Message view « Date » · « Thread »
Top « Date » · « Thread »
From Apache Jenkins Server <jenk...@builds.apache.org>
Subject Build failed in Jenkins: JMeter-trunk #1807
Date Sat, 10 Dec 2011 20:01:44 GMT
See <https://builds.apache.org/job/JMeter-trunk/1807/changes>

Changes:

[pmouawad] Upgrade of js to 1.7R3

[sebb] Unnecessary cast; Javadoc

[pmouawad] Bug 52310 - variable in IPSource failed HTTP request if "Concurrent Pool Size"
is enabled
Add Test case

------------------------------------------
[...truncated 117 lines...]
_check_jarfile:
     [echo] Checking avalon-framework-4.1.4.jar

_get_jarfile:

_get_zipfile:

_check_exists:

_check_jarfile:
     [echo] Checking bcmail-jdk15-1.45.jar

_get_jarfile:

_get_zipfile:

_check_exists:

_check_jarfile:
     [echo] Checking bcprov-jdk15-1.45.jar

_get_jarfile:

_get_zipfile:

_check_exists:

_check_jarfile:
     [echo] Checking bsh-2.0b5.jar

_get_jarfile:

_get_zipfile:

_check_exists:

_check_jarfile:
     [echo] Checking commons-codec-1.5.jar

_get_jarfile:

_get_zipfile:

_check_exists:

_check_jarfile:
     [echo] Checking commons-collections-3.2.1.jar

_get_jarfile:

_get_zipfile:

_check_exists:

_check_jarfile:
     [echo] Checking commons-httpclient-3.1.jar

_get_jarfile:

_get_zipfile:

_check_exists:

_check_jarfile:
     [echo] Checking commons-io-2.0.1.jar

_get_jarfile:

_get_zipfile:

_check_exists:

_check_jarfile:
     [echo] Checking commons-jexl-1.1.jar

_get_jarfile:

_get_zipfile:

_check_exists:

_check_jarfile:
     [echo] Checking commons-jexl-2.0.1.jar

_get_jarfile:

_get_zipfile:

_check_exists:

_check_jarfile:
     [echo] Checking commons-lang-2.6.jar

_get_jarfile:

_get_zipfile:

_check_exists:

_check_jarfile:
     [echo] Checking commons-logging-1.1.1.jar

_get_jarfile:

_get_zipfile:

_check_exists:

_check_jarfile:
     [echo] Checking commons-net-3.0.1.jar

_get_jarfile:

_get_zipfile:

_check_exists:

_check_jarfile:
     [echo] Checking excalibur-datasource-1.1.1.jar

_get_jarfile:

_get_zipfile:

_check_exists:

_check_jarfile:
     [echo] Checking excalibur-instrument-1.0.jar

_get_jarfile:

_get_zipfile:

_check_exists:

_check_jarfile:
     [echo] Checking excalibur-logger-1.1.jar

_get_jarfile:

_get_zipfile:

_check_exists:

_check_jarfile:
     [echo] Checking excalibur-pool-1.2.jar

_get_jarfile:

_get_zipfile:

_check_exists:

_check_jarfile:
     [echo] Checking htmllexer-2.1.jar

_get_jarfile:

_get_zipfile:

_check_exists:

_check_jarfile:
     [echo] Checking htmlparser-2.1.jar

_get_jarfile:

_get_zipfile:

_check_exists:

_check_jarfile:
     [echo] Checking httpclient-4.1.2.jar

_get_jarfile:

_get_zipfile:

_check_exists:

_check_jarfile:
     [echo] Checking httpmime-4.1.2.jar

_get_jarfile:

_get_zipfile:

_check_exists:

_check_jarfile:
     [echo] Checking httpcore-4.1.3.jar

_get_jarfile:

_get_zipfile:

_check_exists:

_check_jarfile:
     [echo] Checking oro-2.0.8.jar

_get_jarfile:

_get_zipfile:

_check_exists:

_check_jarfile:
     [echo] Checking jCharts-0.7.5.jar

_get_jarfile:

_get_zipfile:

_check_exists:

_check_jarfile:
     [echo] Checking jdom-1.1.jar

_get_jarfile:

_get_zipfile:

_check_exists:

_check_jarfile:
     [echo] Checking js-1.7R3.jar

_get_jarfile:
     [echo] Fetching: lib/js-1.7R3.jar
      [get] Getting: http://repo2.maven.org/maven2/rhino/js/1.7R3/js-1.7R3.jar
      [get] To: /x1/jenkins/jenkins-slave/workspace/JMeter-trunk/trunk/build/js-1.7R3.jar
      [get] Error opening connection java.io.FileNotFoundException: http://repo2.maven.org/maven2/rhino/js/1.7R3/js-1.7R3.jar
      [get] Error opening connection java.io.FileNotFoundException: http://repo2.maven.org/maven2/rhino/js/1.7R3/js-1.7R3.jar
      [get] Error opening connection java.io.FileNotFoundException: http://repo2.maven.org/maven2/rhino/js/1.7R3/js-1.7R3.jar
      [get] Can't get http://repo2.maven.org/maven2/rhino/js/1.7R3/js-1.7R3.jar to /x1/jenkins/jenkins-slave/workspace/JMeter-trunk/trunk/build/js-1.7R3.jar

BUILD FAILED
/x1/jenkins/jenkins-slave/workspace/JMeter-trunk/trunk/build.xml:2243: The following error
occurred while executing this line:
/x1/jenkins/jenkins-slave/workspace/JMeter-trunk/trunk/build.xml:2221: The following error
occurred while executing this line:
/x1/jenkins/jenkins-slave/workspace/JMeter-trunk/trunk/build.xml:2103: The following error
occurred while executing this line:
/x1/jenkins/jenkins-slave/workspace/JMeter-trunk/trunk/build.xml:2131: The following error
occurred while executing this line:
/x1/jenkins/jenkins-slave/workspace/JMeter-trunk/trunk/build.xml:2161: Can't get http://repo2.maven.org/maven2/rhino/js/1.7R3/js-1.7R3.jar
to /x1/jenkins/jenkins-slave/workspace/JMeter-trunk/trunk/build/js-1.7R3.jar

Total time: 3 seconds
Build step 'Invoke Ant' marked build as failure
[locks-and-latches] Releasing all the locks
[locks-and-latches] All the locks released
Archiving artifacts


Mime
View raw message