jena-commits mailing list archives

Site index · List index
Message view « Date » · « Thread »
Top « Date » · « Thread »
From Apache Jenkins Server <jenk...@builds.apache.org>
Subject Build failed in Jenkins: Jena_Development_Deploy #1601
Date Sat, 24 Nov 2018 10:20:48 GMT
See <https://builds.apache.org/job/Jena_Development_Deploy/1601/display/redirect?page=changes>

Changes:

[andy] JENA-1633: MINUS when the LHS has an unbound but mentioned variable.

[andy] Make sure all test suites are run.

[andy] JENA-1632: https support in SOH scripts

[andy] JENA-1637: Default hint language for the by-lang parse commands.

------------------------------------------
[...truncated 535.40 KB...]
[INFO] Including org.eclipse.jetty:jetty-servlets:jar:8.1.22.v20160922 in the shaded jar.
[INFO] Including org.eclipse.jetty:jetty-client:jar:8.1.22.v20160922 in the shaded jar.
[INFO] Including org.eclipse.jetty:jetty-xml:jar:8.1.22.v20160922 in the shaded jar.
[INFO] Including org.eclipse.jetty:jetty-security:jar:8.1.22.v20160922 in the shaded jar.
[INFO] Including org.eclipse.jetty:jetty-util:jar:8.1.22.v20160922 in the shaded jar.
[INFO] Including org.apache.velocity:velocity:jar:1.7 in the shaded jar.
[INFO] Including commons-collections:commons-collections:jar:3.2.1 in the shaded jar.
[INFO] Including commons-lang:commons-lang:jar:2.4 in the shaded jar.
[INFO] Including org.slf4j:slf4j-api:jar:1.7.25 in the shaded jar.
[INFO] Including org.slf4j:slf4j-log4j12:jar:1.7.25 in the shaded jar.
[INFO] Including org.slf4j:jcl-over-slf4j:jar:1.7.25 in the shaded jar.
[INFO] Including log4j:log4j:jar:1.2.17 in the shaded jar.
[INFO] Attaching shaded artifact.
[INFO] 
[INFO] --- maven-install-plugin:2.5.2:install (default-install) @ jena-fuseki1 ---
[INFO] Installing <https://builds.apache.org/job/Jena_Development_Deploy/ws/jena-fuseki1/target/jena-fuseki1-3.10.0-SNAPSHOT.jar>
to /home/jenkins/jenkins-slave/maven-repositories/0/org/apache/jena/jena-fuseki1/3.10.0-SNAPSHOT/jena-fuseki1-3.10.0-SNAPSHOT.jar
[INFO] Installing <https://builds.apache.org/job/Jena_Development_Deploy/ws/jena-fuseki1/pom.xml>
to /home/jenkins/jenkins-slave/maven-repositories/0/org/apache/jena/jena-fuseki1/3.10.0-SNAPSHOT/jena-fuseki1-3.10.0-SNAPSHOT.pom
[INFO] Installing <https://builds.apache.org/job/Jena_Development_Deploy/ws/jena-fuseki1/target/jena-fuseki1-3.10.0-SNAPSHOT-javadoc.jar>
to /home/jenkins/jenkins-slave/maven-repositories/0/org/apache/jena/jena-fuseki1/3.10.0-SNAPSHOT/jena-fuseki1-3.10.0-SNAPSHOT-javadoc.jar
[INFO] Installing <https://builds.apache.org/job/Jena_Development_Deploy/ws/jena-fuseki1/target/jena-fuseki1-3.10.0-SNAPSHOT-tests.jar>
to /home/jenkins/jenkins-slave/maven-repositories/0/org/apache/jena/jena-fuseki1/3.10.0-SNAPSHOT/jena-fuseki1-3.10.0-SNAPSHOT-tests.jar
[INFO] Installing <https://builds.apache.org/job/Jena_Development_Deploy/ws/jena-fuseki1/target/jena-fuseki1-3.10.0-SNAPSHOT-server.jar>
to /home/jenkins/jenkins-slave/maven-repositories/0/org/apache/jena/jena-fuseki1/3.10.0-SNAPSHOT/jena-fuseki1-3.10.0-SNAPSHOT-server.jar
[INFO] 
[INFO] --- maven-deploy-plugin:2.8.2:deploy (default-deploy) @ jena-fuseki1 ---
[INFO] Downloading from apache.snapshots.https: https://repository.apache.org/content/repositories/snapshots/org/apache/jena/jena-fuseki1/3.10.0-SNAPSHOT/maven-metadata.xml
[INFO] Downloaded from apache.snapshots.https: https://repository.apache.org/content/repositories/snapshots/org/apache/jena/jena-fuseki1/3.10.0-SNAPSHOT/maven-metadata.xml
(1.4 kB at 2.2 kB/s)
[INFO] Uploading to apache.snapshots.https: https://repository.apache.org/content/repositories/snapshots/org/apache/jena/jena-fuseki1/3.10.0-SNAPSHOT/jena-fuseki1-3.10.0-20181124.101857-18.jar
[INFO] Uploaded to apache.snapshots.https: https://repository.apache.org/content/repositories/snapshots/org/apache/jena/jena-fuseki1/3.10.0-SNAPSHOT/jena-fuseki1-3.10.0-20181124.101857-18.jar
(188 kB at 142 kB/s)
[INFO] Uploading to apache.snapshots.https: https://repository.apache.org/content/repositories/snapshots/org/apache/jena/jena-fuseki1/3.10.0-SNAPSHOT/jena-fuseki1-3.10.0-20181124.101857-18.pom
[INFO] Uploaded to apache.snapshots.https: https://repository.apache.org/content/repositories/snapshots/org/apache/jena/jena-fuseki1/3.10.0-SNAPSHOT/jena-fuseki1-3.10.0-20181124.101857-18.pom
(10 kB at 9.0 kB/s)
[INFO] Downloading from apache.snapshots.https: https://repository.apache.org/content/repositories/snapshots/org/apache/jena/jena-fuseki1/maven-metadata.xml
[INFO] Downloaded from apache.snapshots.https: https://repository.apache.org/content/repositories/snapshots/org/apache/jena/jena-fuseki1/maven-metadata.xml
(469 B at 761 B/s)
[INFO] Uploading to apache.snapshots.https: https://repository.apache.org/content/repositories/snapshots/org/apache/jena/jena-fuseki1/3.10.0-SNAPSHOT/maven-metadata.xml
[INFO] Uploaded to apache.snapshots.https: https://repository.apache.org/content/repositories/snapshots/org/apache/jena/jena-fuseki1/3.10.0-SNAPSHOT/maven-metadata.xml
(1.4 kB at 1.3 kB/s)
[INFO] Uploading to apache.snapshots.https: https://repository.apache.org/content/repositories/snapshots/org/apache/jena/jena-fuseki1/maven-metadata.xml
[INFO] Uploaded to apache.snapshots.https: https://repository.apache.org/content/repositories/snapshots/org/apache/jena/jena-fuseki1/maven-metadata.xml
(469 B at 410 B/s)
[INFO] Uploading to apache.snapshots.https: https://repository.apache.org/content/repositories/snapshots/org/apache/jena/jena-fuseki1/3.10.0-SNAPSHOT/jena-fuseki1-3.10.0-20181124.101857-18-javadoc.jar
[INFO] Uploaded to apache.snapshots.https: https://repository.apache.org/content/repositories/snapshots/org/apache/jena/jena-fuseki1/3.10.0-SNAPSHOT/jena-fuseki1-3.10.0-20181124.101857-18-javadoc.jar
(404 kB at 284 kB/s)
[INFO] Uploading to apache.snapshots.https: https://repository.apache.org/content/repositories/snapshots/org/apache/jena/jena-fuseki1/3.10.0-SNAPSHOT/maven-metadata.xml
[INFO] Uploaded to apache.snapshots.https: https://repository.apache.org/content/repositories/snapshots/org/apache/jena/jena-fuseki1/3.10.0-SNAPSHOT/maven-metadata.xml
(1.4 kB at 1.3 kB/s)
[INFO] Uploading to apache.snapshots.https: https://repository.apache.org/content/repositories/snapshots/org/apache/jena/jena-fuseki1/3.10.0-SNAPSHOT/jena-fuseki1-3.10.0-20181124.101857-18-tests.jar
[INFO] Uploaded to apache.snapshots.https: https://repository.apache.org/content/repositories/snapshots/org/apache/jena/jena-fuseki1/3.10.0-SNAPSHOT/jena-fuseki1-3.10.0-20181124.101857-18-tests.jar
(33 kB at 27 kB/s)
[INFO] Uploading to apache.snapshots.https: https://repository.apache.org/content/repositories/snapshots/org/apache/jena/jena-fuseki1/3.10.0-SNAPSHOT/maven-metadata.xml
[INFO] Uploaded to apache.snapshots.https: https://repository.apache.org/content/repositories/snapshots/org/apache/jena/jena-fuseki1/3.10.0-SNAPSHOT/maven-metadata.xml
(1.4 kB at 1.3 kB/s)
[INFO] Uploading to apache.snapshots.https: https://repository.apache.org/content/repositories/snapshots/org/apache/jena/jena-fuseki1/3.10.0-SNAPSHOT/jena-fuseki1-3.10.0-20181124.101857-18-server.jar
[INFO] Uploaded to apache.snapshots.https: https://repository.apache.org/content/repositories/snapshots/org/apache/jena/jena-fuseki1/3.10.0-SNAPSHOT/jena-fuseki1-3.10.0-20181124.101857-18-server.jar
(27 MB at 8.9 MB/s)
[INFO] Uploading to apache.snapshots.https: https://repository.apache.org/content/repositories/snapshots/org/apache/jena/jena-fuseki1/3.10.0-SNAPSHOT/maven-metadata.xml
[INFO] Uploaded to apache.snapshots.https: https://repository.apache.org/content/repositories/snapshots/org/apache/jena/jena-fuseki1/3.10.0-SNAPSHOT/maven-metadata.xml
(1.4 kB at 1.3 kB/s)
[JENKINS] Archiving disabled
[INFO] 
[INFO] ----------------------< org.apache.jena:jena-csv >----------------------
[INFO] Building Apache Jena - Data Tables for RDF and SPARQL 3.10.0-SNAPSHOT [33/51]
[INFO] --------------------------------[ jar ]---------------------------------
[INFO] 
[INFO] --- maven-clean-plugin:3.1.0:clean (default-clean) @ jena-csv ---
[INFO] Deleting <https://builds.apache.org/job/Jena_Development_Deploy/ws/jena-csv/target>
[INFO] 
[INFO] --- maven-enforcer-plugin:3.0.0-M1:enforce (enforce) @ jena-csv ---
[INFO] 
[INFO] --- maven-enforcer-plugin:3.0.0-M1:enforce (enforce-maven-version) @ jena-csv ---
[INFO] 
[INFO] --- apache-rat-plugin:0.12:check (rat-checks) @ jena-csv ---
[INFO] Enabled default license matchers.
[INFO] Will parse SCM ignores for exclusions...
[INFO] Finished adding exclusions from SCM ignore files.
[INFO] 61 implicit excludes (use -debug for more details).
[INFO] Exclude: **/hs_err_pid*.log
[INFO] Exclude: **/.project
[INFO] Exclude: **/.settings/**
[INFO] Exclude: **/.classpath
[INFO] Exclude: **/README.*
[INFO] Exclude: **/META-INF/services/*
[INFO] Exclude: **/src-examples/data/*
[INFO] Exclude: **/dist/ABOUT
[INFO] Exclude: **/SEE_FUSEKI2
[INFO] Exclude: **/src/main/webapp/css/*
[INFO] Exclude: **/src/main/webapp/fonts/*
[INFO] Exclude: **/src/main/webapp/js/**/*
[INFO] Exclude: **/vocabularies/*
[INFO] Exclude: **/Vocabularies/*
[INFO] Exclude: **/src/main/**/*.html
[INFO] Exclude: **/src/**/package-info.java
[INFO] Exclude: **/DEPENDENCIES
[INFO] Exclude: **/*.txt
[INFO] Exclude: **/*.md
[INFO] Exclude: **/META-INF/services/*
[INFO] Exclude: **/src/test/resources/**/*
[INFO] Exclude: **/testing/**/*
[INFO] Exclude: **/log4j.properties
[INFO] Exclude: **/log4j-testing.properties
[INFO] Exclude: **/derby.log
[INFO] Exclude: **/DB/**/*
[INFO] Exclude: **/tdb*.cfg
[INFO] Exclude: **/run/**/*
[INFO] Exclude: **/*.classpath
[INFO] Exclude: **/*.recommenders/**/*
[INFO] Exclude: **/target/**/*
[INFO] Exclude: **/dependency-reduced-pom.xml
[INFO] Exclude: .travis.yml
[INFO] Exclude: jena-examples/**
[INFO] 35 resources included (use -debug for more details)
[INFO] Rat check: Summary over all files. Unapproved: 0, unknown: 0, generated: 0, approved:
32 licenses.
[INFO] 
[INFO] --- maven-remote-resources-plugin:1.5:process (process-resource-bundles) @ jena-csv
---
[INFO] 
[INFO] --- maven-resources-plugin:3.1.0:resources (default-resources) @ jena-csv ---
[INFO] Using 'UTF-8' encoding to copy filtered resources.
[INFO] Copying 1 resource
[INFO] Copying 3 resources
[INFO] 
[INFO] --- maven-compiler-plugin:3.8.0:compile (default-compile) @ jena-csv ---
[INFO] Changes detected - recompiling the module!
[INFO] Compiling 18 source files to <https://builds.apache.org/job/Jena_Development_Deploy/ws/jena-csv/target/classes>
[INFO] <https://builds.apache.org/job/Jena_Development_Deploy/ws/jena-csv/src/main/java/org/apache/jena/propertytable/impl/PropertyTableHashMapImpl.java>:
Some input files use or override a deprecated API.
[INFO] <https://builds.apache.org/job/Jena_Development_Deploy/ws/jena-csv/src/main/java/org/apache/jena/propertytable/impl/PropertyTableHashMapImpl.java>:
Recompile with -Xlint:deprecation for details.
[INFO] -------------------------------------------------------------
[ERROR] COMPILATION ERROR : 
[INFO] -------------------------------------------------------------
[ERROR] <https://builds.apache.org/job/Jena_Development_Deploy/ws/jena-csv/src/main/java/riotcmdx/csv2rdf.java>:[31,8]
riotcmdx.csv2rdf is not abstract and does not override abstract method dftLang() in riotcmd.CmdLangParse
[ERROR] <https://builds.apache.org/job/Jena_Development_Deploy/ws/jena-csv/src/main/java/riotcmdx/csv2rdf.java>:[43,9]
method does not override or implement a method from a supertype
[INFO] 2 errors 
[INFO] -------------------------------------------------------------
[JENKINS] Archiving disabled
[JENKINS] Archiving disabled
[JENKINS] Archiving disabled
[JENKINS] Archiving disabled
[JENKINS] Archiving disabled
[JENKINS] Archiving disabled
[JENKINS] Archiving disabled
[JENKINS] Archiving disabled
[JENKINS] Archiving disabled
[JENKINS] Archiving disabled
[JENKINS] Archiving disabled
[JENKINS] Archiving disabled
[JENKINS] Archiving disabled
[JENKINS] Archiving disabled
[JENKINS] Archiving disabled
[JENKINS] Archiving disabled
[JENKINS] Archiving disabled
[JENKINS] Archiving disabled
[JENKINS] Archiving disabled
[JENKINS] Archiving disabled
[JENKINS] Archiving disabled
[JENKINS] Archiving disabled
[JENKINS] Archiving disabled
[JENKINS] Archiving disabled
[JENKINS] Archiving disabled
[JENKINS] Archiving disabled
[JENKINS] Archiving disabled
[JENKINS] Archiving disabled
[JENKINS] Archiving disabled
[JENKINS] Archiving disabled
[JENKINS] Archiving disabled
[JENKINS] Archiving disabled
[JENKINS] Archiving disabled
[JENKINS] Archiving disabled
[JENKINS] Archiving disabled
[JENKINS] Archiving disabled
[JENKINS] Archiving disabled
[JENKINS] Archiving disabled
[JENKINS] Archiving disabled
[JENKINS] Archiving disabled
[JENKINS] Archiving disabled
[JENKINS] Archiving disabled
[JENKINS] Archiving disabled
[JENKINS] Archiving disabled
[JENKINS] Archiving disabled
[JENKINS] Archiving disabled
[JENKINS] Archiving disabled
[JENKINS] Archiving disabled
[JENKINS] Archiving disabled
[JENKINS] Archiving disabled
[JENKINS] Archiving disabled
[JENKINS] Archiving disabled
[INFO] ------------------------------------------------------------------------
[INFO] Reactor Summary:
[INFO] 
[INFO] Apache Jena 3.10.0-SNAPSHOT ........................ SUCCESS [ 19.062 s]
[INFO] Apache Jena - Shadowed external libraries .......... SUCCESS [ 18.824 s]
[INFO] Apache Jena - IRI .................................. SUCCESS [ 25.335 s]
[INFO] Apache Jena - Base Common Environment .............. SUCCESS [01:38 min]
[INFO] Apache Jena - Core ................................. SUCCESS [02:00 min]
[INFO] Apache Jena - ARQ (SPARQL 1.1 Query Engine) ........ SUCCESS [01:52 min]
[INFO] Apache Jena - RDF Connection ....................... SUCCESS [ 28.102 s]
[INFO] Apache Jena - TDB1 (Native Triple Store) ........... SUCCESS [02:25 min]
[INFO] Apache Jena - Database Operation Environment ....... SUCCESS [ 10.343 s]
[INFO] Apache Jena - DBOE Base ............................ SUCCESS [ 20.727 s]
[INFO] Apache Jena - DBOE Transactions .................... SUCCESS [ 19.330 s]
[INFO] Apache Jena - DBOE Indexes ......................... SUCCESS [ 18.455 s]
[INFO] Apache Jena - DBOE Index test suite ................ SUCCESS [ 17.787 s]
[INFO] Apache Jena - DBOE Transactional Datastructures .... SUCCESS [ 26.897 s]
[INFO] Apache Jena - TDB2 ................................. SUCCESS [02:00 min]
[INFO] Apache Jena - Libraries POM ........................ SUCCESS [  6.903 s]
[INFO] Apache Jena - Command line tools ................... SUCCESS [ 42.228 s]
[INFO] Apache Jena - SPARQL Text Search ................... SUCCESS [ 39.930 s]
[INFO] Apache Jena - SPARQL Text Search - Elasticsearch ... SUCCESS [02:25 min]
[INFO] Apache Jena - SPARQL Spatial Search ................ SUCCESS [ 38.789 s]
[INFO] Apache Jena - Fuseki - A SPARQL 1.1 Server ......... SUCCESS [  6.533 s]
[INFO] Apache Jena - Fuseki Core Engine ................... SUCCESS [ 14.306 s]
[INFO] Apache Jena - Fuseki Data Access Control ........... SUCCESS [ 24.427 s]
[INFO] Apache Jena - Fuseki Server ........................ SUCCESS [ 28.213 s]
[INFO] Apache Jena - Fuseki Server Jar .................... SUCCESS [ 17.321 s]
[INFO] Apache Jena - Fuseki Webapp ........................ SUCCESS [ 32.201 s]
[INFO] Apache Jena - Fuseki WAR File ...................... SUCCESS [ 18.408 s]
[INFO] Apache Jena - Fuseki Server Standalone Jar ......... SUCCESS [ 18.553 s]
[INFO] Apache Jena - Fuseki Binary Distribution ........... SUCCESS [ 26.051 s]
[INFO] Apache Jena - Integration Testing .................. SUCCESS [ 20.444 s]
[INFO] Apache Jena - Distribution ......................... SUCCESS [ 21.211 s]
[INFO] Apache Jena - Fuseki1 .............................. SUCCESS [ 40.156 s]
[INFO] Apache Jena - Data Tables for RDF and SPARQL ....... FAILURE [  2.325 s]
[INFO] Apache Jena - SDB (SQL based triple store) ......... SKIPPED
[INFO] Apache Jena - Security Permissions ................. SKIPPED
[INFO] Apache Jena - Extras ............................... SKIPPED
[INFO] Apache Jena - Extras - Query Builder ............... SKIPPED
[INFO] Apache Jena - JDBC Parent .......................... SKIPPED
[INFO] Apache Jena - JDBC Core API ........................ SKIPPED
[INFO] Apache Jena - JDBC Remote Endpoint Driver .......... SKIPPED
[INFO] Apache Jena - JDBC In-Memory Driver ................ SKIPPED
[INFO] Apache Jena - JDBC TDB Driver ...................... SKIPPED
[INFO] Apache Jena - JDBC Driver Bundle ................... SKIPPED
[INFO] Apache Jena - Elephas .............................. SKIPPED
[INFO] Apache Jena - Elephas - Common API ................. SKIPPED
[INFO] Apache Jena - Elephas - I/O ........................ SKIPPED
[INFO] Apache Jena - Elephas - Map/Reduce ................. SKIPPED
[INFO] Apache Jena - Elephas - Statistics Demo App ........ SKIPPED
[INFO] Apache Jena - OSGi ................................. SKIPPED
[INFO] Apache Jena - OSGi bundle .......................... SKIPPED
[INFO] Apache Jena - OSGi Karaf features 3.10.0-SNAPSHOT .. SKIPPED
[INFO] ------------------------------------------------------------------------
[INFO] BUILD FAILURE
[INFO] ------------------------------------------------------------------------
[INFO] Total time: 25:09 min
[INFO] Finished at: 2018-11-24T10:20:05Z
[INFO] ------------------------------------------------------------------------
Waiting for Jenkins to finish collecting data
[ERROR] Failed to execute goal org.apache.maven.plugins:maven-compiler-plugin:3.8.0:compile
(default-compile) on project jena-csv: Compilation failure: Compilation failure:
[ERROR] <https://builds.apache.org/job/Jena_Development_Deploy/ws/jena-csv/src/main/java/riotcmdx/csv2rdf.java>:[31,8]
riotcmdx.csv2rdf is not abstract and does not override abstract method dftLang() in riotcmd.CmdLangParse
[ERROR] <https://builds.apache.org/job/Jena_Development_Deploy/ws/jena-csv/src/main/java/riotcmdx/csv2rdf.java>:[43,9]
method does not override or implement a method from a supertype
[ERROR] -> [Help 1]
[ERROR] 
[ERROR] To see the full stack trace of the errors, re-run Maven with the -e switch.
[ERROR] Re-run Maven using the -X switch to enable full debug logging.
[ERROR] 
[ERROR] For more information about the errors and possible solutions, please read the following
articles:
[ERROR] [Help 1] http://cwiki.apache.org/confluence/display/MAVEN/MojoFailureException
[ERROR] 
[ERROR] After correcting the problems, you can resume the build with the command
[ERROR]   mvn <goals> -rf :jena-csv
channel stopped
[INFO] Cleaning up at application shutdown...
[INFO] The Elasticsearch process has already stopped. Nothing to clean up

Mime
View raw message