jena-commits mailing list archives

Site index · List index
Message view « Date » · « Thread »
Top « Date » · « Thread »
From Apache Jenkins Server <jenk...@builds.apache.org>
Subject Build failed in Jenkins: Jena_Development_Test #3019
Date Tue, 09 Oct 2018 16:32:00 GMT
See <https://builds.apache.org/job/Jena_Development_Test/3019/display/redirect?page=changes>

Changes:

[andy] JENA-1610: One "Metadata" class.

------------------------------------------
[...truncated 332.75 KB...]
[INFO] Exclude: **/derby.log
[INFO] Exclude: **/DB/**/*
[INFO] Exclude: **/tdb*.cfg
[INFO] Exclude: **/run/**/*
[INFO] Exclude: **/*.classpath
[INFO] Exclude: **/*.recommenders/**/*
[INFO] Exclude: **/target/**/*
[INFO] Exclude: **/dependency-reduced-pom.xml
[INFO] Exclude: .travis.yml
[INFO] Exclude: jena-examples/**
[INFO] 92 resources included (use -debug for more details)
[INFO] Rat check: Summary over all files. Unapproved: 0, unknown: 0, generated: 0, approved:
89 licenses.
[INFO] 
[INFO] --- maven-remote-resources-plugin:1.5:process (process-resource-bundles) @ apache-jena
---
[INFO] 
[INFO] --- maven-site-plugin:3.7.1:attach-descriptor (attach-descriptor) @ apache-jena ---
[INFO] No site descriptor found: nothing to attach.
[INFO] 
[INFO] --- maven-assembly-plugin:3.1.0:single (create-jena-download) @ apache-jena ---
[INFO] Reading assembly descriptor: assembly-jena-zip.xml
[INFO] Building zip: <https://builds.apache.org/job/Jena_Development_Test/ws/apache-jena/target/apache-jena-3.10.0-SNAPSHOT.zip>
[INFO] Building tar: <https://builds.apache.org/job/Jena_Development_Test/ws/apache-jena/target/apache-jena-3.10.0-SNAPSHOT.tar.gz>
[JENKINS] Archiving disabled
[INFO] 
[INFO] --------------------< org.apache.jena:jena-fuseki1 >--------------------
[INFO] Building Apache Jena - Fuseki1 3.10.0-SNAPSHOT                   [32/51]
[INFO] --------------------------------[ jar ]---------------------------------
[INFO] 
[INFO] --- maven-clean-plugin:3.1.0:clean (default-clean) @ jena-fuseki1 ---
[INFO] 
[INFO] --- maven-enforcer-plugin:3.0.0-M1:enforce (enforce) @ jena-fuseki1 ---
[INFO] 
[INFO] --- maven-enforcer-plugin:3.0.0-M1:enforce (enforce-maven-version) @ jena-fuseki1 ---
[INFO] 
[INFO] --- apache-rat-plugin:0.12:check (rat-checks) @ jena-fuseki1 ---
[INFO] Enabled default license matchers.
[INFO] Will parse SCM ignores for exclusions...
[INFO] Parsing exclusions from <https://builds.apache.org/job/Jena_Development_Test/ws/jena-fuseki1/.gitignore>
[INFO] Finished adding exclusions from SCM ignore files.
[INFO] 62 implicit excludes (use -debug for more details).
[INFO] Exclude: **/hs_err_pid*.log
[INFO] Exclude: **/.project
[INFO] Exclude: **/.settings/**
[INFO] Exclude: **/.classpath
[INFO] Exclude: **/README.*
[INFO] Exclude: **/META-INF/services/*
[INFO] Exclude: **/src-examples/data/*
[INFO] Exclude: **/dist/ABOUT
[INFO] Exclude: **/SEE_FUSEKI2
[INFO] Exclude: **/src/main/webapp/css/*
[INFO] Exclude: **/src/main/webapp/fonts/*
[INFO] Exclude: **/src/main/webapp/js/**/*
[INFO] Exclude: **/vocabularies/*
[INFO] Exclude: **/Vocabularies/*
[INFO] Exclude: **/src/main/**/*.html
[INFO] Exclude: **/src/**/package-info.java
[INFO] Exclude: **/DEPENDENCIES
[INFO] Exclude: **/*.txt
[INFO] Exclude: **/*.md
[INFO] Exclude: **/META-INF/services/*
[INFO] Exclude: **/src/test/resources/**/*
[INFO] Exclude: **/testing/**/*
[INFO] Exclude: **/log4j.properties
[INFO] Exclude: **/log4j-testing.properties
[INFO] Exclude: **/derby.log
[INFO] Exclude: **/DB/**/*
[INFO] Exclude: **/tdb*.cfg
[INFO] Exclude: **/run/**/*
[INFO] Exclude: **/*.classpath
[INFO] Exclude: **/*.recommenders/**/*
[INFO] Exclude: **/target/**/*
[INFO] Exclude: **/dependency-reduced-pom.xml
[INFO] Exclude: .travis.yml
[INFO] Exclude: jena-examples/**
[INFO] 116 resources included (use -debug for more details)
[INFO] Rat check: Summary over all files. Unapproved: 0, unknown: 0, generated: 0, approved:
111 licenses.
[INFO] 
[INFO] --- maven-remote-resources-plugin:1.5:process (process-resource-bundles) @ jena-fuseki1
---
[INFO] 
[INFO] --- maven-resources-plugin:3.1.0:resources (default-resources) @ jena-fuseki1 ---
[INFO] Using 'UTF-8' encoding to copy filtered resources.
[INFO] Copying 0 resource
[INFO] Copying 1 resource
[INFO] Copying 3 resources
[INFO] 
[INFO] --- maven-compiler-plugin:3.7.0:compile (default-compile) @ jena-fuseki1 ---
[INFO] Changes detected - recompiling the module!
[INFO] Compiling 69 source files to <https://builds.apache.org/job/Jena_Development_Test/ws/jena-fuseki1/target/classes>
[INFO] -------------------------------------------------------------
[ERROR] COMPILATION ERROR : 
[INFO] -------------------------------------------------------------
[ERROR] <https://builds.apache.org/job/Jena_Development_Test/ws/jena-fuseki1/src/main/java/org/apache/jena/fuseki/Fuseki.java>:[27,34]
cannot find symbol
  symbol:   class Metadata
  location: package org.apache.jena.sparql.lib
[ERROR] <https://builds.apache.org/job/Jena_Development_Test/ws/jena-fuseki1/src/main/java/org/apache/jena/fuseki/Fuseki.java>:[76,20]
cannot find symbol
  symbol:   class Metadata
  location: class org.apache.jena.fuseki.Fuseki
[ERROR] <https://builds.apache.org/job/Jena_Development_Test/ws/jena-fuseki1/src/main/java/org/apache/jena/fuseki/Fuseki.java>:[78,20]
cannot find symbol
  symbol:   class Metadata
  location: class org.apache.jena.fuseki.Fuseki
[ERROR] <https://builds.apache.org/job/Jena_Development_Test/ws/jena-fuseki1/src/main/java/org/apache/jena/fuseki/Fuseki.java>:[80,9]
cannot find symbol
  symbol:   class Metadata
  location: class org.apache.jena.fuseki.Fuseki
[ERROR] <https://builds.apache.org/job/Jena_Development_Test/ws/jena-fuseki1/src/main/java/org/apache/jena/fuseki/Fuseki.java>:[80,26]
cannot find symbol
  symbol:   class Metadata
  location: class org.apache.jena.fuseki.Fuseki
[INFO] 5 errors 
[INFO] -------------------------------------------------------------
[JENKINS] Archiving disabled
[JENKINS] Archiving disabled
[JENKINS] Archiving disabled
[JENKINS] Archiving disabled
[JENKINS] Archiving disabled
[JENKINS] Archiving disabled
[JENKINS] Archiving disabled
[JENKINS] Archiving disabled
[JENKINS] Archiving disabled
[JENKINS] Archiving disabled
[JENKINS] Archiving disabled
[JENKINS] Archiving disabled
[JENKINS] Archiving disabled
[JENKINS] Archiving disabled
[JENKINS] Archiving disabled
[JENKINS] Archiving disabled
[JENKINS] Archiving disabled
[JENKINS] Archiving disabled
[JENKINS] Archiving disabled
[JENKINS] Archiving disabled
[JENKINS] Archiving disabled
[JENKINS] Archiving disabled
[JENKINS] Archiving disabled
[JENKINS] Archiving disabled
[JENKINS] Archiving disabled
[JENKINS] Archiving disabled
[JENKINS] Archiving disabled
[JENKINS] Archiving disabled
[JENKINS] Archiving disabled
[JENKINS] Archiving disabled
[JENKINS] Archiving disabled
[JENKINS] Archiving disabled
[JENKINS] Archiving disabled
[JENKINS] Archiving disabled
[JENKINS] Archiving disabled
[JENKINS] Archiving disabled
[JENKINS] Archiving disabled
[JENKINS] Archiving disabled
[JENKINS] Archiving disabled
[JENKINS] Archiving disabled
[JENKINS] Archiving disabled
[JENKINS] Archiving disabled
[JENKINS] Archiving disabled
[JENKINS] Archiving disabled
[JENKINS] Archiving disabled
[JENKINS] Archiving disabled
[JENKINS] Archiving disabled
[JENKINS] Archiving disabled
[JENKINS] Archiving disabled
[JENKINS] Archiving disabled
[JENKINS] Archiving disabled
[JENKINS] Archiving disabled
[INFO] ------------------------------------------------------------------------
[INFO] Reactor Summary:
[INFO] 
[INFO] Apache Jena 3.10.0-SNAPSHOT ........................ SUCCESS [  6.727 s]
[INFO] Apache Jena - Shadowed external libraries .......... SUCCESS [  5.408 s]
[INFO] Apache Jena - IRI .................................. SUCCESS [ 11.087 s]
[INFO] Apache Jena - Base Common Environment .............. SUCCESS [ 29.357 s]
[INFO] Apache Jena - Core ................................. SUCCESS [01:33 min]
[INFO] Apache Jena - ARQ (SPARQL 1.1 Query Engine) ........ SUCCESS [01:34 min]
[INFO] Apache Jena - RDF Connection ....................... SUCCESS [ 10.783 s]
[INFO] Apache Jena - TDB1 (Native Triple Store) ........... SUCCESS [ 39.674 s]
[INFO] Apache Jena - Database Operation Environment ....... SUCCESS [  0.798 s]
[INFO] Apache Jena - DBOE Base ............................ SUCCESS [  4.174 s]
[INFO] Apache Jena - DBOE Transactions .................... SUCCESS [  4.130 s]
[INFO] Apache Jena - DBOE Indexes ......................... SUCCESS [  2.001 s]
[INFO] Apache Jena - DBOE Index test suite ................ SUCCESS [  1.849 s]
[INFO] Apache Jena - DBOE Transactional Datastructures .... SUCCESS [  8.845 s]
[INFO] Apache Jena - TDB2 ................................. SUCCESS [ 46.769 s]
[INFO] Apache Jena - Libraries POM ........................ SUCCESS [  0.897 s]
[INFO] Apache Jena - Command line tools ................... SUCCESS [ 27.910 s]
[INFO] Apache Jena - SPARQL Text Search ................... SUCCESS [ 19.716 s]
[INFO] Apache Jena - SPARQL Text Search - Elasticsearch ... SUCCESS [ 40.010 s]
[INFO] Apache Jena - SPARQL Spatial Search ................ SUCCESS [ 14.124 s]
[INFO] Apache Jena - Fuseki - A SPARQL 1.1 Server ......... SUCCESS [  0.557 s]
[INFO] Apache Jena - Fuseki Core Engine ................... SUCCESS [  3.376 s]
[INFO] Apache Jena - Fuseki Server ........................ SUCCESS [  7.531 s]
[INFO] Apache Jena - Fuseki Data Access Control ........... SUCCESS [  9.091 s]
[INFO] Apache Jena - Fuseki Server Jar .................... SUCCESS [  4.759 s]
[INFO] Apache Jena - Fuseki Webapp ........................ SUCCESS [ 15.748 s]
[INFO] Apache Jena - Fuseki WAR File ...................... SUCCESS [  7.529 s]
[INFO] Apache Jena - Fuseki Server Standalone Jar ......... SUCCESS [  6.161 s]
[INFO] Apache Jena - Fuseki Binary Distribution ........... SUCCESS [  6.851 s]
[INFO] Apache Jena - Integration Testing .................. SUCCESS [  8.877 s]
[INFO] Apache Jena - Distribution ......................... SUCCESS [  7.174 s]
[INFO] Apache Jena - Fuseki1 .............................. FAILURE [  3.491 s]
[INFO] Apache Jena - Data Tables for RDF and SPARQL ....... SKIPPED
[INFO] Apache Jena - SDB (SQL based triple store) ......... SKIPPED
[INFO] Apache Jena - Security Permissions ................. SKIPPED
[INFO] Apache Jena - Extras ............................... SKIPPED
[INFO] Apache Jena - Extras - Query Builder ............... SKIPPED
[INFO] Apache Jena - JDBC Parent .......................... SKIPPED
[INFO] Apache Jena - JDBC Core API ........................ SKIPPED
[INFO] Apache Jena - JDBC Remote Endpoint Driver .......... SKIPPED
[INFO] Apache Jena - JDBC In-Memory Driver ................ SKIPPED
[INFO] Apache Jena - JDBC TDB Driver ...................... SKIPPED
[INFO] Apache Jena - JDBC Driver Bundle ................... SKIPPED
[INFO] Apache Jena - Elephas .............................. SKIPPED
[INFO] Apache Jena - Elephas - Common API ................. SKIPPED
[INFO] Apache Jena - Elephas - I/O ........................ SKIPPED
[INFO] Apache Jena - Elephas - Map/Reduce ................. SKIPPED
[INFO] Apache Jena - Elephas - Statistics Demo App ........ SKIPPED
[INFO] Apache Jena - OSGi ................................. SKIPPED
[INFO] Apache Jena - OSGi bundle .......................... SKIPPED
[INFO] Apache Jena - OSGi Karaf features 3.10.0-SNAPSHOT .. SKIPPED
[INFO] ------------------------------------------------------------------------
[INFO] BUILD FAILURE
[INFO] ------------------------------------------------------------------------
[INFO] Total time: 10:27 min
[INFO] Finished at: 2018-10-09T16:31:24Z
[INFO] ------------------------------------------------------------------------
Waiting for Jenkins to finish collecting data
[ERROR] Failed to execute goal org.apache.maven.plugins:maven-compiler-plugin:3.7.0:compile
(default-compile) on project jena-fuseki1: Compilation failure: Compilation failure:
[ERROR] <https://builds.apache.org/job/Jena_Development_Test/ws/jena-fuseki1/src/main/java/org/apache/jena/fuseki/Fuseki.java>:[27,34]
cannot find symbol
[ERROR] symbol:   class Metadata
[ERROR] location: package org.apache.jena.sparql.lib
[ERROR] <https://builds.apache.org/job/Jena_Development_Test/ws/jena-fuseki1/src/main/java/org/apache/jena/fuseki/Fuseki.java>:[76,20]
cannot find symbol
[ERROR] symbol:   class Metadata
[ERROR] location: class org.apache.jena.fuseki.Fuseki
[ERROR] <https://builds.apache.org/job/Jena_Development_Test/ws/jena-fuseki1/src/main/java/org/apache/jena/fuseki/Fuseki.java>:[78,20]
cannot find symbol
[ERROR] symbol:   class Metadata
[ERROR] location: class org.apache.jena.fuseki.Fuseki
[ERROR] <https://builds.apache.org/job/Jena_Development_Test/ws/jena-fuseki1/src/main/java/org/apache/jena/fuseki/Fuseki.java>:[80,9]
cannot find symbol
[ERROR] symbol:   class Metadata
[ERROR] location: class org.apache.jena.fuseki.Fuseki
[ERROR] <https://builds.apache.org/job/Jena_Development_Test/ws/jena-fuseki1/src/main/java/org/apache/jena/fuseki/Fuseki.java>:[80,26]
cannot find symbol
[ERROR] symbol:   class Metadata
[ERROR] location: class org.apache.jena.fuseki.Fuseki
[ERROR] -> [Help 1]
[ERROR] 
[ERROR] To see the full stack trace of the errors, re-run Maven with the -e switch.
[ERROR] Re-run Maven using the -X switch to enable full debug logging.
[ERROR] 
[ERROR] For more information about the errors and possible solutions, please read the following
articles:
[ERROR] [Help 1] http://cwiki.apache.org/confluence/display/MAVEN/MojoFailureException
[ERROR] 
[ERROR] After correcting the problems, you can resume the build with the command
[ERROR]   mvn <goals> -rf :jena-fuseki1
channel stopped
[INFO] The Elasticsearch process has already stopped. Nothing to clean up

Mime
View raw message