jena-commits mailing list archives

Site index · List index
Message view « Date » · « Thread »
Top « Date » · « Thread »
From Apache Jenkins Server <jenk...@builds.apache.org>
Subject Build failed in Jenkins: Jena_JDK10_build #3
Date Wed, 09 May 2018 11:15:22 GMT
See <https://builds.apache.org/job/Jena_JDK10_build/3/display/redirect>

------------------------------------------
[...truncated 15.21 KB...]
[INFO] Replacing original artifact with shaded artifact.
[INFO] Replacing <https://builds.apache.org/job/Jena_JDK10_build/ws/jena-shaded-guava/target/jena-shaded-guava-3.8.0-SNAPSHOT.jar>
with <https://builds.apache.org/job/Jena_JDK10_build/ws/jena-shaded-guava/target/jena-shaded-guava-3.8.0-SNAPSHOT-shaded.jar>
[INFO] Replacing original source artifact with shaded source artifact.
[INFO] Replacing <https://builds.apache.org/job/Jena_JDK10_build/ws/jena-shaded-guava/target/jena-shaded-guava-3.8.0-SNAPSHOT-sources.jar>
with <https://builds.apache.org/job/Jena_JDK10_build/ws/jena-shaded-guava/target/jena-shaded-guava-3.8.0-SNAPSHOT-shaded-sources.jar>
[INFO] Dependency-reduced POM written at: <https://builds.apache.org/job/Jena_JDK10_build/ws/jena-shaded-guava/dependency-reduced-pom.xml>
[JENKINS] Archiving disabled
[INFO] 
[INFO] ------------------------------------------------------------------------
[INFO] Building Apache Jena - IRI 3.8.0-SNAPSHOT
[INFO] ------------------------------------------------------------------------
[INFO] 
[INFO] --- maven-clean-plugin:3.0.0:clean (default-clean) @ jena-iri ---
[INFO] Deleting <https://builds.apache.org/job/Jena_JDK10_build/ws/jena-iri/target>
[INFO] 
[INFO] --- maven-enforcer-plugin:3.0.0-M1:enforce (enforce) @ jena-iri ---
[INFO] 
[INFO] --- maven-enforcer-plugin:3.0.0-M1:enforce (enforce-maven-version) @ jena-iri ---
[INFO] 
[INFO] --- apache-rat-plugin:0.12:check (rat-checks) @ jena-iri ---
[INFO] Enabled default license matchers.
[INFO] Will parse SCM ignores for exclusions...
[INFO] Finished adding exclusions from SCM ignore files.
[INFO] 61 implicit excludes (use -debug for more details).
[INFO] Exclude: **/hs_err_pid*.log
[INFO] Exclude: **/.project
[INFO] Exclude: **/.settings/**
[INFO] Exclude: **/.classpath
[INFO] Exclude: **/README.*
[INFO] Exclude: **/META-INF/services/*
[INFO] Exclude: **/src-examples/data/*
[INFO] Exclude: **/dist/ABOUT
[INFO] Exclude: **/SEE_FUSEKI2
[INFO] Exclude: **/src/main/webapp/css/*
[INFO] Exclude: **/src/main/webapp/fonts/*
[INFO] Exclude: **/src/main/webapp/js/**/*
[INFO] Exclude: **/vocabularies/*
[INFO] Exclude: **/Vocabularies/*
[INFO] Exclude: **/src/main/**/*.html
[INFO] Exclude: **/src/**/package-info.java
[INFO] Exclude: **/DEPENDENCIES
[INFO] Exclude: **/*.txt
[INFO] Exclude: **/*.md
[INFO] Exclude: **/META-INF/services/*
[INFO] Exclude: **/src/test/resources/**/*
[INFO] Exclude: **/testing/**/*
[INFO] Exclude: **/log4j.properties
[INFO] Exclude: **/log4j-testing.properties
[INFO] Exclude: **/derby.log
[INFO] Exclude: **/DB/**/*
[INFO] Exclude: **/tdb*.cfg
[INFO] Exclude: **/run/**/*
[INFO] Exclude: **/*.classpath
[INFO] Exclude: **/*.recommenders/**/*
[INFO] Exclude: **/target/**/*
[INFO] Exclude: **/dependency-reduced-pom.xml
[INFO] Exclude: .travis.yml
[INFO] Exclude: jena-examples/**
[INFO] 83 resources included (use -debug for more details)
[INFO] Rat check: Summary over all files. Unapproved: 0, unknown: 0, generated: 0, approved:
79 licenses.
[INFO] 
[INFO] --- maven-remote-resources-plugin:1.5:process (process-resource-bundles) @ jena-iri
---
[INFO] 
[INFO] --- maven-resources-plugin:3.0.2:resources (default-resources) @ jena-iri ---
[INFO] Using 'UTF-8' encoding to copy filtered resources.
[INFO] Copying 0 resource
[INFO] Copying 3 resources
[INFO] 
[INFO] --- maven-compiler-plugin:3.7.0:compile (default-compile) @ jena-iri ---
[INFO] Changes detected - recompiling the module!
[INFO] Compiling 43 source files to <https://builds.apache.org/job/Jena_JDK10_build/ws/jena-iri/target/classes>
[INFO] 
[INFO] --- maven-resources-plugin:3.0.2:testResources (default-testResources) @ jena-iri ---
[INFO] Using 'UTF-8' encoding to copy filtered resources.
[INFO] Copying 2 resources
[INFO] Copying 3 resources
[INFO] 
[INFO] --- maven-compiler-plugin:3.7.0:testCompile (default-testCompile) @ jena-iri ---
[INFO] Changes detected - recompiling the module!
[INFO] Compiling 12 source files to <https://builds.apache.org/job/Jena_JDK10_build/ws/jena-iri/target/test-classes>
[INFO] 
[INFO] --- maven-surefire-plugin:2.20.1:test (default-test) @ jena-iri ---
[JENKINS] Recording test results
[INFO] 
[INFO] --- maven-jar-plugin:3.0.2:jar (default-jar) @ jena-iri ---
[INFO] Building jar: <https://builds.apache.org/job/Jena_JDK10_build/ws/jena-iri/target/jena-iri-3.8.0-SNAPSHOT.jar>
[INFO] 
[INFO] --- maven-site-plugin:3.7:attach-descriptor (attach-descriptor) @ jena-iri ---
[INFO] Skipping because packaging 'jar' is not pom.
[INFO] 
[INFO] --- maven-source-plugin:3.0.1:jar-no-fork (attach-sources) @ jena-iri ---
[INFO] Building jar: <https://builds.apache.org/job/Jena_JDK10_build/ws/jena-iri/target/jena-iri-3.8.0-SNAPSHOT-sources.jar>
[INFO] 
[INFO] --- maven-javadoc-plugin:3.0.0:jar (attach-javadocs) @ jena-iri ---
[INFO] Skipping javadoc generation
[JENKINS] Archiving disabled
[INFO] 
[INFO] ------------------------------------------------------------------------
[INFO] Building Apache Jena - Base Common Environment 3.8.0-SNAPSHOT
[INFO] ------------------------------------------------------------------------
[INFO] 
[INFO] --- maven-clean-plugin:3.0.0:clean (default-clean) @ jena-base ---
[INFO] Deleting <https://builds.apache.org/job/Jena_JDK10_build/ws/jena-base/target>
[INFO] 
[INFO] --- maven-enforcer-plugin:3.0.0-M1:enforce (enforce) @ jena-base ---
[INFO] 
[INFO] --- maven-enforcer-plugin:3.0.0-M1:enforce (enforce-maven-version) @ jena-base ---
[INFO] 
[INFO] --- apache-rat-plugin:0.12:check (rat-checks) @ jena-base ---
[INFO] Enabled default license matchers.
[INFO] Will parse SCM ignores for exclusions...
[INFO] Finished adding exclusions from SCM ignore files.
[INFO] 61 implicit excludes (use -debug for more details).
[INFO] Exclude: **/hs_err_pid*.log
[INFO] Exclude: **/.project
[INFO] Exclude: **/.settings/**
[INFO] Exclude: **/.classpath
[INFO] Exclude: **/README.*
[INFO] Exclude: **/META-INF/services/*
[INFO] Exclude: **/src-examples/data/*
[INFO] Exclude: **/dist/ABOUT
[INFO] Exclude: **/SEE_FUSEKI2
[INFO] Exclude: **/src/main/webapp/css/*
[INFO] Exclude: **/src/main/webapp/fonts/*
[INFO] Exclude: **/src/main/webapp/js/**/*
[INFO] Exclude: **/vocabularies/*
[INFO] Exclude: **/Vocabularies/*
[INFO] Exclude: **/src/main/**/*.html
[INFO] Exclude: **/src/**/package-info.java
[INFO] Exclude: **/DEPENDENCIES
[INFO] Exclude: **/*.txt
[INFO] Exclude: **/*.md
[INFO] Exclude: **/META-INF/services/*
[INFO] Exclude: **/src/test/resources/**/*
[INFO] Exclude: **/testing/**/*
[INFO] Exclude: **/log4j.properties
[INFO] Exclude: **/log4j-testing.properties
[INFO] Exclude: **/derby.log
[INFO] Exclude: **/DB/**/*
[INFO] Exclude: **/tdb*.cfg
[INFO] Exclude: **/run/**/*
[INFO] Exclude: **/*.classpath
[INFO] Exclude: **/*.recommenders/**/*
[INFO] Exclude: **/target/**/*
[INFO] Exclude: **/dependency-reduced-pom.xml
[INFO] Exclude: .travis.yml
[INFO] Exclude: jena-examples/**
[INFO] 206 resources included (use -debug for more details)
[INFO] Rat check: Summary over all files. Unapproved: 0, unknown: 0, generated: 0, approved:
204 licenses.
[INFO] 
[INFO] --- maven-remote-resources-plugin:1.5:process (process-resource-bundles) @ jena-base
---
[INFO] 
[INFO] --- maven-resources-plugin:3.0.2:resources (default-resources) @ jena-base ---
[INFO] Using 'UTF-8' encoding to copy filtered resources.
[INFO] skip non existing resourceDirectory <https://builds.apache.org/job/Jena_JDK10_build/ws/jena-base/src/main/resources>
[INFO] Copying 3 resources
[INFO] 
[INFO] --- maven-compiler-plugin:3.7.0:compile (default-compile) @ jena-base ---
[INFO] Changes detected - recompiling the module!
[INFO] Compiling 153 source files to <https://builds.apache.org/job/Jena_JDK10_build/ws/jena-base/target/classes>
[INFO] <https://builds.apache.org/job/Jena_JDK10_build/ws/jena-base/src/main/java/org/apache/jena/atlas/lib/StrUtils.java>:
Some input files use or override a deprecated API.
[INFO] <https://builds.apache.org/job/Jena_JDK10_build/ws/jena-base/src/main/java/org/apache/jena/atlas/lib/StrUtils.java>:
Recompile with -Xlint:deprecation for details.
[INFO] 
[INFO] --- maven-resources-plugin:3.0.2:testResources (default-testResources) @ jena-base
---
[INFO] Using 'UTF-8' encoding to copy filtered resources.
[INFO] skip non existing resourceDirectory <https://builds.apache.org/job/Jena_JDK10_build/ws/jena-base/src/test/resources>
[INFO] Copying 3 resources
[INFO] 
[INFO] --- maven-compiler-plugin:3.7.0:testCompile (default-testCompile) @ jena-base ---
[INFO] Changes detected - recompiling the module!
[INFO] Compiling 52 source files to <https://builds.apache.org/job/Jena_JDK10_build/ws/jena-base/target/test-classes>
[INFO] 
[INFO] --- maven-surefire-plugin:2.20.1:test (default-test) @ jena-base ---
[JENKINS] Recording test results
[JENKINS] Archiving disabled
[JENKINS] Archiving disabled
[JENKINS] Archiving disabled
[JENKINS] Archiving disabled
[JENKINS] Archiving disabled
[JENKINS] Archiving disabled
[JENKINS] Archiving disabled
[JENKINS] Archiving disabled
[JENKINS] Archiving disabled
[JENKINS] Archiving disabled
[JENKINS] Archiving disabled
[JENKINS] Archiving disabled
[JENKINS] Archiving disabled
[JENKINS] Archiving disabled
[JENKINS] Archiving disabled
[JENKINS] Archiving disabled
[JENKINS] Archiving disabled
[JENKINS] Archiving disabled
[JENKINS] Archiving disabled
[JENKINS] Archiving disabled
[JENKINS] Archiving disabled
[JENKINS] Archiving disabled
[JENKINS] Archiving disabled
[JENKINS] Archiving disabled
[JENKINS] Archiving disabled
[JENKINS] Archiving disabled
[JENKINS] Archiving disabled
[JENKINS] Archiving disabled
[INFO] ------------------------------------------------------------------------
[INFO] Reactor Summary:
[INFO] 
[INFO] Apache Jena ........................................ SUCCESS [ 15.314 s]
[INFO] Apache Jena - Shadowed external libraries .......... SUCCESS [ 10.255 s]
[INFO] Apache Jena - IRI .................................. SUCCESS [  9.244 s]
[INFO] Apache Jena - Base Common Environment .............. FAILURE [  8.558 s]
[INFO] Apache Jena - Core ................................. SKIPPED
[INFO] Apache Jena - ARQ (SPARQL 1.1 Query Engine) ........ SKIPPED
[INFO] Apache Jena - RDF Connection ....................... SKIPPED
[INFO] Apache Jena - TDB1 (Native Triple Store) ........... SKIPPED
[INFO] Apache Jena - Database Operation Environment ....... SKIPPED
[INFO] Apache Jena - DBOE Base ............................ SKIPPED
[INFO] Apache Jena - DBOE Transactions .................... SKIPPED
[INFO] Apache Jena - DBOE Indexes ......................... SKIPPED
[INFO] Apache Jena - DBOE Index test suite ................ SKIPPED
[INFO] Apache Jena - DBOE Transactional Datastructures .... SKIPPED
[INFO] Apache Jena - TDB2 ................................. SKIPPED
[INFO] Apache Jena - Libraries POM ........................ SKIPPED
[INFO] Apache Jena - Command line tools ................... SKIPPED
[INFO] Apache Jena - SPARQL Text Search ................... SKIPPED
[INFO] Apache Jena - SPARQL Spatial Search ................ SKIPPED
[INFO] Apache Jena - Fuseki - A SPARQL 1.1 Server ......... SKIPPED
[INFO] Apache Jena - Fuseki Server Engine ................. SKIPPED
[INFO] Apache Jena - Fuseki Embedded Server ............... SKIPPED
[INFO] Apache Jena - Fuseki WAR File ...................... SKIPPED
[INFO] Apache Jena - Fuseki Server Standalone Jar ......... SKIPPED
[INFO] Apache Jena - Fuseki Basic Server .................. SKIPPED
[INFO] Apache Jena - Fuseki Binary Distribution ........... SKIPPED
[INFO] Apache Jena - Integration Testing .................. SKIPPED
[INFO] ------------------------------------------------------------------------
[INFO] BUILD FAILURE
[INFO] ------------------------------------------------------------------------
[INFO] Total time: 01:18 min
[INFO] Finished at: 2018-05-09T11:14:31Z
[INFO] Final Memory: 49M/228M
[INFO] ------------------------------------------------------------------------
[ERROR] Failed to execute goal org.apache.maven.plugins:maven-surefire-plugin:2.20.1:test
(default-test) on project jena-base: Execution default-test of goal org.apache.maven.plugins:maven-surefire-plugin:2.20.1:test
failed. NullPointerException -> [Help 1]
[ERROR] 
[ERROR] To see the full stack trace of the errors, re-run Maven with the -e switch.
[ERROR] Re-run Maven using the -X switch to enable full debug logging.
[ERROR] 
[ERROR] For more information about the errors and possible solutions, please read the following
articles:
[ERROR] [Help 1] http://cwiki.apache.org/confluence/display/MAVEN/PluginExecutionException
[ERROR] 
[ERROR] After correcting the problems, you can resume the build with the command
[ERROR]   mvn <goals> -rf :jena-base
channel stopped

Mime
View raw message