jena-commits mailing list archives

Site index · List index
Message view « Date » · « Thread »
Top « Date » · « Thread »
From Apache Jenkins Server <jenk...@builds.apache.org>
Subject Build failed in Jenkins: Jena_Development_Test #2907
Date Sat, 21 Apr 2018 15:49:33 GMT
See <https://builds.apache.org/job/Jena_Development_Test/2907/display/redirect>

------------------------------------------
Started by an SCM change
[EnvInject] - Loading node environment variables.
Building remotely on H24 (ubuntu xenial) in workspace <https://builds.apache.org/job/Jena_Development_Test/ws/>
java.io.IOException: Failed to mkdirs: <https://builds.apache.org/job/Jena_Development_Test/ws/>
	at hudson.FilePath.mkdirs(FilePath.java:1170)
	at hudson.model.AbstractProject.checkout(AbstractProject.java:1200)
	at hudson.model.AbstractBuild$AbstractBuildExecution.defaultCheckout(AbstractBuild.java:574)
	at jenkins.scm.SCMCheckoutStrategy.checkout(SCMCheckoutStrategy.java:86)
	at hudson.model.AbstractBuild$AbstractBuildExecution.run(AbstractBuild.java:499)
	at hudson.model.Run.execute(Run.java:1724)
	at hudson.maven.MavenModuleSetBuild.run(MavenModuleSetBuild.java:543)
	at hudson.model.ResourceController.execute(ResourceController.java:97)
	at hudson.model.Executor.run(Executor.java:429)
Retrying after 10 seconds
java.io.IOException: Failed to mkdirs: <https://builds.apache.org/job/Jena_Development_Test/ws/>
	at hudson.FilePath.mkdirs(FilePath.java:1170)
	at hudson.model.AbstractProject.checkout(AbstractProject.java:1200)
	at hudson.model.AbstractBuild$AbstractBuildExecution.defaultCheckout(AbstractBuild.java:574)
	at jenkins.scm.SCMCheckoutStrategy.checkout(SCMCheckoutStrategy.java:86)
	at hudson.model.AbstractBuild$AbstractBuildExecution.run(AbstractBuild.java:499)
	at hudson.model.Run.execute(Run.java:1724)
	at hudson.maven.MavenModuleSetBuild.run(MavenModuleSetBuild.java:543)
	at hudson.model.ResourceController.execute(ResourceController.java:97)
	at hudson.model.Executor.run(Executor.java:429)
Retrying after 10 seconds
java.io.IOException: Failed to mkdirs: <https://builds.apache.org/job/Jena_Development_Test/ws/>
	at hudson.FilePath.mkdirs(FilePath.java:1170)
	at hudson.model.AbstractProject.checkout(AbstractProject.java:1200)
	at hudson.model.AbstractBuild$AbstractBuildExecution.defaultCheckout(AbstractBuild.java:574)
	at jenkins.scm.SCMCheckoutStrategy.checkout(SCMCheckoutStrategy.java:86)
	at hudson.model.AbstractBuild$AbstractBuildExecution.run(AbstractBuild.java:499)
	at hudson.model.Run.execute(Run.java:1724)
	at hudson.maven.MavenModuleSetBuild.run(MavenModuleSetBuild.java:543)
	at hudson.model.ResourceController.execute(ResourceController.java:97)
	at hudson.model.Executor.run(Executor.java:429)

Mime
View raw message