jena-commits mailing list archives

Site index · List index
Message view « Date » · « Thread »
Top « Date » · « Thread »
From Apache Jenkins Server <jenk...@builds.apache.org>
Subject Build failed in Jenkins: Jena_Development_Deploy #1444
Date Sat, 04 Nov 2017 10:10:45 GMT
See <https://builds.apache.org/job/Jena_Development_Deploy/1444/display/redirect?page=changes>

Changes:

[andy] Undeprecate Lang.CSV

[andy] Move all CSV2RDF to jena-csv module.

[andy] Use Lang.TSV.

[brunodepaulak] Fixing tests on Windows for 3.5.0 RC2

------------------------------------------
[...truncated 374.56 KB...]
[INFO] Uploaded: https://repository.apache.org/content/repositories/snapshots/org/apache/jena/jena-text/3.6.0-SNAPSHOT/maven-metadata.xml
(1.2 kB at 1.1 kB/s)
[INFO] Uploading: https://repository.apache.org/content/repositories/snapshots/org/apache/jena/jena-text/3.6.0-SNAPSHOT/maven-metadata.xml
[INFO] Uploaded: https://repository.apache.org/content/repositories/snapshots/org/apache/jena/jena-text/3.6.0-SNAPSHOT/maven-metadata.xml
(1.2 kB at 1.1 kB/s)
[INFO] Uploading: https://repository.apache.org/content/repositories/snapshots/org/apache/jena/jena-text/maven-metadata.xml
[INFO] Uploaded: https://repository.apache.org/content/repositories/snapshots/org/apache/jena/jena-text/maven-metadata.xml
(424 B at 375 B/s)
[INFO] Uploading: https://repository.apache.org/content/repositories/snapshots/org/apache/jena/jena-text/maven-metadata.xml
[INFO] Uploaded: https://repository.apache.org/content/repositories/snapshots/org/apache/jena/jena-text/maven-metadata.xml
(424 B at 387 B/s)
[INFO] Uploading: https://repository.apache.org/content/repositories/snapshots/org/apache/jena/jena-text/3.6.0-SNAPSHOT/jena-text-3.6.0-20171104.100818-8-sources.jar
[INFO] Uploaded: https://repository.apache.org/content/repositories/snapshots/org/apache/jena/jena-text/3.6.0-SNAPSHOT/jena-text-3.6.0-20171104.100818-8-sources.jar
(75 kB at 59 kB/s)
[INFO] Downloading: https://repository.apache.org/content/repositories/snapshots/org/apache/jena/jena-text/maven-metadata.xml
[INFO] Downloaded: https://repository.apache.org/content/repositories/snapshots/org/apache/jena/jena-text/maven-metadata.xml
(424 B at 779 B/s)
[INFO] Uploading: https://repository.apache.org/content/repositories/snapshots/org/apache/jena/jena-text/3.6.0-SNAPSHOT/maven-metadata.xml
[INFO] Uploaded: https://repository.apache.org/content/repositories/snapshots/org/apache/jena/jena-text/3.6.0-SNAPSHOT/maven-metadata.xml
(1.2 kB at 1.1 kB/s)
[INFO] Uploading: https://repository.apache.org/content/repositories/snapshots/org/apache/jena/jena-text/3.6.0-SNAPSHOT/maven-metadata.xml
[INFO] Uploaded: https://repository.apache.org/content/repositories/snapshots/org/apache/jena/jena-text/3.6.0-SNAPSHOT/maven-metadata.xml
(1.2 kB at 1.0 kB/s)
[INFO] Uploading: https://repository.apache.org/content/repositories/snapshots/org/apache/jena/jena-text/maven-metadata.xml
[INFO] Uploaded: https://repository.apache.org/content/repositories/snapshots/org/apache/jena/jena-text/maven-metadata.xml
(424 B at 385 B/s)
[INFO] Uploading: https://repository.apache.org/content/repositories/snapshots/org/apache/jena/jena-text/3.6.0-SNAPSHOT/jena-text-3.6.0-20171104.100818-8-javadoc.jar
[INFO] Uploaded: https://repository.apache.org/content/repositories/snapshots/org/apache/jena/jena-text/3.6.0-SNAPSHOT/jena-text-3.6.0-20171104.100818-8-javadoc.jar
(252 kB at 173 kB/s)
[INFO] Downloading: https://repository.apache.org/content/repositories/snapshots/org/apache/jena/jena-text/maven-metadata.xml
[INFO] Downloaded: https://repository.apache.org/content/repositories/snapshots/org/apache/jena/jena-text/maven-metadata.xml
(424 B at 780 B/s)
[INFO] Uploading: https://repository.apache.org/content/repositories/snapshots/org/apache/jena/jena-text/3.6.0-SNAPSHOT/maven-metadata.xml
[INFO] Uploaded: https://repository.apache.org/content/repositories/snapshots/org/apache/jena/jena-text/3.6.0-SNAPSHOT/maven-metadata.xml
(1.2 kB at 1.1 kB/s)
[INFO] Uploading: https://repository.apache.org/content/repositories/snapshots/org/apache/jena/jena-text/3.6.0-SNAPSHOT/maven-metadata.xml
[INFO] Uploaded: https://repository.apache.org/content/repositories/snapshots/org/apache/jena/jena-text/3.6.0-SNAPSHOT/maven-metadata.xml
(1.2 kB at 1.1 kB/s)
[INFO] Uploading: https://repository.apache.org/content/repositories/snapshots/org/apache/jena/jena-text/maven-metadata.xml
[INFO] Uploaded: https://repository.apache.org/content/repositories/snapshots/org/apache/jena/jena-text/maven-metadata.xml
(424 B at 390 B/s)
[JENKINS] Archiving disabled
[INFO] 
[INFO] ------------------------------------------------------------------------
[INFO] Building Apache Jena - SPARQL Text Search - Elasticsearch 3.6.0-SNAPSHOT
[INFO] ------------------------------------------------------------------------
[INFO] 
[INFO] --- maven-clean-plugin:3.0.0:clean (default-clean) @ jena-text-es ---
[INFO] Deleting <https://builds.apache.org/job/Jena_Development_Deploy/ws/jena-text-es/target>
[INFO] 
[INFO] --- maven-enforcer-plugin:1.4.1:enforce (enforce) @ jena-text-es ---
[INFO] 
[INFO] --- apache-rat-plugin:0.12:check (rat-checks) @ jena-text-es ---
[INFO] Enabled default license matchers.
[INFO] Will parse SCM ignores for exclusions...
[INFO] Parsing exclusions from <https://builds.apache.org/job/Jena_Development_Deploy/ws/jena-text-es/.gitignore>
[INFO] Finished adding exclusions from SCM ignore files.
[INFO] 61 implicit excludes (use -debug for more details).
[INFO] Exclude: **/hs_err_pid*.log
[INFO] Exclude: **/.project
[INFO] Exclude: **/.settings/**
[INFO] Exclude: **/.classpath
[INFO] Exclude: **/README.*
[INFO] Exclude: **/META-INF/services/*
[INFO] Exclude: **/src-examples/data/*
[INFO] Exclude: **/dist/ABOUT
[INFO] Exclude: **/SEE_FUSEKI2
[INFO] Exclude: **/src/main/webapp/css/*
[INFO] Exclude: **/src/main/webapp/fonts/*
[INFO] Exclude: **/src/main/webapp/js/**/*
[INFO] Exclude: **/vocabularies/*
[INFO] Exclude: **/Vocabularies/*
[INFO] Exclude: **/src/main/**/*.html
[INFO] Exclude: **/src/**/package-info.java
[INFO] Exclude: **/DEPENDENCIES
[INFO] Exclude: **/*.txt
[INFO] Exclude: **/*.md
[INFO] Exclude: **/META-INF/services/*
[INFO] Exclude: **/src/test/resources/**/*
[INFO] Exclude: **/testing/**/*
[INFO] Exclude: **/log4j.properties
[INFO] Exclude: **/log4j-testing.properties
[INFO] Exclude: **/derby.log
[INFO] Exclude: **/DB/**/*
[INFO] Exclude: **/tdb*.cfg
[INFO] Exclude: **/run/**/*
[INFO] Exclude: **/*.classpath
[INFO] Exclude: **/target/**/*
[INFO] Exclude: **/dependency-reduced-pom.xml
[INFO] 20 resources included (use -debug for more details)
[INFO] Rat check: Summary over all files. Unapproved: 0, unknown: 0, generated: 0, approved:
16 licenses.
[INFO] 
[INFO] --- maven-remote-resources-plugin:1.5:process (process-resource-bundles) @ jena-text-es
---
[INFO] 
[INFO] --- maven-resources-plugin:2.7:resources (default-resources) @ jena-text-es ---
[INFO] Using 'UTF-8' encoding to copy filtered resources.
[INFO] Copying 4 resources
[INFO] Copying 3 resources
[INFO] 
[INFO] --- maven-compiler-plugin:3.5.1:compile (default-compile) @ jena-text-es ---
[INFO] Changes detected - recompiling the module!
[INFO] Compiling 9 source files to <https://builds.apache.org/job/Jena_Development_Deploy/ws/jena-text-es/target/classes>
[INFO] 
[INFO] --- maven-resources-plugin:2.7:testResources (default-testResources) @ jena-text-es
---
[INFO] Using 'UTF-8' encoding to copy filtered resources.
[INFO] Copying 1 resource
[INFO] Copying 3 resources
[INFO] 
[INFO] --- maven-compiler-plugin:3.5.1:testCompile (default-testCompile) @ jena-text-es ---
[INFO] Changes detected - recompiling the module!
[INFO] Compiling 2 source files to <https://builds.apache.org/job/Jena_Development_Deploy/ws/jena-text-es/target/test-classes>
[INFO] 
[INFO] --- maven-surefire-plugin:2.19.1:test (default-test) @ jena-text-es ---
[INFO] Tests are skipped.
[INFO] 
[INFO] --- maven-surefire-plugin:2.19.1:test (unit-tests) @ jena-text-es ---
[JENKINS] Recording test results
[INFO] 
[INFO] --- maven-jar-plugin:3.0.0:jar (default-jar) @ jena-text-es ---
[INFO] Building jar: <https://builds.apache.org/job/Jena_Development_Deploy/ws/jena-text-es/target/jena-text-es-3.6.0-SNAPSHOT.jar>
[INFO] 
[INFO] --- maven-site-plugin:3.5.1:attach-descriptor (attach-descriptor) @ jena-text-es ---
[INFO] 
[INFO] --- maven-source-plugin:3.0.0:jar-no-fork (attach-sources) @ jena-text-es ---
[INFO] Building jar: <https://builds.apache.org/job/Jena_Development_Deploy/ws/jena-text-es/target/jena-text-es-3.6.0-SNAPSHOT-sources.jar>
[INFO] 
[INFO] --- maven-javadoc-plugin:2.10.3:jar (attach-javadocs) @ jena-text-es ---
[INFO] 
1 warning
[WARNING] Javadoc Warnings
[WARNING] javadoc: warning - Error fetching URL: http://jena.apache.org/documentation/javadoc/elephas/
[INFO] Building jar: <https://builds.apache.org/job/Jena_Development_Deploy/ws/jena-text-es/target/jena-text-es-3.6.0-SNAPSHOT-javadoc.jar>
[INFO] 
[INFO] --- elasticsearch-maven-plugin:5.2:runforked (start-elasticsearch) @ jena-text-es ---
[INFO] Using Elasticsearch [0] configuration: com.github.alexcojocaru.mojo.elasticsearch.v2.InstanceConfiguration@29a23a96[id=0,baseDir=<https://builds.apache.org/job/Jena_Development_Deploy/ws/jena-text-es/target/elasticsearch0,httpPort=9400,transportPort=9500,pathData=<null>,pathLogs=<null>]>
[INFO] Starting Elasticsearch [0] in directory '<https://builds.apache.org/job/Jena_Development_Deploy/ws/jena-text-es/target/elasticsearch0'>
with arguments './bin/elasticsearch -p pid -Ecluster.name=elasticsearch -Ehttp.port=9400 -Etransport.tcp.port=9500
-Eaction.auto_create_index=false -Ehttp.cors.enabled=true'
[JENKINS] Archiving disabled
[JENKINS] Archiving disabled
[JENKINS] Archiving disabled
[JENKINS] Archiving disabled
[JENKINS] Archiving disabled
[JENKINS] Archiving disabled
[JENKINS] Archiving disabled
[JENKINS] Archiving disabled
[JENKINS] Archiving disabled
[JENKINS] Archiving disabled
[JENKINS] Archiving disabled
[JENKINS] Archiving disabled
[JENKINS] Archiving disabled
[JENKINS] Archiving disabled
[JENKINS] Archiving disabled
[JENKINS] Archiving disabled
[JENKINS] Archiving disabled
[JENKINS] Archiving disabled
[JENKINS] Archiving disabled
[JENKINS] Archiving disabled
[JENKINS] Archiving disabled
[JENKINS] Archiving disabled
[JENKINS] Archiving disabled
[JENKINS] Archiving disabled
[JENKINS] Archiving disabled
[JENKINS] Archiving disabled
[JENKINS] Archiving disabled
[JENKINS] Archiving disabled
[JENKINS] Archiving disabled
[JENKINS] Archiving disabled
[JENKINS] Archiving disabled
[JENKINS] Archiving disabled
[JENKINS] Archiving disabled
[JENKINS] Archiving disabled
[JENKINS] Archiving disabled
[JENKINS] Archiving disabled
[JENKINS] Archiving disabled
[JENKINS] Archiving disabled
[JENKINS] Archiving disabled
[JENKINS] Archiving disabled
[JENKINS] Archiving disabled
[JENKINS] Archiving disabled
[JENKINS] Archiving disabled
[JENKINS] Archiving disabled
[JENKINS] Archiving disabled
[JENKINS] Archiving disabled
[JENKINS] Archiving disabled
[JENKINS] Archiving disabled
[JENKINS] Archiving disabled
[JENKINS] Archiving disabled
[JENKINS] Archiving disabled
[JENKINS] Archiving disabled
[INFO] ------------------------------------------------------------------------
[INFO] Reactor Summary:
[INFO] 
[INFO] Apache Jena - Project .............................. SUCCESS [ 12.466 s]
[INFO] Apache Jena - Shadowed external libraries .......... SUCCESS [ 15.987 s]
[INFO] Apache Jena - IRI .................................. SUCCESS [ 19.449 s]
[INFO] Apache Jena - Base Common Environment .............. SUCCESS [ 47.067 s]
[INFO] Apache Jena - Core ................................. SUCCESS [01:43 min]
[INFO] Apache Jena - ARQ (SPARQL 1.1 Query Engine) ........ SUCCESS [01:46 min]
[INFO] Apache Jena - RDF Connection ....................... SUCCESS [ 52.144 s]
[INFO] Apache Jena - TDB (Native Triple Store) ............ SUCCESS [01:12 min]
[INFO] Apache Jena - Database Operation Environment ....... SUCCESS [ 15.377 s]
[INFO] Apache Jena - DBOE Base ............................ SUCCESS [ 41.621 s]
[INFO] Apache Jena - DBOE Transactions .................... SUCCESS [ 41.805 s]
[INFO] Apache Jena - DBOE Indexes ......................... SUCCESS [ 35.147 s]
[INFO] Apache Jena - DBOE Index test suite ................ SUCCESS [ 35.811 s]
[INFO] Apache Jena - DBOE Transactional Datastructures .... SUCCESS [ 52.976 s]
[INFO] Apache Jena - TDB2 ................................. SUCCESS [ 59.085 s]
[INFO] Apache Jena - Libraries POM ........................ SUCCESS [  9.802 s]
[INFO] Apache Jena - Command line tools ................... SUCCESS [01:11 min]
[INFO] Apache Jena - SPARQL Text Search ................... SUCCESS [ 42.248 s]
[INFO] Apache Jena - SPARQL Text Search - Elasticsearch ... FAILURE [01:09 min]
[INFO] Apache Jena - SPARQL Spatial Search ................ SKIPPED
[INFO] Apache Jena - Fuseki - A SPARQL 1.1 Server ......... SKIPPED
[INFO] Apache Jena - Fuseki Server Engine ................. SKIPPED
[INFO] Apache Jena - Fuseki Embedded Server ............... SKIPPED
[INFO] Apache Jena - Fuseki WAR File ...................... SKIPPED
[INFO] Apache Jena - Fuseki Server Standalone Jar ......... SKIPPED
[INFO] Apache Jena - Fuseki Basic Server .................. SKIPPED
[INFO] Apache Jena - Fuseki Binary Distribution ........... SKIPPED
[INFO] Apache Jena - Integration Testing .................. SKIPPED
[INFO] Apache Jena - Distribution ......................... SKIPPED
[INFO] Apache Jena - Fuseki1 .............................. SKIPPED
[INFO] Apache Jena - Data Tables for RDF and SPARQL ....... SKIPPED
[INFO] Apache Jena - SDB (SQL based triple store) ......... SKIPPED
[INFO] Apache Jena - Maven Plugins, including schemagen ... SKIPPED
[INFO] Apache Jena - Security Permissions ................. SKIPPED
[INFO] Apache Jena - Extras ............................... SKIPPED
[INFO] Apache Jena - Extras - Query Builder ............... SKIPPED
[INFO] Apache Jena - JDBC Parent .......................... SKIPPED
[INFO] Apache Jena - JDBC Core API ........................ SKIPPED
[INFO] Apache Jena - JDBC Remote Endpoint Driver .......... SKIPPED
[INFO] Apache Jena - JDBC In-Memory Driver ................ SKIPPED
[INFO] Apache Jena - JDBC TDB Driver ...................... SKIPPED
[INFO] Apache Jena - JDBC Driver Bundle ................... SKIPPED
[INFO] Apache Jena - Elephas .............................. SKIPPED
[INFO] Apache Jena - Elephas - Common API ................. SKIPPED
[INFO] Apache Jena - Elephas - I/O ........................ SKIPPED
[INFO] Apache Jena - Elephas - Map/Reduce ................. SKIPPED
[INFO] Apache Jena - Elephas - Statistics Demo App ........ SKIPPED
[INFO] Apache Jena - OSGi ................................. SKIPPED
[INFO] Apache Jena - OSGi bundle .......................... SKIPPED
[INFO] Apache Jena - OSGi Karaf features .................. SKIPPED
[INFO] Apache Jena ........................................ SKIPPED
[INFO] ------------------------------------------------------------------------
[INFO] BUILD FAILURE
[INFO] ------------------------------------------------------------------------
[INFO] Total time: 16:20 min
[INFO] Finished at: 2017-11-04T10:10:27Z
[INFO] Final Memory: 129M/3675M
[INFO] ------------------------------------------------------------------------
[ERROR] Failed to execute goal com.github.alexcojocaru:elasticsearch-maven-plugin:5.2:runforked
(start-elasticsearch) on project jena-text-es: Condition returned by method "waitToStart"
in class com.github.alexcojocaru.mojo.elasticsearch.v2.client.Monitor was not fulfilled within
60 seconds. -> [Help 1]
[ERROR] 
[ERROR] To see the full stack trace of the errors, re-run Maven with the -e switch.
[ERROR] Re-run Maven using the -X switch to enable full debug logging.
[ERROR] 
[ERROR] For more information about the errors and possible solutions, please read the following
articles:
[ERROR] [Help 1] http://cwiki.apache.org/confluence/display/MAVEN/MojoExecutionException
[ERROR] 
[ERROR] After correcting the problems, you can resume the build with the command
[ERROR]   mvn <goals> -rf :jena-text-es
channel stopped
[INFO] Stopping the Elasticsearch process at application shutdown ...
[INFO] ... the Elasticsearch process has stopped. Exit code: 143
[INFO] Elasticsearch [0] stopped with exit code 143

Mime
View raw message