jena-commits mailing list archives

Site index · List index
Message view « Date » · « Thread »
Top « Date » · « Thread »
From Apache Jenkins Server <jenk...@builds.apache.org>
Subject Build failed in Jenkins: Jena_Development_Test #2488
Date Tue, 27 Sep 2016 20:57:32 GMT
See <https://builds.apache.org/job/Jena_Development_Test/2488/changes>

Changes:

[andy] JENA-1237: Capture transaction snapshot during begin.

[andy] Clean up.

[andy] JENA-1237: Tests (TDB and TIM)

[andy] JENA-1223: Transaction promotion for TIM

[andy] JENA-1223: Incorporate review suggestions

------------------------------------------
[...truncated 589 lines...]
[WARNING] <https://builds.apache.org/job/Jena_Development_Test/ws/jena-core/src/main/java/org/apache/jena/rdf/model/Property.java>:25:
warning - Tags @propertyGetter, @propertySetter and @propertyDescription can only be used
in JavaFX properties getters and setters.
[WARNING] <https://builds.apache.org/job/Jena_Development_Test/ws/jena-core/src/main/java/org/apache/jena/rdf/model/Property.java>:25:
warning - Tags @propertyGetter, @propertySetter and @propertyDescription can only be used
in JavaFX properties getters and setters.
[WARNING] <https://builds.apache.org/job/Jena_Development_Test/ws/jena-core/src/main/java/org/apache/jena/rdf/model/Property.java>:25:
warning - Tags @propertyGetter, @propertySetter and @propertyDescription can only be used
in JavaFX properties getters and setters.
[WARNING] <https://builds.apache.org/job/Jena_Development_Test/ws/jena-core/src/main/java/org/apache/jena/rdf/model/Property.java>:25:
warning - Tags @propertyGetter, @propertySetter and @propertyDescription can only be used
in JavaFX properties getters and setters.
[WARNING] <https://builds.apache.org/job/Jena_Development_Test/ws/jena-core/src/main/java/org/apache/jena/rdf/model/Property.java>:25:
warning - Tags @propertyGetter, @propertySetter and @propertyDescription can only be used
in JavaFX properties getters and setters.
[WARNING] <https://builds.apache.org/job/Jena_Development_Test/ws/jena-core/src/main/java/org/apache/jena/rdf/model/Property.java>:25:
warning - Tags @propertyGetter, @propertySetter and @propertyDescription can only be used
in JavaFX properties getters and setters.
[WARNING] <https://builds.apache.org/job/Jena_Development_Test/ws/jena-core/src/main/java/org/apache/jena/rdf/model/Property.java>:25:
warning - Tags @propertyGetter, @propertySetter and @propertyDescription can only be used
in JavaFX properties getters and setters.
[WARNING] <https://builds.apache.org/job/Jena_Development_Test/ws/jena-core/src/main/java/org/apache/jena/rdf/model/Property.java>:25:
warning - Tags @propertyGetter, @propertySetter and @propertyDescription can only be used
in JavaFX properties getters and setters.
[WARNING] <https://builds.apache.org/job/Jena_Development_Test/ws/jena-core/src/main/java/org/apache/jena/rdf/model/Property.java>:25:
warning - Tags @propertyGetter, @propertySetter and @propertyDescription can only be used
in JavaFX properties getters and setters.
[WARNING] <https://builds.apache.org/job/Jena_Development_Test/ws/jena-core/src/main/java/org/apache/jena/rdf/model/Property.java>:25:
warning - Tags @propertyGetter, @propertySetter and @propertyDescription can only be used
in JavaFX properties getters and setters.
[WARNING] <https://builds.apache.org/job/Jena_Development_Test/ws/jena-core/src/main/java/org/apache/jena/rdf/model/Property.java>:25:
warning - Tags @propertyGetter, @propertySetter and @propertyDescription can only be used
in JavaFX properties getters and setters.
[WARNING] <https://builds.apache.org/job/Jena_Development_Test/ws/jena-core/src/main/java/org/apache/jena/rdf/model/Property.java>:25:
warning - Tags @propertyGetter, @propertySetter and @propertyDescription can only be used
in JavaFX properties getters and setters.
[WARNING] <https://builds.apache.org/job/Jena_Development_Test/ws/jena-core/src/main/java/org/apache/jena/rdf/model/Property.java>:25:
warning - Tags @propertyGetter, @propertySetter and @propertyDescription can only be used
in JavaFX properties getters and setters.
[WARNING] <https://builds.apache.org/job/Jena_Development_Test/ws/jena-core/src/main/java/org/apache/jena/rdf/model/Property.java>:25:
warning - Tags @propertyGetter, @propertySetter and @propertyDescription can only be used
in JavaFX properties getters and setters.
[WARNING] <https://builds.apache.org/job/Jena_Development_Test/ws/jena-core/src/main/java/org/apache/jena/rdf/model/Property.java>:25:
warning - Tags @propertyGetter, @propertySetter and @propertyDescription can only be used
in JavaFX properties getters and setters.
[WARNING] <https://builds.apache.org/job/Jena_Development_Test/ws/jena-core/src/main/java/org/apache/jena/rdf/model/Property.java>:25:
warning - Tags @propertyGetter, @propertySetter and @propertyDescription can only be used
in JavaFX properties getters and setters.
[WARNING] <https://builds.apache.org/job/Jena_Development_Test/ws/jena-core/src/main/java/org/apache/jena/rdf/model/Property.java>:25:
warning - Tags @propertyGetter, @propertySetter and @propertyDescription can only be used
in JavaFX properties getters and setters.
[WARNING] <https://builds.apache.org/job/Jena_Development_Test/ws/jena-core/src/main/java/org/apache/jena/rdf/model/Property.java>:25:
warning - Tags @propertyGetter, @propertySetter and @propertyDescription can only be used
in JavaFX properties getters and setters.
[WARNING] <https://builds.apache.org/job/Jena_Development_Test/ws/jena-core/src/main/java/org/apache/jena/rdf/model/Property.java>:25:
warning - Tags @propertyGetter, @propertySetter and @propertyDescription can only be used
in JavaFX properties getters and setters.
[WARNING] <https://builds.apache.org/job/Jena_Development_Test/ws/jena-core/src/main/java/org/apache/jena/rdf/model/Property.java>:25:
warning - Tags @propertyGetter, @propertySetter and @propertyDescription can only be used
in JavaFX properties getters and setters.
[WARNING] <https://builds.apache.org/job/Jena_Development_Test/ws/jena-core/src/main/java/org/apache/jena/rdf/model/Property.java>:25:
warning - Tags @propertyGetter, @propertySetter and @propertyDescription can only be used
in JavaFX properties getters and setters.
[WARNING] <https://builds.apache.org/job/Jena_Development_Test/ws/jena-core/src/main/java/org/apache/jena/rdf/model/Property.java>:25:
warning - Tags @propertyGetter, @propertySetter and @propertyDescription can only be used
in JavaFX properties getters and setters.
[WARNING] <https://builds.apache.org/job/Jena_Development_Test/ws/jena-core/src/main/java/org/apache/jena/rdf/model/Property.java>:25:
warning - Tags @propertyGetter, @propertySetter and @propertyDescription can only be used
in JavaFX properties getters and setters.
[WARNING] <https://builds.apache.org/job/Jena_Development_Test/ws/jena-core/src/main/java/org/apache/jena/rdf/model/Property.java>:25:
warning - Tags @propertyGetter, @propertySetter and @propertyDescription can only be used
in JavaFX properties getters and setters.
[WARNING] <https://builds.apache.org/job/Jena_Development_Test/ws/jena-core/src/main/java/org/apache/jena/rdf/model/Property.java>:25:
warning - Tags @propertyGetter, @propertySetter and @propertyDescription can only be used
in JavaFX properties getters and setters.
[WARNING] <https://builds.apache.org/job/Jena_Development_Test/ws/jena-core/src/main/java/org/apache/jena/rdf/model/Property.java>:25:
warning - Tags @propertyGetter, @propertySetter and @propertyDescription can only be used
in JavaFX properties getters and setters.
[WARNING] <https://builds.apache.org/job/Jena_Development_Test/ws/jena-core/src/main/java/org/apache/jena/rdf/model/Property.java>:25:
warning - Tags @propertyGetter, @propertySetter and @propertyDescription can only be used
in JavaFX properties getters and setters.
[WARNING] <https://builds.apache.org/job/Jena_Development_Test/ws/jena-core/src/main/java/org/apache/jena/rdf/model/Property.java>:25:
warning - Tags @propertyGetter, @propertySetter and @propertyDescription can only be used
in JavaFX properties getters and setters.
[WARNING] <https://builds.apache.org/job/Jena_Development_Test/ws/jena-core/src/main/java/org/apache/jena/rdf/model/Property.java>:25:
warning - Tags @propertyGetter, @propertySetter and @propertyDescription can only be used
in JavaFX properties getters and setters.
[WARNING] <https://builds.apache.org/job/Jena_Development_Test/ws/jena-core/src/main/java/org/apache/jena/rdf/model/Property.java>:25:
warning - Tags @propertyGetter, @propertySetter and @propertyDescription can only be used
in JavaFX properties getters and setters.
[WARNING] <https://builds.apache.org/job/Jena_Development_Test/ws/jena-core/src/main/java/org/apache/jena/rdf/model/Property.java>:25:
warning - Tags @propertyGetter, @propertySetter and @propertyDescription can only be used
in JavaFX properties getters and setters.
[WARNING] <https://builds.apache.org/job/Jena_Development_Test/ws/jena-core/src/main/java/org/apache/jena/rdf/model/Property.java>:25:
warning - Tags @propertyGetter, @propertySetter and @propertyDescription can only be used
in JavaFX properties getters and setters.
[WARNING] <https://builds.apache.org/job/Jena_Development_Test/ws/jena-core/src/main/java/org/apache/jena/rdf/model/Property.java>:25:
warning - Tags @propertyGetter, @propertySetter and @propertyDescription can only be used
in JavaFX properties getters and setters.
[WARNING] <https://builds.apache.org/job/Jena_Development_Test/ws/jena-core/src/main/java/org/apache/jena/ontology/OntProperty.java>:483:
warning - @propertyDescription is an unknown tag.
[WARNING] <https://builds.apache.org/job/Jena_Development_Test/ws/jena-core/src/main/java/org/apache/jena/ontology/OntProperty.java>:490:
warning - @propertyDescription is an unknown tag.
[WARNING] <https://builds.apache.org/job/Jena_Development_Test/ws/jena-core/src/main/java/org/apache/jena/ontology/OntProperty.java>:497:
warning - @propertyDescription is an unknown tag.
[WARNING] <https://builds.apache.org/job/Jena_Development_Test/ws/jena-core/src/main/java/org/apache/jena/ontology/OntProperty.java>:503:
warning - @propertyDescription is an unknown tag.
[WARNING] <https://builds.apache.org/job/Jena_Development_Test/ws/jena-core/src/main/java/org/apache/jena/ontology/OntProperty.java>:509:
warning - @propertyDescription is an unknown tag.
[WARNING] <https://builds.apache.org/job/Jena_Development_Test/ws/jena-core/src/main/java/org/apache/jena/ontology/OntProperty.java>:515:
warning - @propertyDescription is an unknown tag.
[WARNING] <https://builds.apache.org/job/Jena_Development_Test/ws/jena-core/src/main/java/org/apache/jena/ontology/OntProperty.java>:483:
warning - Tags @propertyGetter, @propertySetter and @propertyDescription can only be used
in JavaFX properties getters and setters.
[WARNING] <https://builds.apache.org/job/Jena_Development_Test/ws/jena-core/src/main/java/org/apache/jena/ontology/OntProperty.java>:490:
warning - Tags @propertyGetter, @propertySetter and @propertyDescription can only be used
in JavaFX properties getters and setters.
[WARNING] <https://builds.apache.org/job/Jena_Development_Test/ws/jena-core/src/main/java/org/apache/jena/ontology/OntProperty.java>:497:
warning - Tags @propertyGetter, @propertySetter and @propertyDescription can only be used
in JavaFX properties getters and setters.
[WARNING] <https://builds.apache.org/job/Jena_Development_Test/ws/jena-core/src/main/java/org/apache/jena/ontology/OntProperty.java>:503:
warning - Tags @propertyGetter, @propertySetter and @propertyDescription can only be used
in JavaFX properties getters and setters.
[WARNING] <https://builds.apache.org/job/Jena_Development_Test/ws/jena-core/src/main/java/org/apache/jena/ontology/OntProperty.java>:509:
warning - Tags @propertyGetter, @propertySetter and @propertyDescription can only be used
in JavaFX properties getters and setters.
[WARNING] <https://builds.apache.org/job/Jena_Development_Test/ws/jena-core/src/main/java/org/apache/jena/ontology/OntProperty.java>:515:
warning - Tags @propertyGetter, @propertySetter and @propertyDescription can only be used
in JavaFX properties getters and setters.
[INFO] Building jar: <https://builds.apache.org/job/Jena_Development_Test/ws/jena-core/target/jena-core-3.1.1-SNAPSHOT-javadoc.jar>
[INFO] 
[INFO] --- maven-jar-plugin:3.0.0:test-jar (default) @ jena-core ---
[INFO] Building jar: <https://builds.apache.org/job/Jena_Development_Test/ws/jena-core/target/jena-core-3.1.1-SNAPSHOT-tests.jar>
[JENKINS] Archiving disabled
[INFO]                                                                         
[INFO] ------------------------------------------------------------------------
[INFO] Building Apache Jena - ARQ (SPARQL 1.1 Query Engine) 3.1.1-SNAPSHOT
[INFO] ------------------------------------------------------------------------
[INFO] 
[INFO] --- maven-clean-plugin:3.0.0:clean (default-clean) @ jena-arq ---
[INFO] Deleting <https://builds.apache.org/job/Jena_Development_Test/ws/jena-arq/target>
[INFO] 
[INFO] --- maven-enforcer-plugin:1.4.1:enforce (enforce) @ jena-arq ---
[INFO] 
[INFO] --- apache-rat-plugin:0.11:check (rat-checks) @ jena-arq ---
[INFO] 51 implicit excludes (use -debug for more details).
[INFO] Exclude: **/.project
[INFO] Exclude: **/.settings/**
[INFO] Exclude: **/.classpath
[INFO] Exclude: **/META-INF/services/*
[INFO] Exclude: **/src-examples/data/*
[INFO] Exclude: **/dist/ABOUT
[INFO] Exclude: **/SEE_FUSEKI2
[INFO] Exclude: **/src/main/webapp/css/*
[INFO] Exclude: **/src/main/webapp/fonts/*
[INFO] Exclude: **/src/main/webapp/js/**/*
[INFO] Exclude: **/vocabularies/*
[INFO] Exclude: **/Vocabularies/*
[INFO] Exclude: **/src/main/**/*.html
[INFO] Exclude: **/src/**/package-info.java
[INFO] Exclude: **/DEPENDENCIES
[INFO] Exclude: **/*.txt
[INFO] Exclude: **/*.md
[INFO] Exclude: **/META-INF/services/*
[INFO] Exclude: **/src/test/resources/**/*
[INFO] Exclude: **/testing/**/*
[INFO] Exclude: **/log4j.properties
[INFO] Exclude: **/log4j-testing.properties
[INFO] Exclude: **/derby.log
[INFO] Exclude: **/DB/**/*
[INFO] Exclude: **/tdb*.cfg
[INFO] Exclude: **/run/**/*
[INFO] Exclude: **/*.classpath
[INFO] Exclude: **/target/**/*
[INFO] Exclude: **/dependency-reduced-pom.xml
[INFO] 1801 resources included (use -debug for more details)
[INFO] Rat check: Summary of files. Unapproved: 0 unknown: 0 generated: 0 approved: 1746 licence.
[INFO] 
[INFO] --- maven-remote-resources-plugin:1.5:process (process-resource-bundles) @ jena-arq
---
[INFO] 
[INFO] --- maven-resources-plugin:2.7:resources (default-resources) @ jena-arq ---
[INFO] Using 'UTF-8' encoding to copy filtered resources.
[INFO] Copying 1 resource
[INFO] Copying 4 resources
[INFO] Copying 3 resources
[INFO] 
[INFO] --- maven-compiler-plugin:3.5.1:compile (default-compile) @ jena-arq ---
[INFO] Changes detected - recompiling the module!
[INFO] Compiling 1399 source files to <https://builds.apache.org/job/Jena_Development_Test/ws/jena-arq/target/classes>
[INFO] <https://builds.apache.org/job/Jena_Development_Test/ws/jena-arq/src/main/java/org/apache/jena/atlas/web/auth/HttpAuthenticator.java>:
Some input files use or override a deprecated API.
[INFO] <https://builds.apache.org/job/Jena_Development_Test/ws/jena-arq/src/main/java/org/apache/jena/atlas/web/auth/HttpAuthenticator.java>:
Recompile with -Xlint:deprecation for details.
[INFO] <https://builds.apache.org/job/Jena_Development_Test/ws/jena-arq/src/main/java/org/apache/jena/riot/thrift/wire/RDF_UNDEF.java>:
Some input files use unchecked or unsafe operations.
[INFO] <https://builds.apache.org/job/Jena_Development_Test/ws/jena-arq/src/main/java/org/apache/jena/riot/thrift/wire/RDF_UNDEF.java>:
Recompile with -Xlint:unchecked for details.
[INFO] 
[INFO] --- maven-resources-plugin:2.7:testResources (default-testResources) @ jena-arq ---
[INFO] Using 'UTF-8' encoding to copy filtered resources.
[INFO] Copying 3 resources
[INFO] Copying 3 resources
[INFO] 
[INFO] --- maven-compiler-plugin:3.5.1:testCompile (default-testCompile) @ jena-arq ---
[INFO] Changes detected - recompiling the module!
[INFO] Compiling 328 source files to <https://builds.apache.org/job/Jena_Development_Test/ws/jena-arq/target/test-classes>
[INFO] <https://builds.apache.org/job/Jena_Development_Test/ws/jena-arq/src/test/java/org/apache/jena/sparql/graph/TestGraphUnionRead.java>:
<https://builds.apache.org/job/Jena_Development_Test/ws/jena-arq/src/test/java/org/apache/jena/sparql/graph/TestGraphUnionRead.java>
uses unchecked or unsafe operations.
[INFO] <https://builds.apache.org/job/Jena_Development_Test/ws/jena-arq/src/test/java/org/apache/jena/sparql/graph/TestGraphUnionRead.java>:
Recompile with -Xlint:unchecked for details.
[INFO] 
[INFO] --- maven-surefire-plugin:2.19.1:test (default-test) @ jena-arq ---

-------------------------------------------------------
 T E S T S
-------------------------------------------------------
Running org.apache.jena.riot.thrift.TS_RDFThrift
Tests run: 42, Failures: 0, Errors: 0, Skipped: 0, Time elapsed: 1.862 sec - in org.apache.jena.riot.thrift.TS_RDFThrift
Running org.apache.jena.riot.writer.TS_RiotWriter
Tests run: 695, Failures: 0, Errors: 0, Skipped: 0, Time elapsed: 58.16 sec - in org.apache.jena.riot.writer.TS_RiotWriter
Running org.apache.jena.riot.lang.TS_Lang
Tests run: 458, Failures: 0, Errors: 0, Skipped: 0, Time elapsed: 6.931 sec - in org.apache.jena.riot.lang.TS_Lang
Running org.apache.jena.riot.system.TS_RiotSystem
Tests run: 296, Failures: 0, Errors: 0, Skipped: 0, Time elapsed: 0.163 sec - in org.apache.jena.riot.system.TS_RiotSystem
Running org.apache.jena.riot.stream.TS_IO2
Tests run: 42, Failures: 0, Errors: 0, Skipped: 0, Time elapsed: 0.078 sec - in org.apache.jena.riot.stream.TS_IO2
Running org.apache.jena.riot.out.TS_Out
Tests run: 128, Failures: 0, Errors: 0, Skipped: 0, Time elapsed: 0.08 sec - in org.apache.jena.riot.out.TS_Out
Running org.apache.jena.riot.tokens.TS_Tokens
Tests run: 144, Failures: 0, Errors: 0, Skipped: 0, Time elapsed: 0.061 sec - in org.apache.jena.riot.tokens.TS_Tokens
Running org.apache.jena.riot.TS_LangSuite

Results :

Tests run: 1805, Failures: 0, Errors: 0, Skipped: 0

[JENKINS] Recording test results
[JENKINS] Archiving disabled
[JENKINS] Archiving disabled
[JENKINS] Archiving disabled
[JENKINS] Archiving disabled
[JENKINS] Archiving disabled
[JENKINS] Archiving disabled
[JENKINS] Archiving disabled
[JENKINS] Archiving disabled
[JENKINS] Archiving disabled
[JENKINS] Archiving disabled
[JENKINS] Archiving disabled
[JENKINS] Archiving disabled
[JENKINS] Archiving disabled
[JENKINS] Archiving disabled
[JENKINS] Archiving disabled
[JENKINS] Archiving disabled
[JENKINS] Archiving disabled
[JENKINS] Archiving disabled
[JENKINS] Archiving disabled
[JENKINS] Archiving disabled
[JENKINS] Archiving disabled
[JENKINS] Archiving disabled
[JENKINS] Archiving disabled
[JENKINS] Archiving disabled
[JENKINS] Archiving disabled
[JENKINS] Archiving disabled
[JENKINS] Archiving disabled
[JENKINS] Archiving disabled
[JENKINS] Archiving disabled
[JENKINS] Archiving disabled
[JENKINS] Archiving disabled
[JENKINS] Archiving disabled
[JENKINS] Archiving disabled
[JENKINS] Archiving disabled
[JENKINS] Archiving disabled
[JENKINS] Archiving disabled
[JENKINS] Archiving disabled
[JENKINS] Archiving disabled
[JENKINS] Archiving disabled
[JENKINS] Archiving disabled[INFO] ------------------------------------------------------------------------
[INFO] Reactor Summary:
[INFO] 
[INFO] Apache Jena - Parent ............................... SUCCESS [  8.978 s]
[INFO] Apache Jena - Shadowed external libraries .......... SUCCESS [  8.278 s]
[INFO] Apache Jena - IRI .................................. SUCCESS [ 18.684 s]
[INFO] Apache Jena - Base Common Environment .............. SUCCESS [ 52.972 s]
[INFO] Apache Jena - Core ................................. SUCCESS [02:25 min]
[INFO] Apache Jena - ARQ (SPARQL 1.1 Query Engine) ........ FAILURE [02:59 min]
[INFO] Apache Jena - TDB (Native Triple Store) ............ SKIPPED
[INFO] Apache Jena - Libraries POM ........................ SKIPPED
[INFO] Apache Jena - Command line tools ................... SKIPPED
[INFO] Apache Jena - SPARQL Text Search ................... SKIPPED
[INFO] Apache Jena - SPARQL Spatial Search ................ SKIPPED
[INFO] Apache Jena - Data Tables for RDF and SPARQL ....... SKIPPED
[INFO] Apache Jena - SDB (SQL based triple store) ......... SKIPPED
[INFO] Apache Jena - Fuseki1 .............................. SKIPPED
[INFO] Apache Jena - Fuseki - A SPARQL 1.1 Server ......... SKIPPED
[INFO] Apache Jena - Fuseki Server Engine ................. SKIPPED
[INFO] Apache Jena - Fuseki Embedded Server ............... SKIPPED
[INFO] Apache Jena - Fuseki WAR File ...................... SKIPPED
[INFO] Apache Jena - Fuseki Server Standalone Jar ......... SKIPPED
[INFO] Apache Jena - Fuseki Binary Distribution ........... SKIPPED
[INFO] Apache Jena - Security Permissions ................. SKIPPED
[INFO] Apache Jena - JDBC Parent .......................... SKIPPED
[INFO] Apache Jena - JDBC Core API ........................ SKIPPED
[INFO] Apache Jena - JDBC Remote Endpoint Driver .......... SKIPPED
[INFO] Apache Jena - JDBC In-Memory Driver ................ SKIPPED
[INFO] Apache Jena - JDBC TDB Driver ...................... SKIPPED
[INFO] Apache Jena - JDBC Driver Bundle ................... SKIPPED
[INFO] Apache Jena - Elephas .............................. SKIPPED
[INFO] Apache Jena - Elephas - Common API ................. SKIPPED
[INFO] Apache Jena - Elephas - I/O ........................ SKIPPED
[INFO] Apache Jena - Elephas - Map/Reduce ................. SKIPPED
[INFO] Apache Jena - Elephas - Statistics Demo App ........ SKIPPED
[INFO] Apache Jena - Distribution ......................... SKIPPED
[INFO] Apache Jena - OSGi ................................. SKIPPED
[INFO] Apache Jena - OSGi bundle .......................... SKIPPED
[INFO] Apache Jena - OSGi Karaf features .................. SKIPPED
[INFO] Apache Jena - Extras ............................... SKIPPED
[INFO] Apache Jena - Extras - Query Builder ............... SKIPPED
[INFO] Apache Jena ........................................ SKIPPED
[INFO] ------------------------------------------------------------------------
[INFO] BUILD FAILURE
[INFO] ------------------------------------------------------------------------
[INFO] Total time: 07:09 min
[INFO] Finished at: 2016-09-27T20:55:31+00:00

[INFO] Final Memory: 89M/2532M
[INFO] ------------------------------------------------------------------------
[ERROR] Failed to execute goal org.apache.maven.plugins:maven-surefire-plugin:2.19.1:test
(default-test) on project jena-arq: Execution default-test of goal org.apache.maven.plugins:maven-surefire-plugin:2.19.1:test
failed: The forked VM terminated without properly saying goodbye. VM crash or System.exit
called?
[ERROR] Command was /bin/sh -c cd <https://builds.apache.org/job/Jena_Development_Test/ws/jena-arq>
&& /usr/local/asfpackages/java/jdk1.8.0_102/jre/bin/java -jar <https://builds.apache.org/job/Jena_Development_Test/ws/jena-arq/target/surefire/surefirebooter2125194777059851352.jar>
<https://builds.apache.org/job/Jena_Development_Test/ws/jena-arq/target/surefire/surefire6156302774815797953tmp>
<https://builds.apache.org/job/Jena_Development_Test/ws/jena-arq/target/surefire/surefire_25575527087293480466tmp>
[ERROR] -> [Help 1]
[ERROR] 
[ERROR] To see the full stack trace of the errors, re-run Maven with the -e switch.
[ERROR] Re-run Maven using the -X switch to enable full debug logging.
[ERROR] 
[ERROR] For more information about the errors and possible solutions, please read the following
articles:
[ERROR] [Help 1] http://cwiki.apache.org/confluence/display/MAVEN/PluginExecutionException
[ERROR] 
[ERROR] After correcting the problems, you can resume the build with the command
[ERROR]   mvn <goals> -rf :jena-arq
channel stopped

Mime
View raw message