jena-commits mailing list archives

Site index · List index
Message view « Date » · « Thread »
Top « Date » · « Thread »
From Apache Jenkins Server <jenk...@builds.apache.org>
Subject Build failed in Jenkins: Jena_Development_Test #2426
Date Thu, 14 Jul 2016 23:47:39 GMT
See <https://builds.apache.org/job/Jena_Development_Test/2426/changes>

Changes:

[andy] JENA-508: Notes on implementation status.

[andy] Reorder methods to logical order (minor).

[andy] Too much white.

[andy] Deprecate

------------------------------------------
[...truncated 3419 lines...]
Running org.apache.jena.hadoop.rdf.io.output.jsonld.JsonLdQuadOutputTest
Tests run: 4, Failures: 0, Errors: 0, Skipped: 0, Time elapsed: 5.473 sec - in org.apache.jena.hadoop.rdf.io.output.jsonld.JsonLdQuadOutputTest

Results :

Tests run: 984, Failures: 0, Errors: 0, Skipped: 183

[JENKINS] Recording test results
[INFO] 
[INFO] --- maven-jar-plugin:3.0.0:jar (default-jar) @ jena-elephas-io ---
[INFO] Building jar: <https://builds.apache.org/job/Jena_Development_Test/ws/jena-elephas/jena-elephas-io/target/jena-elephas-io-3.1.1-SNAPSHOT.jar>
[INFO] 
[INFO] --- maven-site-plugin:3.5.1:attach-descriptor (attach-descriptor) @ jena-elephas-io
---
[INFO] 
[INFO] --- maven-javadoc-plugin:2.10.3:jar (attach-javadocs) @ jena-elephas-io ---
[INFO] Building jar: <https://builds.apache.org/job/Jena_Development_Test/ws/jena-elephas/jena-elephas-io/target/jena-elephas-io-3.1.1-SNAPSHOT-javadoc.jar>
[JENKINS] Archiving disabled
[INFO]                                                                         
[INFO] ------------------------------------------------------------------------
[INFO] Building Apache Jena - Elephas - Map/Reduce 3.1.1-SNAPSHOT
[INFO] ------------------------------------------------------------------------
[INFO] 
[INFO] --- maven-clean-plugin:3.0.0:clean (default-clean) @ jena-elephas-mapreduce ---
[INFO] Deleting <https://builds.apache.org/job/Jena_Development_Test/ws/jena-elephas/jena-elephas-mapreduce/target>
[INFO] 
[INFO] --- maven-enforcer-plugin:1.4.1:enforce (enforce) @ jena-elephas-mapreduce ---
[INFO] 
[INFO] --- apache-rat-plugin:0.11:check (rat-checks) @ jena-elephas-mapreduce ---
[INFO] 51 implicit excludes (use -debug for more details).
[INFO] Exclude: **/.project
[INFO] Exclude: **/.settings/**
[INFO] Exclude: **/.classpath
[INFO] Exclude: **/META-INF/services/*
[INFO] Exclude: **/src-examples/data/*
[INFO] Exclude: **/dist/ABOUT
[INFO] Exclude: **/SEE_FUSEKI2
[INFO] Exclude: **/src/main/webapp/css/*
[INFO] Exclude: **/src/main/webapp/fonts/*
[INFO] Exclude: **/src/main/webapp/js/**/*
[INFO] Exclude: **/vocabularies/*
[INFO] Exclude: **/Vocabularies/*
[INFO] Exclude: **/src/main/**/*.html
[INFO] Exclude: **/src/**/package-info.java
[INFO] Exclude: **/DEPENDENCIES
[INFO] Exclude: **/*.txt
[INFO] Exclude: **/*.md
[INFO] Exclude: **/META-INF/services/*
[INFO] Exclude: **/src/test/resources/**/*
[INFO] Exclude: **/testing/**/*
[INFO] Exclude: **/log4j.properties
[INFO] Exclude: **/log4j-testing.properties
[INFO] Exclude: **/derby.log
[INFO] Exclude: **/DB/**/*
[INFO] Exclude: **/tdb*.cfg
[INFO] Exclude: **/run/**/*
[INFO] Exclude: **/*.classpath
[INFO] Exclude: **/target/**/*
[INFO] Exclude: **/dependency-reduced-pom.xml
[INFO] 115 resources included (use -debug for more details)
[INFO] Rat check: Summary of files. Unapproved: 0 unknown: 0 generated: 0 approved: 115 licence.
[INFO] 
[INFO] --- maven-remote-resources-plugin:1.5:process (process-resource-bundles) @ jena-elephas-mapreduce
---
[INFO] 
[INFO] --- maven-resources-plugin:2.7:resources (default-resources) @ jena-elephas-mapreduce
---
[INFO] Using 'UTF-8' encoding to copy filtered resources.
[INFO] skip non existing resourceDirectory <https://builds.apache.org/job/Jena_Development_Test/ws/jena-elephas/jena-elephas-mapreduce/src/main/resources>
[INFO] Copying 3 resources
[INFO] 
[INFO] --- maven-compiler-plugin:3.5.1:compile (default-compile) @ jena-elephas-mapreduce
---
[INFO] Changes detected - recompiling the module!
[INFO] Compiling 70 source files to <https://builds.apache.org/job/Jena_Development_Test/ws/jena-elephas/jena-elephas-mapreduce/target/classes>
[INFO] 
[INFO] --- maven-resources-plugin:2.7:testResources (default-testResources) @ jena-elephas-mapreduce
---
[INFO] Using 'UTF-8' encoding to copy filtered resources.
[INFO] Copying 1 resource
[INFO] Copying 3 resources
[INFO] 
[INFO] --- maven-compiler-plugin:3.5.1:testCompile (default-testCompile) @ jena-elephas-mapreduce
---
[INFO] Changes detected - recompiling the module!
[INFO] Compiling 44 source files to <https://builds.apache.org/job/Jena_Development_Test/ws/jena-elephas/jena-elephas-mapreduce/target/test-classes>
[INFO] <https://builds.apache.org/job/Jena_Development_Test/ws/jena-elephas/jena-elephas-mapreduce/src/test/java/org/apache/jena/hadoop/rdf/mapreduce/filter/AbstractTripleValidityFilterTests.java>:
Some input files use or override a deprecated API.
[INFO] <https://builds.apache.org/job/Jena_Development_Test/ws/jena-elephas/jena-elephas-mapreduce/src/test/java/org/apache/jena/hadoop/rdf/mapreduce/filter/AbstractTripleValidityFilterTests.java>:
Recompile with -Xlint:deprecation for details.
[INFO] 
[INFO] --- maven-surefire-plugin:2.19.1:test (default-test) @ jena-elephas-mapreduce ---

-------------------------------------------------------
 T E S T S
-------------------------------------------------------
Running org.apache.jena.hadoop.rdf.mapreduce.group.TripleGroupBySubjectMapperTest
Tests run: 4, Failures: 0, Errors: 0, Skipped: 0, Time elapsed: 4.686 sec - in org.apache.jena.hadoop.rdf.mapreduce.group.TripleGroupBySubjectMapperTest
Running org.apache.jena.hadoop.rdf.mapreduce.group.QuadGroupByGraphMapperTest
Tests run: 4, Failures: 0, Errors: 0, Skipped: 0, Time elapsed: 0.819 sec - in org.apache.jena.hadoop.rdf.mapreduce.group.QuadGroupByGraphMapperTest
Running org.apache.jena.hadoop.rdf.mapreduce.group.QuadGroupByObjectMapperTest
Tests run: 4, Failures: 0, Errors: 0, Skipped: 0, Time elapsed: 0.873 sec - in org.apache.jena.hadoop.rdf.mapreduce.group.QuadGroupByObjectMapperTest
Running org.apache.jena.hadoop.rdf.mapreduce.group.TripleGroupByObjectMapperTest
Tests run: 4, Failures: 0, Errors: 0, Skipped: 0, Time elapsed: 0.799 sec - in org.apache.jena.hadoop.rdf.mapreduce.group.TripleGroupByObjectMapperTest
Running org.apache.jena.hadoop.rdf.mapreduce.group.QuadGroupByPredicateMapperTest
Tests run: 4, Failures: 0, Errors: 0, Skipped: 0, Time elapsed: 0.457 sec - in org.apache.jena.hadoop.rdf.mapreduce.group.QuadGroupByPredicateMapperTest
Running org.apache.jena.hadoop.rdf.mapreduce.group.TripleGroupByPredicateMapperTest
Tests run: 4, Failures: 0, Errors: 0, Skipped: 0, Time elapsed: 0.288 sec - in org.apache.jena.hadoop.rdf.mapreduce.group.TripleGroupByPredicateMapperTest
Running org.apache.jena.hadoop.rdf.mapreduce.group.QuadGroupBySubjectMapperTest
Tests run: 4, Failures: 0, Errors: 0, Skipped: 0, Time elapsed: 0.339 sec - in org.apache.jena.hadoop.rdf.mapreduce.group.QuadGroupBySubjectMapperTest
Running org.apache.jena.hadoop.rdf.mapreduce.split.QuadSplitWithNodesMapperTest
Tests run: 4, Failures: 0, Errors: 0, Skipped: 0, Time elapsed: 2.333 sec - in org.apache.jena.hadoop.rdf.mapreduce.split.QuadSplitWithNodesMapperTest
Running org.apache.jena.hadoop.rdf.mapreduce.split.TripleSplitWithNodesMapperTest
Tests run: 4, Failures: 0, Errors: 0, Skipped: 0, Time elapsed: 0.8 sec - in org.apache.jena.hadoop.rdf.mapreduce.split.TripleSplitWithNodesMapperTest
Running org.apache.jena.hadoop.rdf.mapreduce.split.QuadSplitToNodesMapperTest
Tests run: 4, Failures: 0, Errors: 0, Skipped: 0, Time elapsed: 0.456 sec - in org.apache.jena.hadoop.rdf.mapreduce.split.QuadSplitToNodesMapperTest
Running org.apache.jena.hadoop.rdf.mapreduce.split.TripleSplitToNodesMapperTest
Tests run: 4, Failures: 0, Errors: 0, Skipped: 0, Time elapsed: 0.363 sec - in org.apache.jena.hadoop.rdf.mapreduce.split.TripleSplitToNodesMapperTest
Running org.apache.jena.hadoop.rdf.mapreduce.count.QuadNodeCountMapReduceTest
Tests run: 4, Failures: 0, Errors: 0, Skipped: 0, Time elapsed: 3.375 sec - in org.apache.jena.hadoop.rdf.mapreduce.count.QuadNodeCountMapReduceTest
Running org.apache.jena.hadoop.rdf.mapreduce.count.TripleNodeCountMapperTest
Tests run: 4, Failures: 0, Errors: 0, Skipped: 0, Time elapsed: 0.372 sec - in org.apache.jena.hadoop.rdf.mapreduce.count.TripleNodeCountMapperTest
Running org.apache.jena.hadoop.rdf.mapreduce.count.TripleNodeCountMapReduceTest
Tests run: 4, Failures: 0, Errors: 0, Skipped: 0, Time elapsed: 2.747 sec - in org.apache.jena.hadoop.rdf.mapreduce.count.TripleNodeCountMapReduceTest
Running org.apache.jena.hadoop.rdf.mapreduce.count.QuadNodeCountMapperTest
Tests run: 4, Failures: 0, Errors: 0, Skipped: 0, Time elapsed: 0.964 sec - in org.apache.jena.hadoop.rdf.mapreduce.count.QuadNodeCountMapperTest
Running org.apache.jena.hadoop.rdf.mapreduce.TestDistinctTriples
Tests run: 4, Failures: 0, Errors: 0, Skipped: 0, Time elapsed: 0.123 sec - in org.apache.jena.hadoop.rdf.mapreduce.TestDistinctTriples
Running org.apache.jena.hadoop.rdf.mapreduce.filter.TripleInvertedFilterByPredicateMapperTest
Tests run: 4, Failures: 0, Errors: 0, Skipped: 0, Time elapsed: 0.552 sec - in org.apache.jena.hadoop.rdf.mapreduce.filter.TripleInvertedFilterByPredicateMapperTest
Running org.apache.jena.hadoop.rdf.mapreduce.filter.ValidQuadFilterMapperTest
Tests run: 4, Failures: 0, Errors: 0, Skipped: 0, Time elapsed: 0.976 sec - in org.apache.jena.hadoop.rdf.mapreduce.filter.ValidQuadFilterMapperTest
Running org.apache.jena.hadoop.rdf.mapreduce.filter.TripleFilterByPredicateMapperTest
Tests run: 4, Failures: 0, Errors: 0, Skipped: 0, Time elapsed: 0.508 sec - in org.apache.jena.hadoop.rdf.mapreduce.filter.TripleFilterByPredicateMapperTest
Running org.apache.jena.hadoop.rdf.mapreduce.filter.TripleInvertedFilterByNoPredicateMapperTest
Tests run: 4, Failures: 0, Errors: 0, Skipped: 0, Time elapsed: 0.481 sec - in org.apache.jena.hadoop.rdf.mapreduce.filter.TripleInvertedFilterByNoPredicateMapperTest
Running org.apache.jena.hadoop.rdf.mapreduce.filter.ValidTripleFilterMapperTest
Tests run: 4, Failures: 0, Errors: 0, Skipped: 0, Time elapsed: 0.507 sec - in org.apache.jena.hadoop.rdf.mapreduce.filter.ValidTripleFilterMapperTest
Running org.apache.jena.hadoop.rdf.mapreduce.filter.TripleFilterByNoPredicateMapperTest
Tests run: 4, Failures: 0, Errors: 0, Skipped: 0, Time elapsed: 0.178 sec - in org.apache.jena.hadoop.rdf.mapreduce.filter.TripleFilterByNoPredicateMapperTest
Running org.apache.jena.hadoop.rdf.mapreduce.characteristics.TripleCharacteristicSetGeneratingReducerTest
Tests run: 5, Failures: 0, Errors: 0, Skipped: 0, Time elapsed: 0.055 sec - in org.apache.jena.hadoop.rdf.mapreduce.characteristics.TripleCharacteristicSetGeneratingReducerTest
Running org.apache.jena.hadoop.rdf.mapreduce.characteristics.CharacteristicSetReducerTest
Tests run: 6, Failures: 0, Errors: 0, Skipped: 0, Time elapsed: 0.219 sec - in org.apache.jena.hadoop.rdf.mapreduce.characteristics.CharacteristicSetReducerTest
Running org.apache.jena.hadoop.rdf.mapreduce.transform.QuadsToTriplesMapperTest
Java HotSpot(TM) 64-Bit Server VM warning: INFO: os::commit_memory(0x00000006e9180000, 329252864,
0) failed; error='Cannot allocate memory' (errno=12)
#
# There is insufficient memory for the Java Runtime Environment to continue.
# Native memory allocation (mmap) failed to map 329252864 bytes for committing reserved memory.
# An error report file with more information is saved as:
# <https://builds.apache.org/job/Jena_Development_Test/ws/jena-elephas/jena-elephas-mapreduce/hs_err_pid24564.log>

Results :

Tests run: 99, Failures: 0, Errors: 0, Skipped: 0

[JENKINS] Recording test results
[JENKINS] Archiving disabled
[JENKINS] Archiving disabled
[JENKINS] Archiving disabled
[JENKINS] Archiving disabled
[JENKINS] Archiving disabled
[JENKINS] Archiving disabled
[JENKINS] Archiving disabled
[JENKINS] Archiving disabled
[JENKINS] Archiving disabled
[JENKINS] Archiving disabled
[JENKINS] Archiving disabled
[JENKINS] Archiving disabled
[JENKINS] Archiving disabled
[JENKINS] Archiving disabled
[JENKINS] Archiving disabled
[JENKINS] Archiving disabled
[JENKINS] Archiving disabled
[JENKINS] Archiving disabled
[JENKINS] Archiving disabled
[JENKINS] Archiving disabled
[JENKINS] Archiving disabled
[JENKINS] Archiving disabled
[JENKINS] Archiving disabled
[JENKINS] Archiving disabled
[JENKINS] Archiving disabled
[JENKINS] Archiving disabled
[JENKINS] Archiving disabled
[JENKINS] Archiving disabled
[JENKINS] Archiving disabled
[JENKINS] Archiving disabled
[JENKINS] Archiving disabled
[JENKINS] Archiving disabled
[JENKINS] Archiving disabled
[JENKINS] Archiving disabled
[JENKINS] Archiving disabled
[JENKINS] Archiving disabled
[JENKINS] Archiving disabled
[JENKINS] Archiving disabled
[JENKINS] Archiving disabled[INFO] ------------------------------------------------------------------------
[INFO] Reactor Summary:
[INFO] 
[INFO] Apache Jena - Parent ............................... SUCCESS [ 14.136 s]
[INFO] Apache Jena - Shadowed external libraries .......... SUCCESS [ 10.684 s]
[INFO] Apache Jena - IRI .................................. SUCCESS [ 13.921 s]
[INFO] Apache Jena - Base Common Environment .............. SUCCESS [01:29 min]
[INFO] Apache Jena - Core ................................. SUCCESS [01:24 min]
[INFO] Apache Jena - ARQ (SPARQL 1.1 Query Engine) ........ SUCCESS [02:05 min]
[INFO] Apache Jena - TDB (Native Triple Store) ............ SUCCESS [ 44.081 s]
[INFO] Apache Jena - Libraries POM ........................ SUCCESS [ 21.282 s]
[INFO] Apache Jena - Command line tools ................... SUCCESS [ 31.736 s]
[INFO] Apache Jena - SPARQL Text Search ................... SUCCESS [ 37.868 s]
[INFO] Apache Jena - SPARQL Spatial Search ................ SUCCESS [ 26.157 s]
[INFO] Apache Jena - Data Tables for RDF and SPARQL ....... SUCCESS [ 52.857 s]
[INFO] Apache Jena - SDB (SQL based triple store) ......... SUCCESS [01:02 min]
[INFO] Apache Jena - Fuseki1 .............................. SUCCESS [ 34.502 s]
[INFO] Apache Jena - Fuseki - A SPARQL 1.1 Server ......... SUCCESS [  3.511 s]
[INFO] Apache Jena - Fuseki Server Engine ................. SUCCESS [ 40.520 s]
[INFO] Apache Jena - Fuseki WAR File ...................... SUCCESS [  6.996 s]
[INFO] Apache Jena - Fuseki Server Standalone Jar ......... SUCCESS [ 18.400 s]
[INFO] Apache Jena - Fuseki Binary Distribution ........... SUCCESS [ 19.855 s]
[INFO] Apache Jena - Security Permissions ................. SUCCESS [ 38.557 s]
[INFO] Apache Jena - JDBC Parent .......................... SUCCESS [ 18.280 s]
[INFO] Apache Jena - JDBC Core API ........................ SUCCESS [ 57.278 s]
[INFO] Apache Jena - JDBC Remote Endpoint Driver .......... SUCCESS [01:11 min]
[INFO] Apache Jena - JDBC In-Memory Driver ................ SUCCESS [ 32.819 s]
[INFO] Apache Jena - JDBC TDB Driver ...................... SUCCESS [01:41 min]
[INFO] Apache Jena - JDBC Driver Bundle ................... SUCCESS [ 27.768 s]
[INFO] Apache Jena - Elephas .............................. SUCCESS [  1.626 s]
[INFO] Apache Jena - Elephas - Common API ................. SUCCESS [ 16.698 s]
[INFO] Apache Jena - Elephas - I/O ........................ SUCCESS [17:16 min]
[INFO] Apache Jena - Elephas - Map/Reduce ................. FAILURE [ 41.868 s]
[INFO] Apache Jena - Elephas - Statistics Demo App ........ SKIPPED
[INFO] Apache Jena - Distribution ......................... SKIPPED
[INFO] Apache Jena - OSGi ................................. SKIPPED
[INFO] Apache Jena - OSGi bundle .......................... SKIPPED
[INFO] Apache Jena - OSGi Karaf features .................. SKIPPED
[INFO] Apache Jena - Extras ............................... SKIPPED
[INFO] Apache Jena - Extras - Query Builder ............... SKIPPED
[INFO] Apache Jena ........................................ SKIPPED
[INFO] ------------------------------------------------------------------------
[INFO] BUILD FAILURE
[INFO] ------------------------------------------------------------------------
[INFO] Total time: 38:54 min
[INFO] Finished at: 2016-07-14T23:47:24+00:00

[INFO] Final Memory: 138M/1142M
[INFO] ------------------------------------------------------------------------
[ERROR] Failed to execute goal org.apache.maven.plugins:maven-surefire-plugin:2.19.1:test
(default-test) on project jena-elephas-mapreduce: Execution default-test of goal org.apache.maven.plugins:maven-surefire-plugin:2.19.1:test
failed: The forked VM terminated without properly saying goodbye. VM crash or System.exit
called?
[ERROR] Command was /bin/sh -c cd <https://builds.apache.org/job/Jena_Development_Test/ws/jena-elephas/jena-elephas-mapreduce>
&& /home/jenkins/jenkins-slave/tools/hudson.model.JDK/latest1.8/jre/bin/java -jar
<https://builds.apache.org/job/Jena_Development_Test/ws/jena-elephas/jena-elephas-mapreduce/target/surefire/surefirebooter5964792950270223838.jar>
<https://builds.apache.org/job/Jena_Development_Test/ws/jena-elephas/jena-elephas-mapreduce/target/surefire/surefire7799031849434393978tmp>
<https://builds.apache.org/job/Jena_Development_Test/ws/jena-elephas/jena-elephas-mapreduce/target/surefire/surefire_176570185707513452327tmp>
[ERROR] -> [Help 1]
[ERROR] 
[ERROR] To see the full stack trace of the errors, re-run Maven with the -e switch.
[ERROR] Re-run Maven using the -X switch to enable full debug logging.
[ERROR] 
[ERROR] For more information about the errors and possible solutions, please read the following
articles:
[ERROR] [Help 1] http://cwiki.apache.org/confluence/display/MAVEN/PluginExecutionException
[ERROR] 
[ERROR] After correcting the problems, you can resume the build with the command
[ERROR]   mvn <goals> -rf :jena-elephas-mapreduce
channel stopped

Mime
View raw message