jena-commits mailing list archives

Site index · List index
Message view « Date » · « Thread »
Top « Date » · « Thread »
From Apache Jenkins Server <jenk...@builds.apache.org>
Subject Build failed in Jenkins: Jena_Development_Test #2394
Date Tue, 24 May 2016 12:42:24 GMT
See <https://builds.apache.org/job/Jena_Development_Test/2394/changes>

Changes:

[andy] Setup logging before Jena initialization.

[andy] Reformat.

[andy] JENA-1185: Include slf4j-log4j12 and log4j dependencies

------------------------------------------
[...truncated 6880 lines...]
Downloading: http://repo.maven.apache.org/maven2/org/objenesis/objenesis/1.0/objenesis-1.0.jar
Downloading: http://repo.maven.apache.org/maven2/org/mockito/mockito-core/1.9.5/mockito-core-1.9.5.jar
Downloading: http://repo.maven.apache.org/maven2/org/powermock/powermock-core/1.5.1/powermock-core-1.5.1.jar
Downloading: http://repo.maven.apache.org/maven2/org/powermock/powermock-reflect/1.5.1/powermock-reflect-1.5.1.jar
Downloaded: http://repo.maven.apache.org/maven2/org/powermock/powermock-core/1.5.1/powermock-core-1.5.1.jar
(82 KB at 5850.5 KB/sec)
Downloaded: http://repo.maven.apache.org/maven2/org/objenesis/objenesis/1.0/objenesis-1.0.jar
(28 KB at 1860.0 KB/sec)
Downloading: http://repo.maven.apache.org/maven2/org/powermock/powermock-api-mockito/1.5.1/powermock-api-mockito-1.5.1.jar
Downloaded: http://repo.maven.apache.org/maven2/org/apache/mrunit/mrunit/1.1.0/mrunit-1.1.0-hadoop2.jar
(135 KB at 8952.1 KB/sec)
Downloading: http://repo.maven.apache.org/maven2/org/javassist/javassist/3.18.0-GA/javassist-3.18.0-GA.jar
Downloading: http://repo.maven.apache.org/maven2/org/powermock/powermock-api-support/1.5.1/powermock-api-support-1.5.1.jar
Downloaded: http://repo.maven.apache.org/maven2/org/powermock/powermock-reflect/1.5.1/powermock-reflect-1.5.1.jar
(43 KB at 3249.7 KB/sec)
Downloading: http://repo.maven.apache.org/maven2/org/powermock/powermock-module-junit4/1.5.1/powermock-module-junit4-1.5.1.jar
Downloaded: http://repo.maven.apache.org/maven2/org/powermock/powermock-api-mockito/1.5.1/powermock-api-mockito-1.5.1.jar
(67 KB at 5546.8 KB/sec)
Downloading: http://repo.maven.apache.org/maven2/org/powermock/powermock-module-junit4-common/1.5.1/powermock-module-junit4-common-1.5.1.jar
Downloaded: http://repo.maven.apache.org/maven2/org/powermock/powermock-module-junit4/1.5.1/powermock-module-junit4-1.5.1.jar
(24 KB at 1932.8 KB/sec)
Downloaded: http://repo.maven.apache.org/maven2/org/powermock/powermock-api-support/1.5.1/powermock-api-support-1.5.1.jar
(19 KB at 1207.2 KB/sec)
Downloaded: http://repo.maven.apache.org/maven2/org/powermock/powermock-module-junit4-common/1.5.1/powermock-module-junit4-common-1.5.1.jar
(14 KB at 1863.1 KB/sec)
Downloaded: http://repo.maven.apache.org/maven2/org/javassist/javassist/3.18.0-GA/javassist-3.18.0-GA.jar
(698 KB at 26815.3 KB/sec)
Downloaded: http://repo.maven.apache.org/maven2/org/mockito/mockito-core/1.9.5/mockito-core-1.9.5.jar
(1465 KB at 32552.3 KB/sec)
[INFO] 
[INFO] --- maven-clean-plugin:3.0.0:clean (default-clean) @ jena-elephas-mapreduce ---
[INFO] 
[INFO] --- maven-enforcer-plugin:1.4.1:enforce (enforce) @ jena-elephas-mapreduce ---
[INFO] 
[INFO] --- apache-rat-plugin:0.11:check (rat-checks) @ jena-elephas-mapreduce ---
[INFO] 51 implicit excludes (use -debug for more details).
[INFO] Exclude: **/.project
[INFO] Exclude: **/.settings/**
[INFO] Exclude: **/.classpath
[INFO] Exclude: **/META-INF/services/*
[INFO] Exclude: **/src-examples/data/*
[INFO] Exclude: **/dist/ABOUT
[INFO] Exclude: **/SEE_FUSEKI2
[INFO] Exclude: **/src/main/webapp/css/*
[INFO] Exclude: **/src/main/webapp/fonts/*
[INFO] Exclude: **/src/main/webapp/js/**/*
[INFO] Exclude: **/vocabularies/*
[INFO] Exclude: **/Vocabularies/*
[INFO] Exclude: **/src/main/**/*.html
[INFO] Exclude: **/src/**/package-info.java
[INFO] Exclude: **/DEPENDENCIES
[INFO] Exclude: **/*.txt
[INFO] Exclude: **/*.md
[INFO] Exclude: **/META-INF/services/*
[INFO] Exclude: **/src/test/resources/**/*
[INFO] Exclude: **/testing/**/*
[INFO] Exclude: **/log4j.properties
[INFO] Exclude: **/log4j-testing.properties
[INFO] Exclude: **/derby.log
[INFO] Exclude: **/DB/**/*
[INFO] Exclude: **/tdb*.cfg
[INFO] Exclude: **/run/**/*
[INFO] Exclude: **/*.classpath
[INFO] Exclude: **/target/**/*
[INFO] Exclude: **/dependency-reduced-pom.xml
[INFO] 115 resources included (use -debug for more details)
[INFO] Rat check: Summary of files. Unapproved: 0 unknown: 0 generated: 0 approved: 115 licence.
[INFO] 
[INFO] --- maven-remote-resources-plugin:1.5:process (process-resource-bundles) @ jena-elephas-mapreduce
---
[INFO] 
[INFO] --- maven-resources-plugin:2.7:resources (default-resources) @ jena-elephas-mapreduce
---
[INFO] Using 'UTF-8' encoding to copy filtered resources.
[INFO] skip non existing resourceDirectory <https://builds.apache.org/job/Jena_Development_Test/ws/jena-elephas/jena-elephas-mapreduce/src/main/resources>
[INFO] Copying 3 resources
[INFO] 
[INFO] --- maven-compiler-plugin:3.5.1:compile (default-compile) @ jena-elephas-mapreduce
---
[INFO] Changes detected - recompiling the module!
[INFO] Compiling 70 source files to <https://builds.apache.org/job/Jena_Development_Test/ws/jena-elephas/jena-elephas-mapreduce/target/classes>
[INFO] 
[INFO] --- maven-resources-plugin:2.7:testResources (default-testResources) @ jena-elephas-mapreduce
---
[INFO] Using 'UTF-8' encoding to copy filtered resources.
[INFO] Copying 1 resource
[INFO] Copying 3 resources
[INFO] 
[INFO] --- maven-compiler-plugin:3.5.1:testCompile (default-testCompile) @ jena-elephas-mapreduce
---
[INFO] Changes detected - recompiling the module!
[INFO] Compiling 44 source files to <https://builds.apache.org/job/Jena_Development_Test/ws/jena-elephas/jena-elephas-mapreduce/target/test-classes>
[INFO] <https://builds.apache.org/job/Jena_Development_Test/ws/jena-elephas/jena-elephas-mapreduce/src/test/java/org/apache/jena/hadoop/rdf/mapreduce/filter/AbstractTripleValidityFilterTests.java>:
Some input files use or override a deprecated API.
[INFO] <https://builds.apache.org/job/Jena_Development_Test/ws/jena-elephas/jena-elephas-mapreduce/src/test/java/org/apache/jena/hadoop/rdf/mapreduce/filter/AbstractTripleValidityFilterTests.java>:
Recompile with -Xlint:deprecation for details.
[INFO] 
[INFO] --- maven-surefire-plugin:2.19.1:test (default-test) @ jena-elephas-mapreduce ---

-------------------------------------------------------
 T E S T S
-------------------------------------------------------
Running org.apache.jena.hadoop.rdf.mapreduce.filter.ValidQuadFilterMapperTest
Tests run: 4, Failures: 0, Errors: 0, Skipped: 0, Time elapsed: 1.945 sec - in org.apache.jena.hadoop.rdf.mapreduce.filter.ValidQuadFilterMapperTest
Running org.apache.jena.hadoop.rdf.mapreduce.filter.TripleFilterByNoPredicateMapperTest
Tests run: 4, Failures: 0, Errors: 0, Skipped: 0, Time elapsed: 0.3 sec - in org.apache.jena.hadoop.rdf.mapreduce.filter.TripleFilterByNoPredicateMapperTest
Running org.apache.jena.hadoop.rdf.mapreduce.filter.TripleInvertedFilterByPredicateMapperTest
Tests run: 4, Failures: 0, Errors: 0, Skipped: 0, Time elapsed: 1.03 sec - in org.apache.jena.hadoop.rdf.mapreduce.filter.TripleInvertedFilterByPredicateMapperTest
Running org.apache.jena.hadoop.rdf.mapreduce.filter.TripleFilterByPredicateMapperTest
Tests run: 4, Failures: 0, Errors: 0, Skipped: 0, Time elapsed: 0.304 sec - in org.apache.jena.hadoop.rdf.mapreduce.filter.TripleFilterByPredicateMapperTest
Running org.apache.jena.hadoop.rdf.mapreduce.filter.TripleInvertedFilterByNoPredicateMapperTest
Tests run: 4, Failures: 0, Errors: 0, Skipped: 0, Time elapsed: 0.308 sec - in org.apache.jena.hadoop.rdf.mapreduce.filter.TripleInvertedFilterByNoPredicateMapperTest
Running org.apache.jena.hadoop.rdf.mapreduce.filter.ValidTripleFilterMapperTest
Tests run: 4, Failures: 0, Errors: 0, Skipped: 0, Time elapsed: 0.611 sec - in org.apache.jena.hadoop.rdf.mapreduce.filter.ValidTripleFilterMapperTest
Running org.apache.jena.hadoop.rdf.mapreduce.transform.QuadsToTriplesMapperTest
Tests run: 4, Failures: 0, Errors: 0, Skipped: 0, Time elapsed: 1.874 sec - in org.apache.jena.hadoop.rdf.mapreduce.transform.QuadsToTriplesMapperTest
Running org.apache.jena.hadoop.rdf.mapreduce.transform.TriplesToQuadsBySubjectMapperTest
Tests run: 4, Failures: 0, Errors: 0, Skipped: 0, Time elapsed: 1.934 sec - in org.apache.jena.hadoop.rdf.mapreduce.transform.TriplesToQuadsBySubjectMapperTest
Running org.apache.jena.hadoop.rdf.mapreduce.transform.TriplesToQuadsConstantGraphMapperTest
Tests run: 4, Failures: 0, Errors: 0, Skipped: 0, Time elapsed: 0.94 sec - in org.apache.jena.hadoop.rdf.mapreduce.transform.TriplesToQuadsConstantGraphMapperTest
Running org.apache.jena.hadoop.rdf.mapreduce.characteristics.TripleCharacteristicSetGeneratingReducerTest
Tests run: 5, Failures: 0, Errors: 0, Skipped: 0, Time elapsed: 0.095 sec - in org.apache.jena.hadoop.rdf.mapreduce.characteristics.TripleCharacteristicSetGeneratingReducerTest
Running org.apache.jena.hadoop.rdf.mapreduce.characteristics.CharacteristicSetReducerTest
Tests run: 6, Failures: 0, Errors: 0, Skipped: 0, Time elapsed: 0.105 sec - in org.apache.jena.hadoop.rdf.mapreduce.characteristics.CharacteristicSetReducerTest
Running org.apache.jena.hadoop.rdf.mapreduce.TestDistinctTriples
Tests run: 4, Failures: 0, Errors: 0, Skipped: 0, Time elapsed: 0.054 sec - in org.apache.jena.hadoop.rdf.mapreduce.TestDistinctTriples
Running org.apache.jena.hadoop.rdf.mapreduce.count.TripleNodeCountMapperTest
Tests run: 4, Failures: 0, Errors: 0, Skipped: 0, Time elapsed: 2.294 sec - in org.apache.jena.hadoop.rdf.mapreduce.count.TripleNodeCountMapperTest
Running org.apache.jena.hadoop.rdf.mapreduce.count.QuadNodeCountMapperTest
Tests run: 4, Failures: 0, Errors: 0, Skipped: 0, Time elapsed: 0.599 sec - in org.apache.jena.hadoop.rdf.mapreduce.count.QuadNodeCountMapperTest
Running org.apache.jena.hadoop.rdf.mapreduce.count.QuadNodeCountMapReduceTest
Tests run: 4, Failures: 0, Errors: 0, Skipped: 0, Time elapsed: 2.574 sec - in org.apache.jena.hadoop.rdf.mapreduce.count.QuadNodeCountMapReduceTest
Running org.apache.jena.hadoop.rdf.mapreduce.count.TripleNodeCountMapReduceTest
Tests run: 4, Failures: 0, Errors: 0, Skipped: 0, Time elapsed: 1.517 sec - in org.apache.jena.hadoop.rdf.mapreduce.count.TripleNodeCountMapReduceTest
Running org.apache.jena.hadoop.rdf.mapreduce.group.TripleGroupByObjectMapperTest
Tests run: 4, Failures: 0, Errors: 0, Skipped: 0, Time elapsed: 0.301 sec - in org.apache.jena.hadoop.rdf.mapreduce.group.TripleGroupByObjectMapperTest
Running org.apache.jena.hadoop.rdf.mapreduce.group.QuadGroupByGraphMapperTest
Tests run: 4, Failures: 0, Errors: 0, Skipped: 0, Time elapsed: 0.31 sec - in org.apache.jena.hadoop.rdf.mapreduce.group.QuadGroupByGraphMapperTest
Running org.apache.jena.hadoop.rdf.mapreduce.group.QuadGroupByPredicateMapperTest
Tests run: 4, Failures: 0, Errors: 0, Skipped: 0, Time elapsed: 0.318 sec - in org.apache.jena.hadoop.rdf.mapreduce.group.QuadGroupByPredicateMapperTest
Running org.apache.jena.hadoop.rdf.mapreduce.group.QuadGroupByObjectMapperTest
Tests run: 4, Failures: 0, Errors: 0, Skipped: 0, Time elapsed: 0.411 sec - in org.apache.jena.hadoop.rdf.mapreduce.group.QuadGroupByObjectMapperTest
Running org.apache.jena.hadoop.rdf.mapreduce.group.QuadGroupBySubjectMapperTest
Tests run: 4, Failures: 0, Errors: 0, Skipped: 0, Time elapsed: 2.535 sec - in org.apache.jena.hadoop.rdf.mapreduce.group.QuadGroupBySubjectMapperTest
Running org.apache.jena.hadoop.rdf.mapreduce.group.TripleGroupByPredicateMapperTest
Tests run: 4, Failures: 0, Errors: 0, Skipped: 0, Time elapsed: 3.544 sec - in org.apache.jena.hadoop.rdf.mapreduce.group.TripleGroupByPredicateMapperTest
Running org.apache.jena.hadoop.rdf.mapreduce.group.TripleGroupBySubjectMapperTest
Tests run: 4, Failures: 0, Errors: 0, Skipped: 0, Time elapsed: 6.678 sec - in org.apache.jena.hadoop.rdf.mapreduce.group.TripleGroupBySubjectMapperTest
Running org.apache.jena.hadoop.rdf.mapreduce.split.QuadSplitToNodesMapperTest
Tests run: 3, Failures: 0, Errors: 0, Skipped: 0, Time elapsed: 62.53 sec - in org.apache.jena.hadoop.rdf.mapreduce.split.QuadSplitToNodesMapperTest
Exception in thread "last-ditch-daemon-shutdown-thread-30sec" java.lang.OutOfMemoryError:
GC overhead limit exceeded
	at java.util.concurrent.locks.AbstractQueuedSynchronizer$ConditionObject.addConditionWaiter(AbstractQueuedSynchronizer.java:1855)
	at java.util.concurrent.locks.AbstractQueuedSynchronizer$ConditionObject.awaitNanos(AbstractQueuedSynchronizer.java:2068)
	at java.util.concurrent.ScheduledThreadPoolExecutor$DelayedWorkQueue.take(ScheduledThreadPoolExecutor.java:1093)
	at java.util.concurrent.ScheduledThreadPoolExecutor$DelayedWorkQueue.take(ScheduledThreadPoolExecutor.java:809)
	at java.util.concurrent.ThreadPoolExecutor.getTask(ThreadPoolExecutor.java:1067)
Exception: java.lang.OutOfMemoryError thrown from the UncaughtExceptionHandler in thread "last-ditch-daemon-shutdown-thread-30sec"
java.lang.OutOfMemoryError: GC overhead limit exceeded
Exception in thread "main" java.lang.OutOfMemoryError: GC overhead limit exceeded

Results :

Tests run: 98, Failures: 0, Errors: 0, Skipped: 0

[JENKINS] Recording test results
[JENKINS] Archiving disabled
[INFO] ------------------------------------------------------------------------
[INFO] Reactor Summary:
[INFO] 
[INFO] Apache Jena - Parent .............................. SUCCESS [7.341s]
[INFO] Apache Jena - Shadowed external libraries ......... SUCCESS [5.643s]
[INFO] Apache Jena - IRI ................................. SUCCESS [8.389s]
[INFO] Apache Jena - Base Common Environment ............. SUCCESS [47.640s]
[INFO] Apache Jena - Core ................................ SUCCESS [1:15.402s]
[INFO] Apache Jena - ARQ (SPARQL 1.1 Query Engine) ....... SUCCESS [1:23.263s]
[INFO] Apache Jena - TDB (Native Triple Store) ........... SUCCESS [31.918s]
[INFO] Apache Jena - Libraries POM ....................... SUCCESS [1.747s]
[INFO] Apache Jena - Command line tools .................. SUCCESS [27.364s]
[INFO] Apache Jena - SPARQL Text Search .................. SUCCESS [15.846s]
[INFO] Apache Jena - SPARQL Spatial Search ............... SUCCESS [11.918s]
[INFO] Apache Jena - Data Tables for RDF and SPARQL ...... SUCCESS [8.375s]
[INFO] Apache Jena - SDB (SQL based triple store) ........ SUCCESS [30.221s]
[INFO] Apache Jena - Fuseki1 ............................. SUCCESS [18.420s]
[INFO] Apache Jena - Fuseki - A SPARQL 1.1 Server ........ SUCCESS [2.472s]
[INFO] Apache Jena - Fuseki Server Engine ................ SUCCESS [17.901s]
[INFO] Apache Jena - Fuseki WAR File ..................... SUCCESS [6.763s]
[INFO] Apache Jena - Fuseki Server Standalone Jar ........ SUCCESS [7.219s]
[INFO] Apache Jena - Fuseki Binary Distribution .......... SUCCESS [5.851s]
[INFO] Apache Jena - Security Permissions ................ SUCCESS [44.318s]
[INFO] Apache Jena - JDBC Parent ......................... SUCCESS [2.504s]
[INFO] Apache Jena - JDBC Core API ....................... SUCCESS [41.857s]
[INFO] Apache Jena - JDBC Remote Endpoint Driver ......... SUCCESS [43.526s]
[INFO] Apache Jena - JDBC In-Memory Driver ............... SUCCESS [22.096s]
[INFO] Apache Jena - JDBC TDB Driver ..................... SUCCESS [53.418s]
[INFO] Apache Jena - JDBC Driver Bundle .................. SUCCESS [18.205s]
[INFO] Apache Jena - Elephas ............................. SUCCESS [2.891s]
[INFO] Apache Jena - Elephas - Common API ................ SUCCESS [11.125s]
[INFO] Apache Jena - Elephas - I/O ....................... SUCCESS [16:42.064s]
[INFO] Apache Jena - Elephas - Map/Reduce ................ FAILURE [2:09.377s]
[INFO] Apache Jena - Elephas - Statistics Demo App ....... SKIPPED
[INFO] Apache Jena - Distribution ........................ SKIPPED
[INFO] Apache Jena - OSGi ................................ SKIPPED
[INFO] Apache Jena - OSGi bundle ......................... SKIPPED
[INFO] Apache Jena - OSGi Karaf features ................. SKIPPED
[INFO] Apache Jena - Extras .............................. SKIPPED
[INFO] Apache Jena - Extras - Query Builder .............. SKIPPED
[INFO] Apache Jena ....................................... SKIPPED
[INFO] ------------------------------------------------------------------------
[INFO] BUILD FAILURE
[INFO] ------------------------------------------------------------------------
[INFO] Total time: 30:55.482s
[INFO] Finished at: Tue May 24 12:37:32 UTC 2016
[INFO] Final Memory: 80M/528M
[INFO] ------------------------------------------------------------------------
[JENKINS] Archiving disabled
[JENKINS] Archiving disabled
[JENKINS] Archiving disabled
[JENKINS] Archiving disabled
[JENKINS] Archiving disabled
[JENKINS] Archiving disabled
[JENKINS] Archiving disabled
[JENKINS] Archiving disabled
[JENKINS] Archiving disabled
[JENKINS] Archiving disabled
[JENKINS] Archiving disabled
[JENKINS] Archiving disabled
[JENKINS] Archiving disabled
[JENKINS] Archiving disabled
[JENKINS] Archiving disabled
[JENKINS] Archiving disabled
[JENKINS] Archiving disabled
[JENKINS] Archiving disabled
[JENKINS] Archiving disabled
[JENKINS] Archiving disabled
[JENKINS] Archiving disabled
[JENKINS] Archiving disabled
[JENKINS] Archiving disabled
[JENKINS] Archiving disabled
[JENKINS] Archiving disabled
[JENKINS] Archiving disabled
[JENKINS] Archiving disabled
[JENKINS] Archiving disabled
[JENKINS] Archiving disabled
[JENKINS] Archiving disabled
[JENKINS] Archiving disabled
[JENKINS] Archiving disabled
[JENKINS] Archiving disabled
[JENKINS] Archiving disabled
[JENKINS] Archiving disabled
[JENKINS] Archiving disabled
[JENKINS] Archiving disabled
[JENKINS] Archiving disabled
Waiting for Jenkins to finish collecting data
[ERROR] Failed to execute goal org.apache.maven.plugins:maven-surefire-plugin:2.19.1:test
(default-test) on project jena-elephas-mapreduce: Execution default-test of goal org.apache.maven.plugins:maven-surefire-plugin:2.19.1:test
failed: The forked VM terminated without properly saying goodbye. VM crash or System.exit
called?
[ERROR] Command was /bin/sh -c cd <https://builds.apache.org/job/Jena_Development_Test/ws/jena-elephas/jena-elephas-mapreduce>
&& /home/jenkins/jenkins-slave/tools/hudson.model.JDK/latest1.8/jre/bin/java -jar
<https://builds.apache.org/job/Jena_Development_Test/ws/jena-elephas/jena-elephas-mapreduce/target/surefire/surefirebooter5968724930195588370.jar>
<https://builds.apache.org/job/Jena_Development_Test/ws/jena-elephas/jena-elephas-mapreduce/target/surefire/surefire3918332834157602256tmp>
<https://builds.apache.org/job/Jena_Development_Test/ws/jena-elephas/jena-elephas-mapreduce/target/surefire/surefire_171853256228755496753tmp>
[ERROR] -> [Help 1]
[ERROR] 
[ERROR] To see the full stack trace of the errors, re-run Maven with the -e switch.
[ERROR] Re-run Maven using the -X switch to enable full debug logging.
[ERROR] 
[ERROR] For more information about the errors and possible solutions, please read the following
articles:
[ERROR] [Help 1] http://cwiki.apache.org/confluence/display/MAVEN/PluginExecutionException
[ERROR] 
[ERROR] After correcting the problems, you can resume the build with the command
[ERROR]   mvn <goals> -rf :jena-elephas-mapreduce
channel stopped

Mime
View raw message