jena-commits mailing list archives

Site index · List index
Message view « Date » · « Thread »
Top « Date » · « Thread »
From Apache Jenkins Server <jenk...@builds.apache.org>
Subject Build failed in Jenkins: Jena_Development_Deploy #1164
Date Tue, 10 May 2016 10:53:53 GMT
See <https://builds.apache.org/job/Jena_Development_Deploy/1164/changes>

Changes:

[andy] JENA-1175 : tests that are timezone insensitive

[stain] Optional xerces bundle dependency

[andy] Revert java-jsonld to 0.7.0

[andy] Reset versions to 3.1.0/2.4.0/1.4.0/16 SNAPSHOT

------------------------------------------
[...truncated 8124 lines...]
Running org.apache.jena.hadoop.rdf.io.input.nquads.BlockedNQuadsInputTest
Tests run: 12, Failures: 0, Errors: 0, Skipped: 0, Time elapsed: 7.45 sec - in org.apache.jena.hadoop.rdf.io.input.nquads.BlockedNQuadsInputTest
Running org.apache.jena.hadoop.rdf.io.input.nquads.WholeFileNQuadsAsQuadsInputTest
Tests run: 12, Failures: 0, Errors: 0, Skipped: 3, Time elapsed: 1.15 sec - in org.apache.jena.hadoop.rdf.io.input.nquads.WholeFileNQuadsAsQuadsInputTest
Running org.apache.jena.hadoop.rdf.io.input.nquads.WholeFileNQuadsInputTest
Tests run: 12, Failures: 0, Errors: 0, Skipped: 3, Time elapsed: 1.073 sec - in org.apache.jena.hadoop.rdf.io.input.nquads.WholeFileNQuadsInputTest
Running org.apache.jena.hadoop.rdf.io.input.nquads.NQuadsInputTest
Tests run: 12, Failures: 0, Errors: 0, Skipped: 0, Time elapsed: 1.881 sec - in org.apache.jena.hadoop.rdf.io.input.nquads.NQuadsInputTest
Running org.apache.jena.hadoop.rdf.io.input.compressed.trix.GZippedTriXInputTest
Tests run: 12, Failures: 0, Errors: 0, Skipped: 3, Time elapsed: 1.572 sec - in org.apache.jena.hadoop.rdf.io.input.compressed.trix.GZippedTriXInputTest
Running org.apache.jena.hadoop.rdf.io.input.compressed.trix.BZippedTriXInputTest
Tests run: 12, Failures: 0, Errors: 0, Skipped: 3, Time elapsed: 5.477 sec - in org.apache.jena.hadoop.rdf.io.input.compressed.trix.BZippedTriXInputTest
Running org.apache.jena.hadoop.rdf.io.input.compressed.trix.DeflatedTriXInputTest
Tests run: 12, Failures: 0, Errors: 0, Skipped: 3, Time elapsed: 1.317 sec - in org.apache.jena.hadoop.rdf.io.input.compressed.trix.DeflatedTriXInputTest
Running org.apache.jena.hadoop.rdf.io.input.compressed.trig.BZippedTriGInputTest
Tests run: 12, Failures: 0, Errors: 0, Skipped: 3, Time elapsed: 5.174 sec - in org.apache.jena.hadoop.rdf.io.input.compressed.trig.BZippedTriGInputTest
Running org.apache.jena.hadoop.rdf.io.input.compressed.trig.GZippedTriGInputTest
Tests run: 12, Failures: 0, Errors: 0, Skipped: 3, Time elapsed: 1.335 sec - in org.apache.jena.hadoop.rdf.io.input.compressed.trig.GZippedTriGInputTest
Running org.apache.jena.hadoop.rdf.io.input.compressed.trig.DeflatedTriGInputTest
Tests run: 12, Failures: 0, Errors: 0, Skipped: 3, Time elapsed: 1.401 sec - in org.apache.jena.hadoop.rdf.io.input.compressed.trig.DeflatedTriGInputTest
Running org.apache.jena.hadoop.rdf.io.input.compressed.jsonld.BZippedJsonLDQuadInputTest
Tests run: 12, Failures: 0, Errors: 0, Skipped: 3, Time elapsed: 67.11 sec - in org.apache.jena.hadoop.rdf.io.input.compressed.jsonld.BZippedJsonLDQuadInputTest
Running org.apache.jena.hadoop.rdf.io.input.compressed.jsonld.GZippedJsonLDQuadInputTest
Tests run: 12, Failures: 0, Errors: 0, Skipped: 3, Time elapsed: 61.688 sec - in org.apache.jena.hadoop.rdf.io.input.compressed.jsonld.GZippedJsonLDQuadInputTest
Running org.apache.jena.hadoop.rdf.io.input.compressed.jsonld.DeflatedJsonLDQuadInputTest
Tests run: 12, Failures: 0, Errors: 0, Skipped: 3, Time elapsed: 61.557 sec - in org.apache.jena.hadoop.rdf.io.input.compressed.jsonld.DeflatedJsonLDQuadInputTest
Running org.apache.jena.hadoop.rdf.io.input.compressed.jsonld.GZippedJsonLDTripleInputTest
Tests run: 12, Failures: 0, Errors: 0, Skipped: 3, Time elapsed: 61.375 sec - in org.apache.jena.hadoop.rdf.io.input.compressed.jsonld.GZippedJsonLDTripleInputTest
Running org.apache.jena.hadoop.rdf.io.input.compressed.jsonld.BZippedJsonLDTripleInputTest
Tests run: 12, Failures: 0, Errors: 0, Skipped: 3, Time elapsed: 63.013 sec - in org.apache.jena.hadoop.rdf.io.input.compressed.jsonld.BZippedJsonLDTripleInputTest
Running org.apache.jena.hadoop.rdf.io.input.compressed.jsonld.DeflatedJsonLDTripleInputTest
Tests run: 12, Failures: 0, Errors: 0, Skipped: 3, Time elapsed: 61.372 sec - in org.apache.jena.hadoop.rdf.io.input.compressed.jsonld.DeflatedJsonLDTripleInputTest
Running org.apache.jena.hadoop.rdf.io.input.compressed.ntriples.BZippedNTriplesInputTest
Tests run: 12, Failures: 0, Errors: 0, Skipped: 3, Time elapsed: 4.175 sec - in org.apache.jena.hadoop.rdf.io.input.compressed.ntriples.BZippedNTriplesInputTest
Running org.apache.jena.hadoop.rdf.io.input.compressed.ntriples.BZippedWholeFileNTriplesInputTest
Tests run: 12, Failures: 0, Errors: 0, Skipped: 3, Time elapsed: 9.006 sec - in org.apache.jena.hadoop.rdf.io.input.compressed.ntriples.BZippedWholeFileNTriplesInputTest
Running org.apache.jena.hadoop.rdf.io.input.compressed.ntriples.DeflatedWholeFileNTriplesInputTest
Tests run: 12, Failures: 0, Errors: 0, Skipped: 3, Time elapsed: 1.732 sec - in org.apache.jena.hadoop.rdf.io.input.compressed.ntriples.DeflatedWholeFileNTriplesInputTest
Running org.apache.jena.hadoop.rdf.io.input.compressed.ntriples.GZippedWholeFileNTriplesInputTest
Tests run: 12, Failures: 0, Errors: 0, Skipped: 3, Time elapsed: 1.801 sec - in org.apache.jena.hadoop.rdf.io.input.compressed.ntriples.GZippedWholeFileNTriplesInputTest
Running org.apache.jena.hadoop.rdf.io.input.compressed.ntriples.GZippedNTriplesInputTest
Tests run: 12, Failures: 0, Errors: 0, Skipped: 3, Time elapsed: 1.131 sec - in org.apache.jena.hadoop.rdf.io.input.compressed.ntriples.GZippedNTriplesInputTest
Running org.apache.jena.hadoop.rdf.io.input.compressed.ntriples.DeflatedNTriplesInputTest
Tests run: 12, Failures: 0, Errors: 0, Skipped: 3, Time elapsed: 1.114 sec - in org.apache.jena.hadoop.rdf.io.input.compressed.ntriples.DeflatedNTriplesInputTest
Running org.apache.jena.hadoop.rdf.io.input.compressed.thrift.GZippedThriftTripleInputTest
Tests run: 12, Failures: 0, Errors: 0, Skipped: 3, Time elapsed: 7.244 sec - in org.apache.jena.hadoop.rdf.io.input.compressed.thrift.GZippedThriftTripleInputTest
Running org.apache.jena.hadoop.rdf.io.input.compressed.thrift.DeflatedThriftQuadInputTest
Tests run: 12, Failures: 0, Errors: 0, Skipped: 3, Time elapsed: 7.298 sec - in org.apache.jena.hadoop.rdf.io.input.compressed.thrift.DeflatedThriftQuadInputTest
Running org.apache.jena.hadoop.rdf.io.input.compressed.thrift.DeflatedThriftTripleInputTest
Tests run: 12, Failures: 0, Errors: 0, Skipped: 3, Time elapsed: 7.202 sec - in org.apache.jena.hadoop.rdf.io.input.compressed.thrift.DeflatedThriftTripleInputTest
Running org.apache.jena.hadoop.rdf.io.input.compressed.thrift.BZippedThriftTripleInputTest
Tests run: 12, Failures: 0, Errors: 0, Skipped: 3, Time elapsed: 14.56 sec - in org.apache.jena.hadoop.rdf.io.input.compressed.thrift.BZippedThriftTripleInputTest
Running org.apache.jena.hadoop.rdf.io.input.compressed.thrift.BZippedThriftQuadInputTest
Tests run: 12, Failures: 0, Errors: 0, Skipped: 3, Time elapsed: 15.638 sec - in org.apache.jena.hadoop.rdf.io.input.compressed.thrift.BZippedThriftQuadInputTest
Running org.apache.jena.hadoop.rdf.io.input.compressed.thrift.GZippedThriftQuadInputTest
Tests run: 12, Failures: 0, Errors: 0, Skipped: 3, Time elapsed: 7.314 sec - in org.apache.jena.hadoop.rdf.io.input.compressed.thrift.GZippedThriftQuadInputTest
Running org.apache.jena.hadoop.rdf.io.input.compressed.rdfjson.DeflatedRdfJsonInputTest
Tests run: 12, Failures: 0, Errors: 0, Skipped: 3, Time elapsed: 2.103 sec - in org.apache.jena.hadoop.rdf.io.input.compressed.rdfjson.DeflatedRdfJsonInputTest
Running org.apache.jena.hadoop.rdf.io.input.compressed.rdfjson.BZippedRdfJsonInputTest
Tests run: 12, Failures: 0, Errors: 0, Skipped: 3, Time elapsed: 12.141 sec - in org.apache.jena.hadoop.rdf.io.input.compressed.rdfjson.BZippedRdfJsonInputTest
Running org.apache.jena.hadoop.rdf.io.input.compressed.rdfjson.GZippedRdfJsonInputTest
Tests run: 12, Failures: 0, Errors: 0, Skipped: 3, Time elapsed: 2.103 sec - in org.apache.jena.hadoop.rdf.io.input.compressed.rdfjson.GZippedRdfJsonInputTest
Running org.apache.jena.hadoop.rdf.io.input.compressed.turtle.GZippedTurtleInputTest
Tests run: 12, Failures: 0, Errors: 0, Skipped: 3, Time elapsed: 1.282 sec - in org.apache.jena.hadoop.rdf.io.input.compressed.turtle.GZippedTurtleInputTest
Running org.apache.jena.hadoop.rdf.io.input.compressed.turtle.DeflatedTurtleInputTest
Tests run: 12, Failures: 0, Errors: 0, Skipped: 3, Time elapsed: 1.354 sec - in org.apache.jena.hadoop.rdf.io.input.compressed.turtle.DeflatedTurtleInputTest
Running org.apache.jena.hadoop.rdf.io.input.compressed.turtle.BZippedTurtleInputTest
Tests run: 12, Failures: 0, Errors: 0, Skipped: 3, Time elapsed: 5.479 sec - in org.apache.jena.hadoop.rdf.io.input.compressed.turtle.BZippedTurtleInputTest
Running org.apache.jena.hadoop.rdf.io.input.compressed.nquads.GZippedWholeFileNQuadsInputTest
Tests run: 12, Failures: 0, Errors: 0, Skipped: 3, Time elapsed: 1.663 sec - in org.apache.jena.hadoop.rdf.io.input.compressed.nquads.GZippedWholeFileNQuadsInputTest
Running org.apache.jena.hadoop.rdf.io.input.compressed.nquads.DeflatedWholeFileNQuadsInputTest
Tests run: 12, Failures: 0, Errors: 0, Skipped: 3, Time elapsed: 1.693 sec - in org.apache.jena.hadoop.rdf.io.input.compressed.nquads.DeflatedWholeFileNQuadsInputTest
Running org.apache.jena.hadoop.rdf.io.input.compressed.nquads.BZipppedWholeFileNQuadsInputTest
Tests run: 12, Failures: 0, Errors: 0, Skipped: 3, Time elapsed: 9.538 sec - in org.apache.jena.hadoop.rdf.io.input.compressed.nquads.BZipppedWholeFileNQuadsInputTest
Running org.apache.jena.hadoop.rdf.io.input.compressed.nquads.DeflatedNQuadsInputTest
Tests run: 12, Failures: 0, Errors: 0, Skipped: 3, Time elapsed: 1.354 sec - in org.apache.jena.hadoop.rdf.io.input.compressed.nquads.DeflatedNQuadsInputTest
Running org.apache.jena.hadoop.rdf.io.input.compressed.nquads.BZipppedNQuadsInputTest
Tests run: 12, Failures: 0, Errors: 0, Skipped: 3, Time elapsed: 5.853 sec - in org.apache.jena.hadoop.rdf.io.input.compressed.nquads.BZipppedNQuadsInputTest
Running org.apache.jena.hadoop.rdf.io.input.compressed.nquads.GZippedNQuadsInputTest
Tests run: 12, Failures: 0, Errors: 0, Skipped: 3, Time elapsed: 1.303 sec - in org.apache.jena.hadoop.rdf.io.input.compressed.nquads.GZippedNQuadsInputTest
Running org.apache.jena.hadoop.rdf.io.input.compressed.rdfxml.GZippedRdfXmlInputTest
Tests run: 12, Failures: 0, Errors: 0, Skipped: 3, Time elapsed: 10.395 sec - in org.apache.jena.hadoop.rdf.io.input.compressed.rdfxml.GZippedRdfXmlInputTest
Running org.apache.jena.hadoop.rdf.io.input.compressed.rdfxml.DeflatedRdfXmlInputTest
Tests run: 12, Failures: 0, Errors: 0, Skipped: 3, Time elapsed: 9.633 sec - in org.apache.jena.hadoop.rdf.io.input.compressed.rdfxml.DeflatedRdfXmlInputTest
Running org.apache.jena.hadoop.rdf.io.input.compressed.rdfxml.BZippedRdfXmlInputTest
Tests run: 12, Failures: 0, Errors: 0, Skipped: 3, Time elapsed: 16.292 sec - in org.apache.jena.hadoop.rdf.io.input.compressed.rdfxml.BZippedRdfXmlInputTest
Running org.apache.jena.hadoop.rdf.io.input.rdfxml.RdfXmlInputTest
Tests run: 12, Failures: 0, Errors: 0, Skipped: 3, Time elapsed: 8.949 sec - in org.apache.jena.hadoop.rdf.io.input.rdfxml.RdfXmlInputTest
Running org.apache.jena.hadoop.rdf.io.input.rdfxml.RdfXmlAsTriplesInputTest
Tests run: 12, Failures: 0, Errors: 0, Skipped: 3, Time elapsed: 8.92 sec - in org.apache.jena.hadoop.rdf.io.input.rdfxml.RdfXmlAsTriplesInputTest
Running org.apache.jena.hadoop.rdf.io.input.util.TrackedInputStreamTest
Tests run: 50, Failures: 0, Errors: 0, Skipped: 0, Time elapsed: 0.226 sec - in org.apache.jena.hadoop.rdf.io.input.util.TrackedInputStreamTest
Running org.apache.jena.hadoop.rdf.io.input.util.BlockInputStreamTest
Tests run: 66, Failures: 0, Errors: 0, Skipped: 0, Time elapsed: 0.292 sec - in org.apache.jena.hadoop.rdf.io.input.util.BlockInputStreamTest
Running org.apache.jena.hadoop.rdf.io.registry.TestHadoopRdfIORegistry
Tests run: 10, Failures: 0, Errors: 0, Skipped: 0, Time elapsed: 0.003 sec - in org.apache.jena.hadoop.rdf.io.registry.TestHadoopRdfIORegistry
Running org.apache.jena.hadoop.rdf.io.output.trix.TriXOutputTest
Tests run: 4, Failures: 0, Errors: 0, Skipped: 0, Time elapsed: 3.916 sec - in org.apache.jena.hadoop.rdf.io.output.trix.TriXOutputTest
Running org.apache.jena.hadoop.rdf.io.output.trig.BatchedTriGOutputTest
Tests run: 16, Failures: 0, Errors: 0, Skipped: 0, Time elapsed: 132.542 sec - in org.apache.jena.hadoop.rdf.io.output.trig.BatchedTriGOutputTest
Running org.apache.jena.hadoop.rdf.io.output.trig.StreamedTriGOutputTest
Tests run: 16, Failures: 0, Errors: 0, Skipped: 0, Time elapsed: 16.595 sec - in org.apache.jena.hadoop.rdf.io.output.trig.StreamedTriGOutputTest
Running org.apache.jena.hadoop.rdf.io.output.jsonld.JsonLdTripleOutputTest
Tests run: 4, Failures: 0, Errors: 0, Skipped: 0, Time elapsed: 5.694 sec - in org.apache.jena.hadoop.rdf.io.output.jsonld.JsonLdTripleOutputTest
Running org.apache.jena.hadoop.rdf.io.output.jsonld.JsonLdQuadOutputTest
Tests run: 4, Failures: 0, Errors: 0, Skipped: 0, Time elapsed: 12.063 sec - in org.apache.jena.hadoop.rdf.io.output.jsonld.JsonLdQuadOutputTest
Running org.apache.jena.hadoop.rdf.io.output.ntriples.NTriplesOutputTest
Tests run: 4, Failures: 0, Errors: 0, Skipped: 0, Time elapsed: 1.097 sec - in org.apache.jena.hadoop.rdf.io.output.ntriples.NTriplesOutputTest
Running org.apache.jena.hadoop.rdf.io.output.thrift.ThriftQuadOutputTest
Tests run: 4, Failures: 0, Errors: 0, Skipped: 0, Time elapsed: 0.837 sec - in org.apache.jena.hadoop.rdf.io.output.thrift.ThriftQuadOutputTest
Running org.apache.jena.hadoop.rdf.io.output.thrift.ThriftTripleOutputTest
Tests run: 4, Failures: 0, Errors: 0, Skipped: 0, Time elapsed: 0.696 sec - in org.apache.jena.hadoop.rdf.io.output.thrift.ThriftTripleOutputTest
Running org.apache.jena.hadoop.rdf.io.output.rdfjson.RdfJsonOutputTest
Tests run: 4, Failures: 0, Errors: 0, Skipped: 0, Time elapsed: 5.383 sec - in org.apache.jena.hadoop.rdf.io.output.rdfjson.RdfJsonOutputTest
Running org.apache.jena.hadoop.rdf.io.output.turtle.StreamedTurtleOutputTest
Tests run: 16, Failures: 0, Errors: 0, Skipped: 0, Time elapsed: 9.459 sec - in org.apache.jena.hadoop.rdf.io.output.turtle.StreamedTurtleOutputTest
Running org.apache.jena.hadoop.rdf.io.output.turtle.BatchedTurtleOutputTest
Tests run: 16, Failures: 0, Errors: 0, Skipped: 0, Time elapsed: 12.326 sec - in org.apache.jena.hadoop.rdf.io.output.turtle.BatchedTurtleOutputTest
Running org.apache.jena.hadoop.rdf.io.output.nquads.NQuadsOutputTest
Tests run: 4, Failures: 0, Errors: 0, Skipped: 0, Time elapsed: 1.665 sec - in org.apache.jena.hadoop.rdf.io.output.nquads.NQuadsOutputTest
Running org.apache.jena.hadoop.rdf.io.output.rdfxml.RdfXmlOutputTest
Tests run: 4, Failures: 0, Errors: 0, Skipped: 0, Time elapsed: 8.92 sec - in org.apache.jena.hadoop.rdf.io.output.rdfxml.RdfXmlOutputTest

Results :

Tests run: 984, Failures: 0, Errors: 0, Skipped: 183

[JENKINS] Recording test results
[INFO] 
[INFO] --- maven-jar-plugin:2.5:jar (default-jar) @ jena-elephas-io ---
[INFO] Building jar: <https://builds.apache.org/job/Jena_Development_Deploy/ws/jena-elephas/jena-elephas-io/target/jena-elephas-io-3.1.0-SNAPSHOT.jar>
[INFO] 
[INFO] --- maven-site-plugin:3.4:attach-descriptor (attach-descriptor) @ jena-elephas-io ---
[INFO] 
[INFO] --- maven-javadoc-plugin:2.9.1:jar (attach-javadocs) @ jena-elephas-io ---
[INFO] Building jar: <https://builds.apache.org/job/Jena_Development_Deploy/ws/jena-elephas/jena-elephas-io/target/jena-elephas-io-3.1.0-SNAPSHOT-javadoc.jar>
[INFO] 
[INFO] --- maven-install-plugin:2.5.2:install (default-install) @ jena-elephas-io ---
[INFO] Installing <https://builds.apache.org/job/Jena_Development_Deploy/ws/jena-elephas/jena-elephas-io/target/jena-elephas-io-3.1.0-SNAPSHOT.jar>
to /home/jenkins/jenkins-slave/maven-repositories/0/org/apache/jena/jena-elephas-io/3.1.0-SNAPSHOT/jena-elephas-io-3.1.0-SNAPSHOT.jar
[INFO] Installing <https://builds.apache.org/job/Jena_Development_Deploy/ws/jena-elephas/jena-elephas-io/pom.xml>
to /home/jenkins/jenkins-slave/maven-repositories/0/org/apache/jena/jena-elephas-io/3.1.0-SNAPSHOT/jena-elephas-io-3.1.0-SNAPSHOT.pom
[INFO] Installing <https://builds.apache.org/job/Jena_Development_Deploy/ws/jena-elephas/jena-elephas-io/target/jena-elephas-io-3.1.0-SNAPSHOT-javadoc.jar>
to /home/jenkins/jenkins-slave/maven-repositories/0/org/apache/jena/jena-elephas-io/3.1.0-SNAPSHOT/jena-elephas-io-3.1.0-SNAPSHOT-javadoc.jar
[INFO] 
[INFO] --- maven-deploy-plugin:2.8.2:deploy (default-deploy) @ jena-elephas-io ---
[INFO] Downloading: https://repository.apache.org/content/repositories/snapshots/org/apache/jena/jena-elephas-io/3.1.0-SNAPSHOT/maven-metadata.xml
[INFO] Downloaded: https://repository.apache.org/content/repositories/snapshots/org/apache/jena/jena-elephas-io/3.1.0-SNAPSHOT/maven-metadata.xml
(998 B at 0.0 KB/sec)
[INFO] Uploading: https://repository.apache.org/content/repositories/snapshots/org/apache/jena/jena-elephas-io/3.1.0-SNAPSHOT/jena-elephas-io-3.1.0-20160510.105054-88.jar
[INFO] Uploading: https://repository.apache.org/content/repositories/snapshots/org/apache/jena/jena-elephas-io/3.1.0-SNAPSHOT/jena-elephas-io-3.1.0-20160510.105054-88.pom
[INFO] Uploaded: https://repository.apache.org/content/repositories/snapshots/org/apache/jena/jena-elephas-io/3.1.0-SNAPSHOT/jena-elephas-io-3.1.0-20160510.105054-88.pom
(4 KB at 0.2 KB/sec)
[JENKINS] Archiving disabled
[JENKINS] Archiving disabled
[JENKINS] Archiving disabled
[JENKINS] Archiving disabled
[JENKINS] Archiving disabled
[JENKINS] Archiving disabled
[JENKINS] Archiving disabled
[JENKINS] Archiving disabled
[JENKINS] Archiving disabled
[JENKINS] Archiving disabled
[JENKINS] Archiving disabled
[JENKINS] Archiving disabled
[JENKINS] Archiving disabled
[JENKINS] Archiving disabled
[JENKINS] Archiving disabled
[JENKINS] Archiving disabled
[JENKINS] Archiving disabled
[JENKINS] Archiving disabled
[JENKINS] Archiving disabled
[JENKINS] Archiving disabled
[JENKINS] Archiving disabled
[JENKINS] Archiving disabled
[JENKINS] Archiving disabled
[JENKINS] Archiving disabled
[JENKINS] Archiving disabled
[JENKINS] Archiving disabled
[JENKINS] Archiving disabled
[JENKINS] Archiving disabled
[JENKINS] Archiving disabled
[JENKINS] Archiving disabled
[JENKINS] Archiving disabled
[JENKINS] Archiving disabled
[JENKINS] Archiving disabled
[JENKINS] Archiving disabled
[JENKINS] Archiving disabled
[JENKINS] Archiving disabled
[JENKINS] Archiving disabled
[JENKINS] Archiving disabled
[JENKINS] Archiving disabled
[JENKINS] Archiving disabled[INFO] ------------------------------------------------------------------------
[INFO] Reactor Summary:
[INFO] 
[INFO] Apache Jena - Parent ............................... SUCCESS [ 11.297 s]
[INFO] Apache Jena - Shadowed external libraries .......... SUCCESS [ 15.125 s]

[INFO] Apache Jena - IRI .................................. SUCCESS [ 16.055 s]
[INFO] Apache Jena - Base Common Environment .............. SUCCESS [ 54.210 s]
[INFO] Apache Jena - Core ................................. SUCCESS [01:14 min]
[INFO] Apache Jena - ARQ (SPARQL 1.1 Query Engine) ........ SUCCESS [01:29 min]
[INFO] Apache Jena - TDB (Native Triple Store) ............ SUCCESS [ 47.193 s]
[INFO] Apache Jena - Libraries POM ........................ SUCCESS [  8.238 s]
[INFO] Apache Jena - Command line tools ................... SUCCESS [ 31.016 s]
[INFO] Apache Jena - SPARQL Text Search ................... SUCCESS [ 56.134 s]
[INFO] Apache Jena - SPARQL Spatial Search ................ SUCCESS [ 26.360 s]
[INFO] Apache Jena - Data Tables for RDF and SPARQL ....... SUCCESS [ 23.161 s]
[INFO] Apache Jena - SDB (SQL based triple store) ......... SUCCESS [ 53.444 s]
[INFO] Apache Jena - Fuseki1 .............................. SUCCESS [ 48.801 s]
[INFO] Apache Jena - Fuseki - A SPARQL 1.1 Server ......... SUCCESS [  7.038 s]
[INFO] Apache Jena - Fuseki Server Engine ................. SUCCESS [ 28.231 s]
[INFO] Apache Jena - Fuseki WAR File ...................... SUCCESS [ 16.216 s]
[INFO] Apache Jena - Fuseki Server Standalone Jar ......... SUCCESS [ 23.260 s]
[INFO] Apache Jena - Fuseki Binary Distribution ........... SUCCESS [ 38.365 s]
[INFO] Apache Jena - Security Permissions ................. SUCCESS [ 41.250 s]
[INFO] Apache Jena - JDBC Parent .......................... SUCCESS [  8.122 s]
[INFO] Apache Jena - JDBC Core API ........................ SUCCESS [01:01 min]
[INFO] Apache Jena - JDBC Remote Endpoint Driver .......... SUCCESS [ 54.447 s]
[INFO] Apache Jena - JDBC In-Memory Driver ................ SUCCESS [ 35.781 s]
[INFO] Apache Jena - JDBC TDB Driver ...................... SUCCESS [01:10 min]
[INFO] Apache Jena - JDBC Driver Bundle ................... SUCCESS [ 34.421 s]
[INFO] Apache Jena - Maven Plugins, including schemagen ... SUCCESS [ 56.163 s]
[INFO] Apache Jena - Elephas .............................. SUCCESS [ 12.620 s]
[INFO] Apache Jena - Elephas - Common API ................. SUCCESS [ 20.532 s]
[INFO] Apache Jena - Elephas - I/O ........................ FAILURE [19:00 min]
[INFO] Apache Jena - Elephas - Map/Reduce ................. SKIPPED
[INFO] Apache Jena - Elephas - Statistics Demo App ........ SKIPPED
[INFO] Apache Jena - Distribution ......................... SKIPPED
[INFO] Apache Jena - OSGi ................................. SKIPPED
[INFO] Apache Jena - OSGi bundle .......................... SKIPPED
[INFO] Apache Jena - OSGi Karaf features .................. SKIPPED
[INFO] Apache Jena - Extras ............................... SKIPPED
[INFO] Apache Jena - Extras - Query Builder ............... SKIPPED
[INFO] Apache Jena ........................................ SKIPPED
[INFO] ------------------------------------------------------------------------
[INFO] BUILD FAILURE
[INFO] ------------------------------------------------------------------------
[INFO] Total time: 37:46 min
[INFO] Finished at: 2016-05-10T10:53:13+00:00
[INFO] Final Memory: 90M/476M
[INFO] ------------------------------------------------------------------------
Waiting for Jenkins to finish collecting data
[ERROR] Failed to execute goal org.apache.maven.plugins:maven-deploy-plugin:2.8.2:deploy (default-deploy)
on project jena-elephas-io: Failed to deploy artifacts: Could not transfer artifact org.apache.jena:jena-elephas-io:jar:3.1.0-20160510.105054-88
from/to apache.snapshots.https (https://repository.apache.org/content/repositories/snapshots):
Failed to transfer file: https://repository.apache.org/content/repositories/snapshots/org/apache/jena/jena-elephas-io/3.1.0-SNAPSHOT/jena-elephas-io-3.1.0-20160510.105054-88.jar.
Return code is: 502, ReasonPhrase: Proxy Error. -> [Help 1]
[ERROR] 
[ERROR] To see the full stack trace of the errors, re-run Maven with the -e switch.
[ERROR] Re-run Maven using the -X switch to enable full debug logging.
[ERROR] 
[ERROR] For more information about the errors and possible solutions, please read the following
articles:
[ERROR] [Help 1] http://cwiki.apache.org/confluence/display/MAVEN/MojoExecutionException
[ERROR] 
[ERROR] After correcting the problems, you can resume the build with the command
[ERROR]   mvn <goals> -rf :jena-elephas-io
channel stopped

Mime
View raw message