jena-commits mailing list archives

Site index · List index
Message view « Date » · « Thread »
Top « Date » · « Thread »
From Apache Jenkins Server <jenk...@builds.apache.org>
Subject Build failed in Jenkins: Jena_Development_Test #2322
Date Sun, 06 Mar 2016 16:11:22 GMT
See <https://builds.apache.org/job/Jena_Development_Test/2322/>

------------------------------------------
[...truncated 4268 lines...]
[INFO] Exclude: **/*.classpath
[INFO] Exclude: **/target/**/*
[INFO] Exclude: **/dependency-reduced-pom.xml
[INFO] 2 resources included (use -debug for more details)
Warning:  org.apache.xerces.jaxp.SAXParserImpl$JAXPSAXParser: Property 'http://www.oracle.com/xml/jaxp/properties/entityExpansionLimit'
is not recognized.
Compiler warnings:
  WARNING:  'org.apache.xerces.jaxp.SAXParserImpl: Property 'http://javax.xml.XMLConstants/property/accessExternalDTD'
is not recognized.'
Warning:  org.apache.xerces.parsers.SAXParser: Feature 'http://javax.xml.XMLConstants/feature/secure-processing'
is not recognized.
Warning:  org.apache.xerces.parsers.SAXParser: Property 'http://javax.xml.XMLConstants/property/accessExternalDTD'
is not recognized.
Warning:  org.apache.xerces.parsers.SAXParser: Property 'http://www.oracle.com/xml/jaxp/properties/entityExpansionLimit'
is not recognized.
[INFO] Rat check: Summary of files. Unapproved: 0 unknown: 0 generated: 0 approved: 1 licence.
[INFO] 
[INFO] --- maven-remote-resources-plugin:1.5:process (default) @ jena-osgi ---
[INFO] 
[INFO] --- maven-resources-plugin:2.6:resources (default-resources) @ jena-osgi ---
[INFO] Using 'UTF-8' encoding to copy filtered resources.
[INFO] Copying 1 resource
[INFO] Copying 3 resources
[INFO] 
[INFO] --- maven-compiler-plugin:3.1:compile (default-compile) @ jena-osgi ---
[INFO] No sources to compile
[INFO] 
[INFO] --- maven-resources-plugin:2.6:testResources (default-testResources) @ jena-osgi ---
[INFO] Using 'UTF-8' encoding to copy filtered resources.
[INFO] skip non existing resourceDirectory <https://builds.apache.org/job/Jena_Development_Test/ws/apache-jena-osgi/jena-osgi/src/test/resources>
[INFO] Copying 3 resources
[INFO] 
[INFO] --- maven-compiler-plugin:3.1:testCompile (default-testCompile) @ jena-osgi ---
[INFO] No sources to compile
[INFO] 
[INFO] --- maven-surefire-plugin:2.17:test (default-test) @ jena-osgi ---
[JENKINS] Recording test results[INFO] 
[INFO] --- maven-bundle-plugin:2.5.3:bundle (default-bundle) @ jena-osgi ---

[WARNING] Bundle org.apache.jena:jena-osgi:bundle:3.1.0-SNAPSHOT : Export org.apache.jena.datatypes.xsd,
 has 1,  private references [org.apache.xerces.impl.dv], 
[WARNING] Bundle org.apache.jena:jena-osgi:bundle:3.1.0-SNAPSHOT : Export org.apache.jena.iri.impl,
 has 1,  private references [javax.xml.transform], 
[WARNING] Bundle org.apache.jena:jena-osgi:bundle:3.1.0-SNAPSHOT : Export org.apache.jena.rdfxml.xmlinput,
 has 3,  private references [org.xml.sax, javax.xml.stream, org.w3c.dom], 
[WARNING] Bundle org.apache.jena:jena-osgi:bundle:3.1.0-SNAPSHOT : Export org.apache.jena.rdfxml.xmlinput.impl,
 has 4,  private references [org.apache.xerces.xni, org.xml.sax.ext, org.apache.xerces.parsers,
org.xml.sax], 
[WARNING] Bundle org.apache.jena:jena-osgi:bundle:3.1.0-SNAPSHOT : Export org.apache.jena.rdfxml.xmlinput.states,
 has 1,  private references [org.xml.sax], 
[WARNING] Bundle org.apache.jena:jena-osgi:bundle:3.1.0-SNAPSHOT : Export org.apache.jena.sparql.expr,
 has 1,  private references [javax.xml.datatype], 
[WARNING] Bundle org.apache.jena:jena-osgi:bundle:3.1.0-SNAPSHOT : Export org.apache.jena.sparql.expr.nodevalue,
 has 1,  private references [javax.xml.datatype], 
[INFO] 
[INFO] --- maven-site-plugin:3.4:attach-descriptor (attach-descriptor) @ jena-osgi ---
[INFO] 
[INFO] --- maven-javadoc-plugin:2.9.1:jar (attach-javadocs) @ jena-osgi ---
[JENKINS] Archiving disabled
[INFO]                                                                         
[INFO] ------------------------------------------------------------------------
[INFO] Building Apache Jena - Extras 3.1.0-SNAPSHOT
[INFO] ------------------------------------------------------------------------
[INFO] 
[INFO] --- maven-clean-plugin:2.5:clean (default-clean) @ jena-extras ---
[INFO] Deleting <https://builds.apache.org/job/Jena_Development_Test/ws/jena-extras/target>
[INFO] 
[INFO] --- maven-enforcer-plugin:1.3.1:enforce (enforce) @ jena-extras ---
[INFO] 
[INFO] --- apache-rat-plugin:0.11:check (rat-checks) @ jena-extras ---
[INFO] 52 implicit excludes (use -debug for more details).
[INFO] Exclude: **/META-INF/services/*
[INFO] Exclude: **/src-examples/data/*
[INFO] Exclude: **/dist/ABOUT
[INFO] Exclude: **/SEE_FUSEKI2
[INFO] Exclude: **/src/main/webapp/css/*
[INFO] Exclude: **/src/main/webapp/fonts/*
[INFO] Exclude: **/src/main/webapp/js/**/*
[INFO] Exclude: **/vocabularies/*
[INFO] Exclude: **/Vocabularies/*
[INFO] Exclude: **/src/main/**/*.html
[INFO] Exclude: **/src/**/package-info.java
[INFO] Exclude: **/DEPENDENCIES
[INFO] Exclude: **/*.txt
[INFO] Exclude: **/*.md
[INFO] Exclude: **/META-INF/services/*
[INFO] Exclude: **/src/test/resources/**/*
[INFO] Exclude: **/testing/**/*
[INFO] Exclude: **/log4j.properties
[INFO] Exclude: **/log4j-testing.properties
[INFO] Exclude: **/derby.log
[INFO] Exclude: **/DB/**/*
[INFO] Exclude: **/tdb*.cfg
[INFO] Exclude: **/run/**/*
[INFO] Exclude: **/*.classpath
[INFO] Exclude: **/target/**/*
[INFO] Exclude: **/dependency-reduced-pom.xml
[INFO] 1 resources included (use -debug for more details)
Warning:  org.apache.xerces.jaxp.SAXParserImpl$JAXPSAXParser: Property 'http://www.oracle.com/xml/jaxp/properties/entityExpansionLimit'
is not recognized.
Compiler warnings:
  WARNING:  'org.apache.xerces.jaxp.SAXParserImpl: Property 'http://javax.xml.XMLConstants/property/accessExternalDTD'
is not recognized.'
Warning:  org.apache.xerces.parsers.SAXParser: Feature 'http://javax.xml.XMLConstants/feature/secure-processing'
is not recognized.
Warning:  org.apache.xerces.parsers.SAXParser: Property 'http://javax.xml.XMLConstants/property/accessExternalDTD'
is not recognized.
Warning:  org.apache.xerces.parsers.SAXParser: Property 'http://www.oracle.com/xml/jaxp/properties/entityExpansionLimit'
is not recognized.
[INFO] Rat check: Summary of files. Unapproved: 0 unknown: 0 generated: 0 approved: 1 licence.
[INFO] 
[INFO] --- maven-remote-resources-plugin:1.5:process (default) @ jena-extras ---
[INFO] 
[INFO] --- maven-site-plugin:3.4:attach-descriptor (attach-descriptor) @ jena-extras ---
[INFO] 
[INFO] --- maven-javadoc-plugin:2.9.1:jar (attach-javadocs) @ jena-extras ---
[INFO] Not executing Javadoc as the project is not a Java classpath-capable package
[INFO] 
[INFO] --- maven-source-plugin:2.3:jar-no-fork (attach-sources) @ jena-extras ---
[INFO] 
[INFO] --- maven-source-plugin:2.3:jar-no-fork (bundle-sources) @ jena-extras ---
[JENKINS] Archiving disabled
[INFO]                                                                         
[INFO] ------------------------------------------------------------------------
[INFO] Building Apache Jena - Extras - Query Builder 3.1.0-SNAPSHOT
[INFO] ------------------------------------------------------------------------
[INFO] 
[INFO] --- maven-clean-plugin:2.5:clean (default-clean) @ jena-querybuilder ---
[INFO] Deleting <https://builds.apache.org/job/Jena_Development_Test/ws/jena-extras/jena-querybuilder/target>
[INFO] 
[INFO] --- maven-enforcer-plugin:1.3.1:enforce (enforce) @ jena-querybuilder ---
[INFO] 
[INFO] --- apache-rat-plugin:0.11:check (rat-checks) @ jena-querybuilder ---
[INFO] 51 implicit excludes (use -debug for more details).
[INFO] Exclude: **/META-INF/services/*
[INFO] Exclude: **/src-examples/data/*
[INFO] Exclude: **/dist/ABOUT
[INFO] Exclude: **/SEE_FUSEKI2
[INFO] Exclude: **/src/main/webapp/css/*
[INFO] Exclude: **/src/main/webapp/fonts/*
[INFO] Exclude: **/src/main/webapp/js/**/*
[INFO] Exclude: **/vocabularies/*
[INFO] Exclude: **/Vocabularies/*
[INFO] Exclude: **/src/main/**/*.html
[INFO] Exclude: **/src/**/package-info.java
[INFO] Exclude: **/DEPENDENCIES
[INFO] Exclude: **/*.txt
[INFO] Exclude: **/*.md
[INFO] Exclude: **/META-INF/services/*
[INFO] Exclude: **/src/test/resources/**/*
[INFO] Exclude: **/testing/**/*
[INFO] Exclude: **/log4j.properties
[INFO] Exclude: **/log4j-testing.properties
[INFO] Exclude: **/derby.log
[INFO] Exclude: **/DB/**/*
[INFO] Exclude: **/tdb*.cfg
[INFO] Exclude: **/run/**/*
[INFO] Exclude: **/*.classpath
[INFO] Exclude: **/target/**/*
[INFO] Exclude: **/dependency-reduced-pom.xml
[INFO] 48 resources included (use -debug for more details)
Warning:  org.apache.xerces.jaxp.SAXParserImpl$JAXPSAXParser: Property 'http://www.oracle.com/xml/jaxp/properties/entityExpansionLimit'
is not recognized.
Compiler warnings:
  WARNING:  'org.apache.xerces.jaxp.SAXParserImpl: Property 'http://javax.xml.XMLConstants/property/accessExternalDTD'
is not recognized.'
Warning:  org.apache.xerces.parsers.SAXParser: Feature 'http://javax.xml.XMLConstants/feature/secure-processing'
is not recognized.
Warning:  org.apache.xerces.parsers.SAXParser: Property 'http://javax.xml.XMLConstants/property/accessExternalDTD'
is not recognized.
Warning:  org.apache.xerces.parsers.SAXParser: Property 'http://www.oracle.com/xml/jaxp/properties/entityExpansionLimit'
is not recognized.
[INFO] Rat check: Summary of files. Unapproved: 2 unknown: 2 generated: 0 approved: 45 licence.
[JENKINS] Archiving disabled
[INFO] ------------------------------------------------------------------------
[INFO] Reactor Summary:
[INFO] 
[INFO] Apache Jena - Parent .............................. SUCCESS [4.192s]
[INFO] Apache Jena - Shadowed external libraries ......... SUCCESS [4.462s]
[INFO] Apache Jena - IRI ................................. SUCCESS [9.838s]
[INFO] Apache Jena - Base Common Environment ............. SUCCESS [25.205s]
[INFO] Apache Jena - Core ................................ SUCCESS [1:12.918s]
[INFO] Apache Jena - ARQ (SPARQL 1.1 Query Engine) ....... SUCCESS [1:29.280s]
[INFO] Apache Jena - TDB (Native Triple Store) ........... SUCCESS [19.673s]
[INFO] Apache Jena - Libraries POM ....................... SUCCESS [0.516s]
[INFO] Apache Jena - Command line tools .................. SUCCESS [21.144s]
[INFO] Apache Jena - SPARQL Text Search .................. SUCCESS [18.473s]
[INFO] Apache Jena - SPARQL Spatial Search ............... SUCCESS [12.136s]
[INFO] Apache Jena - Data Tables for RDF and SPARQL ...... SUCCESS [6.498s]
[INFO] Apache Jena - SDB (SQL based triple store) ........ SUCCESS [39.060s]
[INFO] Apache Jena - Fuseki1 ............................. SUCCESS [21.311s]
[INFO] Apache Jena - Fuseki - A SPARQL 1.1 Server ........ SUCCESS [0.381s]
[INFO] Apache Jena - Fuseki Server Engine ................ SUCCESS [21.626s]
[INFO] Apache Jena - Fuseki WAR File ..................... SUCCESS [6.240s]
[INFO] Apache Jena - Fuseki Server Standalone Jar ........ SUCCESS [5.156s]
[INFO] Apache Jena - Fuseki Binary Distribution .......... SUCCESS [7.518s]
[INFO] Apache Jena - Security Permissions ................ SUCCESS [23.802s]
[INFO] Apache Jena - JDBC Parent ......................... SUCCESS [1.187s]
[INFO] Apache Jena - JDBC Core API ....................... SUCCESS [59.671s]
[INFO] Apache Jena - JDBC Remote Endpoint Driver ......... SUCCESS [44.691s]
[INFO] Apache Jena - JDBC In-Memory Driver ............... SUCCESS [20.980s]
[INFO] Apache Jena - JDBC TDB Driver ..................... SUCCESS [45.652s]
[INFO] Apache Jena - JDBC Driver Bundle .................. SUCCESS [23.757s]
[INFO] Apache Jena - Maven Plugins, including schemagen .. SUCCESS [51.774s]
[INFO] Apache Jena - Elephas ............................. SUCCESS [0.442s]
[INFO] Apache Jena - Elephas - Common API ................ SUCCESS [6.369s]
[INFO] Apache Jena - Elephas - I/O ....................... SUCCESS [18:09.893s]
[INFO] Apache Jena - Elephas - Map/Reduce ................ SUCCESS [36.476s]
[INFO] Apache Jena - Elephas - Statistics Demo App ....... SUCCESS [5.990s]
[INFO] Apache Jena - Distribution ........................ SUCCESS [11.687s]
[INFO] Apache Jena - OSGi ................................ SUCCESS [0.265s]
[INFO] Apache Jena - OSGi bundle ......................... SUCCESS [10.172s]
[INFO] Apache Jena - Extras .............................. SUCCESS [0.531s]
[INFO] Apache Jena - Extras - Query Builder .............. FAILURE [0.184s]
[INFO] Apache Jena ....................................... SKIPPED
[INFO] ------------------------------------------------------------------------
[INFO] BUILD FAILURE
[INFO] ------------------------------------------------------------------------
[INFO] Total time: 30:33.416s
[INFO] Finished at: Sun Mar 06 16:11:10 UTC 2016
[INFO] Final Memory: 189M/2438M
[INFO] ------------------------------------------------------------------------
[JENKINS] Archiving disabled
[JENKINS] Archiving disabled
[JENKINS] Archiving disabled
[JENKINS] Archiving disabled
[JENKINS] Archiving disabled
[JENKINS] Archiving disabled
[JENKINS] Archiving disabled
[JENKINS] Archiving disabled
[JENKINS] Archiving disabled
[JENKINS] Archiving disabled
[JENKINS] Archiving disabled
[JENKINS] Archiving disabled
[JENKINS] Archiving disabled
[JENKINS] Archiving disabled
[JENKINS] Archiving disabled
[JENKINS] Archiving disabled
[JENKINS] Archiving disabled
[JENKINS] Archiving disabled
[JENKINS] Archiving disabled
[JENKINS] Archiving disabled
[JENKINS] Archiving disabled
[JENKINS] Archiving disabled
[JENKINS] Archiving disabled
[JENKINS] Archiving disabled
[JENKINS] Archiving disabled
[JENKINS] Archiving disabled
[JENKINS] Archiving disabled
[JENKINS] Archiving disabled
[JENKINS] Archiving disabled
[JENKINS] Archiving disabled
[JENKINS] Archiving disabled
[JENKINS] Archiving disabled
[JENKINS] Archiving disabled
[JENKINS] Archiving disabled
[JENKINS] Archiving disabled
[JENKINS] Archiving disabled
[JENKINS] Archiving disabled
[JENKINS] Archiving disabled
Waiting for Jenkins to finish collecting data
[ERROR] Failed to execute goal org.apache.rat:apache-rat-plugin:0.11:check (rat-checks) on
project jena-querybuilder: Too many files with unapproved license: 2 See RAT report in: <https://builds.apache.org/job/Jena_Development_Test/ws/jena-extras/jena-querybuilder/target/rat.txt>
-> [Help 1]
[ERROR] 
[ERROR] To see the full stack trace of the errors, re-run Maven with the -e switch.
[ERROR] Re-run Maven using the -X switch to enable full debug logging.
[ERROR] 
[ERROR] For more information about the errors and possible solutions, please read the following
articles:
[ERROR] [Help 1] http://cwiki.apache.org/confluence/display/MAVEN/MojoFailureException
[ERROR] 
[ERROR] After correcting the problems, you can resume the build with the command
[ERROR]   mvn <goals> -rf :jena-querybuilder
channel stopped

Mime
View raw message