jena-commits mailing list archives

Site index · List index
Message view « Date » · « Thread »
Top « Date » · « Thread »
From Apache Jenkins Server <jenk...@builds.apache.org>
Subject Build failed in Jenkins: Jena_Development_Test #2253
Date Mon, 11 Jan 2016 08:06:38 GMT
See <https://builds.apache.org/job/Jena_Development_Test/2253/changes>

Changes:

[osma] very simple caching of Lucene query results in a hash map

[osma] move Lucene query cache to Context for some persistence

[osma] remove unused import

[osma] store Multimaps in the cache for more efficient retrieval of known

[osma] switch query cache to use Jena Atlas Cache instead of plain

[osma] handle query cache misses with getOrFill and a lambda function

------------------------------------------
[...truncated 3781 lines...]
Tests run: 12, Failures: 0, Errors: 0, Skipped: 3, Time elapsed: 62.516 sec - in org.apache.jena.hadoop.rdf.io.input.jsonld.JsonLDTripleInputTest
Running org.apache.jena.hadoop.rdf.io.input.jsonld.JsonLDQuadInputTest
Tests run: 12, Failures: 0, Errors: 0, Skipped: 3, Time elapsed: 61.669 sec - in org.apache.jena.hadoop.rdf.io.input.jsonld.JsonLDQuadInputTest
Running org.apache.jena.hadoop.rdf.io.input.rdfxml.RdfXmlInputTest
Tests run: 12, Failures: 0, Errors: 0, Skipped: 3, Time elapsed: 10.074 sec - in org.apache.jena.hadoop.rdf.io.input.rdfxml.RdfXmlInputTest
Running org.apache.jena.hadoop.rdf.io.input.rdfxml.RdfXmlAsTriplesInputTest
Tests run: 12, Failures: 0, Errors: 0, Skipped: 3, Time elapsed: 9.526 sec - in org.apache.jena.hadoop.rdf.io.input.rdfxml.RdfXmlAsTriplesInputTest
Running org.apache.jena.hadoop.rdf.io.input.compressed.trig.DeflatedTriGInputTest
Tests run: 12, Failures: 0, Errors: 0, Skipped: 3, Time elapsed: 1.513 sec - in org.apache.jena.hadoop.rdf.io.input.compressed.trig.DeflatedTriGInputTest
Running org.apache.jena.hadoop.rdf.io.input.compressed.trig.GZippedTriGInputTest
Tests run: 12, Failures: 0, Errors: 0, Skipped: 3, Time elapsed: 1.444 sec - in org.apache.jena.hadoop.rdf.io.input.compressed.trig.GZippedTriGInputTest
Running org.apache.jena.hadoop.rdf.io.input.compressed.trig.BZippedTriGInputTest
Tests run: 12, Failures: 0, Errors: 0, Skipped: 3, Time elapsed: 4.923 sec - in org.apache.jena.hadoop.rdf.io.input.compressed.trig.BZippedTriGInputTest
Running org.apache.jena.hadoop.rdf.io.input.compressed.trix.BZippedTriXInputTest
Tests run: 12, Failures: 0, Errors: 0, Skipped: 3, Time elapsed: 4.581 sec - in org.apache.jena.hadoop.rdf.io.input.compressed.trix.BZippedTriXInputTest
Running org.apache.jena.hadoop.rdf.io.input.compressed.trix.GZippedTriXInputTest
Tests run: 12, Failures: 0, Errors: 0, Skipped: 3, Time elapsed: 1.221 sec - in org.apache.jena.hadoop.rdf.io.input.compressed.trix.GZippedTriXInputTest
Running org.apache.jena.hadoop.rdf.io.input.compressed.trix.DeflatedTriXInputTest
Tests run: 12, Failures: 0, Errors: 0, Skipped: 3, Time elapsed: 1.359 sec - in org.apache.jena.hadoop.rdf.io.input.compressed.trix.DeflatedTriXInputTest
Running org.apache.jena.hadoop.rdf.io.input.compressed.thrift.GZippedThriftTripleInputTest
Tests run: 12, Failures: 0, Errors: 0, Skipped: 3, Time elapsed: 7.403 sec - in org.apache.jena.hadoop.rdf.io.input.compressed.thrift.GZippedThriftTripleInputTest
Running org.apache.jena.hadoop.rdf.io.input.compressed.thrift.DeflatedThriftQuadInputTest
Tests run: 12, Failures: 0, Errors: 0, Skipped: 3, Time elapsed: 7.526 sec - in org.apache.jena.hadoop.rdf.io.input.compressed.thrift.DeflatedThriftQuadInputTest
Running org.apache.jena.hadoop.rdf.io.input.compressed.thrift.BZippedThriftTripleInputTest
Tests run: 12, Failures: 0, Errors: 0, Skipped: 3, Time elapsed: 14.759 sec - in org.apache.jena.hadoop.rdf.io.input.compressed.thrift.BZippedThriftTripleInputTest
Running org.apache.jena.hadoop.rdf.io.input.compressed.thrift.DeflatedThriftTripleInputTest
Tests run: 12, Failures: 0, Errors: 0, Skipped: 3, Time elapsed: 7.377 sec - in org.apache.jena.hadoop.rdf.io.input.compressed.thrift.DeflatedThriftTripleInputTest
Running org.apache.jena.hadoop.rdf.io.input.compressed.thrift.BZippedThriftQuadInputTest
Tests run: 12, Failures: 0, Errors: 0, Skipped: 3, Time elapsed: 15.824 sec - in org.apache.jena.hadoop.rdf.io.input.compressed.thrift.BZippedThriftQuadInputTest
Running org.apache.jena.hadoop.rdf.io.input.compressed.thrift.GZippedThriftQuadInputTest
Tests run: 12, Failures: 0, Errors: 0, Skipped: 3, Time elapsed: 7.475 sec - in org.apache.jena.hadoop.rdf.io.input.compressed.thrift.GZippedThriftQuadInputTest
Running org.apache.jena.hadoop.rdf.io.input.compressed.turtle.BZippedTurtleInputTest
Tests run: 12, Failures: 0, Errors: 0, Skipped: 3, Time elapsed: 4.868 sec - in org.apache.jena.hadoop.rdf.io.input.compressed.turtle.BZippedTurtleInputTest
Running org.apache.jena.hadoop.rdf.io.input.compressed.turtle.GZippedTurtleInputTest
Tests run: 12, Failures: 0, Errors: 0, Skipped: 3, Time elapsed: 1.271 sec - in org.apache.jena.hadoop.rdf.io.input.compressed.turtle.GZippedTurtleInputTest
Running org.apache.jena.hadoop.rdf.io.input.compressed.turtle.DeflatedTurtleInputTest
Tests run: 12, Failures: 0, Errors: 0, Skipped: 3, Time elapsed: 1.242 sec - in org.apache.jena.hadoop.rdf.io.input.compressed.turtle.DeflatedTurtleInputTest
Running org.apache.jena.hadoop.rdf.io.input.compressed.rdfjson.BZippedRdfJsonInputTest
Tests run: 12, Failures: 0, Errors: 0, Skipped: 3, Time elapsed: 12.552 sec - in org.apache.jena.hadoop.rdf.io.input.compressed.rdfjson.BZippedRdfJsonInputTest
Running org.apache.jena.hadoop.rdf.io.input.compressed.rdfjson.DeflatedRdfJsonInputTest
Tests run: 12, Failures: 0, Errors: 0, Skipped: 3, Time elapsed: 2.073 sec - in org.apache.jena.hadoop.rdf.io.input.compressed.rdfjson.DeflatedRdfJsonInputTest
Running org.apache.jena.hadoop.rdf.io.input.compressed.rdfjson.GZippedRdfJsonInputTest
Tests run: 12, Failures: 0, Errors: 0, Skipped: 3, Time elapsed: 2.007 sec - in org.apache.jena.hadoop.rdf.io.input.compressed.rdfjson.GZippedRdfJsonInputTest
Running org.apache.jena.hadoop.rdf.io.input.compressed.jsonld.GZippedJsonLDTripleInputTest
Tests run: 12, Failures: 0, Errors: 0, Skipped: 3, Time elapsed: 61.579 sec - in org.apache.jena.hadoop.rdf.io.input.compressed.jsonld.GZippedJsonLDTripleInputTest
Running org.apache.jena.hadoop.rdf.io.input.compressed.jsonld.DeflatedJsonLDQuadInputTest
Tests run: 12, Failures: 0, Errors: 0, Skipped: 3, Time elapsed: 61.924 sec - in org.apache.jena.hadoop.rdf.io.input.compressed.jsonld.DeflatedJsonLDQuadInputTest
Running org.apache.jena.hadoop.rdf.io.input.compressed.jsonld.GZippedJsonLDQuadInputTest
Tests run: 12, Failures: 0, Errors: 0, Skipped: 3, Time elapsed: 61.847 sec - in org.apache.jena.hadoop.rdf.io.input.compressed.jsonld.GZippedJsonLDQuadInputTest
Running org.apache.jena.hadoop.rdf.io.input.compressed.jsonld.BZippedJsonLDTripleInputTest
Tests run: 12, Failures: 0, Errors: 0, Skipped: 3, Time elapsed: 62.481 sec - in org.apache.jena.hadoop.rdf.io.input.compressed.jsonld.BZippedJsonLDTripleInputTest
Running org.apache.jena.hadoop.rdf.io.input.compressed.jsonld.BZippedJsonLDQuadInputTest
Tests run: 12, Failures: 0, Errors: 0, Skipped: 3, Time elapsed: 67.285 sec - in org.apache.jena.hadoop.rdf.io.input.compressed.jsonld.BZippedJsonLDQuadInputTest
Running org.apache.jena.hadoop.rdf.io.input.compressed.jsonld.DeflatedJsonLDTripleInputTest
Tests run: 12, Failures: 0, Errors: 0, Skipped: 3, Time elapsed: 61.579 sec - in org.apache.jena.hadoop.rdf.io.input.compressed.jsonld.DeflatedJsonLDTripleInputTest
Running org.apache.jena.hadoop.rdf.io.input.compressed.rdfxml.BZippedRdfXmlInputTest
Tests run: 12, Failures: 0, Errors: 0, Skipped: 3, Time elapsed: 16.866 sec - in org.apache.jena.hadoop.rdf.io.input.compressed.rdfxml.BZippedRdfXmlInputTest
Running org.apache.jena.hadoop.rdf.io.input.compressed.rdfxml.GZippedRdfXmlInputTest
Tests run: 12, Failures: 0, Errors: 0, Skipped: 3, Time elapsed: 10.064 sec - in org.apache.jena.hadoop.rdf.io.input.compressed.rdfxml.GZippedRdfXmlInputTest
Running org.apache.jena.hadoop.rdf.io.input.compressed.rdfxml.DeflatedRdfXmlInputTest
Tests run: 12, Failures: 0, Errors: 0, Skipped: 3, Time elapsed: 10.08 sec - in org.apache.jena.hadoop.rdf.io.input.compressed.rdfxml.DeflatedRdfXmlInputTest
Running org.apache.jena.hadoop.rdf.io.input.compressed.ntriples.BZippedWholeFileNTriplesInputTest
Tests run: 12, Failures: 0, Errors: 0, Skipped: 3, Time elapsed: 8.837 sec - in org.apache.jena.hadoop.rdf.io.input.compressed.ntriples.BZippedWholeFileNTriplesInputTest
Running org.apache.jena.hadoop.rdf.io.input.compressed.ntriples.DeflatedNTriplesInputTest
Tests run: 12, Failures: 0, Errors: 0, Skipped: 3, Time elapsed: 1.184 sec - in org.apache.jena.hadoop.rdf.io.input.compressed.ntriples.DeflatedNTriplesInputTest
Running org.apache.jena.hadoop.rdf.io.input.compressed.ntriples.GZippedWholeFileNTriplesInputTest
Tests run: 12, Failures: 0, Errors: 0, Skipped: 3, Time elapsed: 1.309 sec - in org.apache.jena.hadoop.rdf.io.input.compressed.ntriples.GZippedWholeFileNTriplesInputTest
Running org.apache.jena.hadoop.rdf.io.input.compressed.ntriples.BZippedNTriplesInputTest
Tests run: 12, Failures: 0, Errors: 0, Skipped: 3, Time elapsed: 3.103 sec - in org.apache.jena.hadoop.rdf.io.input.compressed.ntriples.BZippedNTriplesInputTest
Running org.apache.jena.hadoop.rdf.io.input.compressed.ntriples.DeflatedWholeFileNTriplesInputTest
Tests run: 12, Failures: 0, Errors: 0, Skipped: 3, Time elapsed: 1.301 sec - in org.apache.jena.hadoop.rdf.io.input.compressed.ntriples.DeflatedWholeFileNTriplesInputTest
Running org.apache.jena.hadoop.rdf.io.input.compressed.ntriples.GZippedNTriplesInputTest
Tests run: 12, Failures: 0, Errors: 0, Skipped: 3, Time elapsed: 1.014 sec - in org.apache.jena.hadoop.rdf.io.input.compressed.ntriples.GZippedNTriplesInputTest
Running org.apache.jena.hadoop.rdf.io.input.compressed.nquads.DeflatedWholeFileNQuadsInputTest
Tests run: 12, Failures: 0, Errors: 0, Skipped: 3, Time elapsed: 1.556 sec - in org.apache.jena.hadoop.rdf.io.input.compressed.nquads.DeflatedWholeFileNQuadsInputTest
Running org.apache.jena.hadoop.rdf.io.input.compressed.nquads.BZipppedNQuadsInputTest
Tests run: 12, Failures: 0, Errors: 0, Skipped: 3, Time elapsed: 4.328 sec - in org.apache.jena.hadoop.rdf.io.input.compressed.nquads.BZipppedNQuadsInputTest
Running org.apache.jena.hadoop.rdf.io.input.compressed.nquads.DeflatedNQuadsInputTest
Tests run: 12, Failures: 0, Errors: 0, Skipped: 3, Time elapsed: 1.166 sec - in org.apache.jena.hadoop.rdf.io.input.compressed.nquads.DeflatedNQuadsInputTest
Running org.apache.jena.hadoop.rdf.io.input.compressed.nquads.BZipppedWholeFileNQuadsInputTest
Tests run: 12, Failures: 0, Errors: 0, Skipped: 3, Time elapsed: 9.289 sec - in org.apache.jena.hadoop.rdf.io.input.compressed.nquads.BZipppedWholeFileNQuadsInputTest
Running org.apache.jena.hadoop.rdf.io.input.compressed.nquads.GZippedWholeFileNQuadsInputTest
Tests run: 12, Failures: 0, Errors: 0, Skipped: 3, Time elapsed: 1.479 sec - in org.apache.jena.hadoop.rdf.io.input.compressed.nquads.GZippedWholeFileNQuadsInputTest
Running org.apache.jena.hadoop.rdf.io.input.compressed.nquads.GZippedNQuadsInputTest
Tests run: 12, Failures: 0, Errors: 0, Skipped: 3, Time elapsed: 1.143 sec - in org.apache.jena.hadoop.rdf.io.input.compressed.nquads.GZippedNQuadsInputTest
Running org.apache.jena.hadoop.rdf.io.input.ntriples.NTriplesInputTest
Tests run: 12, Failures: 0, Errors: 0, Skipped: 0, Time elapsed: 1.015 sec - in org.apache.jena.hadoop.rdf.io.input.ntriples.NTriplesInputTest
Running org.apache.jena.hadoop.rdf.io.input.ntriples.WholeFileNTriplesInputTest
Tests run: 12, Failures: 0, Errors: 0, Skipped: 3, Time elapsed: 1.005 sec - in org.apache.jena.hadoop.rdf.io.input.ntriples.WholeFileNTriplesInputTest
Running org.apache.jena.hadoop.rdf.io.input.ntriples.WholeFileNTriplesAsTriplesInputTest
Tests run: 12, Failures: 0, Errors: 0, Skipped: 3, Time elapsed: 0.973 sec - in org.apache.jena.hadoop.rdf.io.input.ntriples.WholeFileNTriplesAsTriplesInputTest
Running org.apache.jena.hadoop.rdf.io.input.ntriples.BlockedNTriplesInputTest
Tests run: 12, Failures: 0, Errors: 0, Skipped: 0, Time elapsed: 2.659 sec - in org.apache.jena.hadoop.rdf.io.input.ntriples.BlockedNTriplesInputTest
Running org.apache.jena.hadoop.rdf.io.input.nquads.NQuadsInputTest
Tests run: 12, Failures: 0, Errors: 0, Skipped: 0, Time elapsed: 1.056 sec - in org.apache.jena.hadoop.rdf.io.input.nquads.NQuadsInputTest
Running org.apache.jena.hadoop.rdf.io.input.nquads.WholeFileNQuadsInputTest
Tests run: 12, Failures: 0, Errors: 0, Skipped: 3, Time elapsed: 1.101 sec - in org.apache.jena.hadoop.rdf.io.input.nquads.WholeFileNQuadsInputTest
Running org.apache.jena.hadoop.rdf.io.input.nquads.WholeFileNQuadsAsQuadsInputTest
Tests run: 12, Failures: 0, Errors: 0, Skipped: 3, Time elapsed: 1.025 sec - in org.apache.jena.hadoop.rdf.io.input.nquads.WholeFileNQuadsAsQuadsInputTest
Running org.apache.jena.hadoop.rdf.io.input.nquads.BlockedNQuadsInputTest
Tests run: 12, Failures: 0, Errors: 0, Skipped: 0, Time elapsed: 5.481 sec - in org.apache.jena.hadoop.rdf.io.input.nquads.BlockedNQuadsInputTest
Running org.apache.jena.hadoop.rdf.io.registry.TestHadoopRdfIORegistry
Tests run: 10, Failures: 0, Errors: 0, Skipped: 0, Time elapsed: 0.004 sec - in org.apache.jena.hadoop.rdf.io.registry.TestHadoopRdfIORegistry
Running org.apache.jena.hadoop.rdf.io.output.trig.StreamedTriGOutputTest
Tests run: 16, Failures: 0, Errors: 0, Skipped: 0, Time elapsed: 10.223 sec - in org.apache.jena.hadoop.rdf.io.output.trig.StreamedTriGOutputTest
Running org.apache.jena.hadoop.rdf.io.output.trig.BatchedTriGOutputTest
Tests run: 16, Failures: 0, Errors: 0, Skipped: 0, Time elapsed: 144.57 sec - in org.apache.jena.hadoop.rdf.io.output.trig.BatchedTriGOutputTest
Running org.apache.jena.hadoop.rdf.io.output.trix.TriXOutputTest
Tests run: 4, Failures: 0, Errors: 0, Skipped: 0, Time elapsed: 3.232 sec - in org.apache.jena.hadoop.rdf.io.output.trix.TriXOutputTest
Running org.apache.jena.hadoop.rdf.io.output.thrift.ThriftQuadOutputTest
Tests run: 4, Failures: 0, Errors: 0, Skipped: 0, Time elapsed: 0.837 sec - in org.apache.jena.hadoop.rdf.io.output.thrift.ThriftQuadOutputTest
Running org.apache.jena.hadoop.rdf.io.output.thrift.ThriftTripleOutputTest
Tests run: 4, Failures: 0, Errors: 0, Skipped: 0, Time elapsed: 0.682 sec - in org.apache.jena.hadoop.rdf.io.output.thrift.ThriftTripleOutputTest
Running org.apache.jena.hadoop.rdf.io.output.turtle.BatchedTurtleOutputTest
Tests run: 16, Failures: 0, Errors: 0, Skipped: 0, Time elapsed: 9.223 sec - in org.apache.jena.hadoop.rdf.io.output.turtle.BatchedTurtleOutputTest
Running org.apache.jena.hadoop.rdf.io.output.turtle.StreamedTurtleOutputTest
Tests run: 16, Failures: 0, Errors: 0, Skipped: 0, Time elapsed: 6.746 sec - in org.apache.jena.hadoop.rdf.io.output.turtle.StreamedTurtleOutputTest
Running org.apache.jena.hadoop.rdf.io.output.rdfjson.RdfJsonOutputTest
Tests run: 4, Failures: 0, Errors: 0, Skipped: 0, Time elapsed: 3.892 sec - in org.apache.jena.hadoop.rdf.io.output.rdfjson.RdfJsonOutputTest
Running org.apache.jena.hadoop.rdf.io.output.jsonld.JsonLdTripleOutputTest
Tests run: 4, Failures: 0, Errors: 0, Skipped: 0, Time elapsed: 3.934 sec - in org.apache.jena.hadoop.rdf.io.output.jsonld.JsonLdTripleOutputTest
Running org.apache.jena.hadoop.rdf.io.output.jsonld.JsonLdQuadOutputTest
Tests run: 4, Failures: 0, Errors: 0, Skipped: 0, Time elapsed: 6.703 sec - in org.apache.jena.hadoop.rdf.io.output.jsonld.JsonLdQuadOutputTest
Running org.apache.jena.hadoop.rdf.io.output.rdfxml.RdfXmlOutputTest
Tests run: 4, Failures: 0, Errors: 0, Skipped: 0, Time elapsed: 10.076 sec - in org.apache.jena.hadoop.rdf.io.output.rdfxml.RdfXmlOutputTest
Running org.apache.jena.hadoop.rdf.io.output.ntriples.NTriplesOutputTest
Tests run: 4, Failures: 0, Errors: 0, Skipped: 0, Time elapsed: 0.584 sec - in org.apache.jena.hadoop.rdf.io.output.ntriples.NTriplesOutputTest
Running org.apache.jena.hadoop.rdf.io.output.nquads.NQuadsOutputTest
Tests run: 4, Failures: 0, Errors: 0, Skipped: 0, Time elapsed: 0.638 sec - in org.apache.jena.hadoop.rdf.io.output.nquads.NQuadsOutputTest

Results :

Tests run: 984, Failures: 0, Errors: 0, Skipped: 183

[JENKINS] Recording test results
[INFO] 
[INFO] --- maven-jar-plugin:2.5:jar (default-jar) @ jena-elephas-io ---
[INFO] Building jar: <https://builds.apache.org/job/Jena_Development_Test/ws/jena-elephas/jena-elephas-io/target/jena-elephas-io-3.1.0-SNAPSHOT.jar>
[INFO] 
[INFO] --- maven-site-plugin:3.4:attach-descriptor (attach-descriptor) @ jena-elephas-io ---
[INFO] 
[INFO] --- maven-javadoc-plugin:2.9.1:jar (attach-javadocs) @ jena-elephas-io ---
[INFO] 
1 error
[JENKINS] Archiving disabled
[INFO] ------------------------------------------------------------------------
[INFO] Reactor Summary:
[INFO] 
[INFO] Apache Jena - Parent .............................. SUCCESS [3.151s]
[INFO] Apache Jena - Shadowed external libraries ......... SUCCESS [3.590s]
[INFO] Apache Jena - IRI ................................. SUCCESS [7.914s]
[INFO] Apache Jena - Base Common Environment ............. SUCCESS [19.478s]
[INFO] Apache Jena - Core ................................ SUCCESS [58.349s]
[INFO] Apache Jena - ARQ (SPARQL 1.1 Query Engine) ....... SUCCESS [1:09.533s]
[INFO] Apache Jena - TDB (Native Triple Store) ........... SUCCESS [1:41.968s]
[INFO] Apache Jena - Libraries POM ....................... SUCCESS [0.445s]
[INFO] Apache Jena - Command line tools .................. SUCCESS [17.623s]
[INFO] Apache Jena - SPARQL Text Search .................. SUCCESS [19.177s]
[INFO] Apache Jena - SPARQL Spatial Search ............... SUCCESS [17.786s]
[INFO] Apache Jena - Data Tables for RDF and SPARQL ...... SUCCESS [6.289s]
[INFO] Apache Jena - SDB (SQL based triple store) ........ SUCCESS [45.784s]
[INFO] Apache Jena - Fuseki1 ............................. SUCCESS [18.602s]
[INFO] Apache Jena - Fuseki - A SPARQL 1.1 Server ........ SUCCESS [0.309s]
[INFO] Apache Jena - Fuseki Server Engine ................ SUCCESS [14.220s]
[INFO] Apache Jena - Fuseki WAR File ..................... SUCCESS [5.635s]
[INFO] Apache Jena - Fuseki Server Standalone Jar ........ SUCCESS [4.822s]
[INFO] Apache Jena - Fuseki Binary Distribution .......... SUCCESS [6.763s]
[INFO] Apache Jena - Security Permissions ................ SUCCESS [17.072s]
[INFO] Apache Jena - JDBC Parent ......................... SUCCESS [1.284s]
[INFO] Apache Jena - JDBC Core API ....................... SUCCESS [42.573s]
[INFO] Apache Jena - JDBC Remote Endpoint Driver ......... SUCCESS [37.034s]
[INFO] Apache Jena - JDBC In-Memory Driver ............... SUCCESS [17.489s]
[INFO] Apache Jena - JDBC TDB Driver ..................... SUCCESS [4:35.574s]
[INFO] Apache Jena - JDBC Driver Bundle .................. SUCCESS [18.096s]
[INFO] Apache Jena - Maven Plugins, including schemagen .. SUCCESS [36.644s]
[INFO] Apache Jena - Elephas ............................. SUCCESS [0.308s]
[INFO] Apache Jena - Elephas - Common API ................ SUCCESS [5.684s]
[INFO] Apache Jena - Elephas - I/O ....................... FAILURE [16:14.565s]
[INFO] Apache Jena - Elephas - Map/Reduce ................ SKIPPED
[INFO] Apache Jena - Elephas - Statistics Demo App ....... SKIPPED
[INFO] Apache Jena - Distribution ........................ SKIPPED
[INFO] Apache Jena - OSGi ................................ SKIPPED
[INFO] Apache Jena - OSGi bundle ......................... SKIPPED
[INFO] Apache Jena - Extras .............................. SKIPPED
[INFO] Apache Jena - Extras - Query Builder .............. SKIPPED
[INFO] Apache Jena ....................................... SKIPPED
[INFO] ------------------------------------------------------------------------
[INFO] BUILD FAILURE
[INFO] ------------------------------------------------------------------------
[INFO] Total time: 31:02.052s
[INFO] Finished at: Mon Jan 11 08:06:25 UTC 2016
[INFO] Final Memory: 148M/1954M
[INFO] ------------------------------------------------------------------------
[JENKINS] Archiving disabled
[JENKINS] Archiving disabled
[JENKINS] Archiving disabled
[JENKINS] Archiving disabled
[JENKINS] Archiving disabled
[JENKINS] Archiving disabled
[JENKINS] Archiving disabled
[JENKINS] Archiving disabled
[JENKINS] Archiving disabled
[JENKINS] Archiving disabled
[JENKINS] Archiving disabled
[JENKINS] Archiving disabled
[JENKINS] Archiving disabled
[JENKINS] Archiving disabled
[JENKINS] Archiving disabled
[JENKINS] Archiving disabled
[JENKINS] Archiving disabled
[JENKINS] Archiving disabled
[JENKINS] Archiving disabled
[JENKINS] Archiving disabled
[JENKINS] Archiving disabled
[JENKINS] Archiving disabled
[JENKINS] Archiving disabled
[JENKINS] Archiving disabled
[JENKINS] Archiving disabled
[JENKINS] Archiving disabled
[JENKINS] Archiving disabled
[JENKINS] Archiving disabled
[JENKINS] Archiving disabled
[JENKINS] Archiving disabled
[JENKINS] Archiving disabled
[JENKINS] Archiving disabled
[JENKINS] Archiving disabled
[JENKINS] Archiving disabled
[JENKINS] Archiving disabled
[JENKINS] Archiving disabled
[JENKINS] Archiving disabled
[JENKINS] Archiving disabled
Waiting for Jenkins to finish collecting data
[ERROR] Failed to execute goal org.apache.maven.plugins:maven-javadoc-plugin:2.9.1:jar (attach-javadocs)
on project jena-elephas-io: MavenReportException: Error while creating archive:
[ERROR] Exit code: 1 - error: error reading /home/jenkins/jenkins-slave/maven-repositories/1/com/sun/jersey/jersey-client/1.9/jersey-client-1.9.jar;
error in opening zip file
[ERROR] 
[ERROR] Command line was: /home/jenkins/jenkins-slave/tools/hudson.model.JDK/latest1.8/jre/../bin/javadoc
@options @packages
[ERROR] 
[ERROR] Refer to the generated Javadoc files in '<https://builds.apache.org/job/Jena_Development_Test/ws/jena-elephas/jena-elephas-io/target/apidocs'>
dir.
[ERROR] -> [Help 1]
[ERROR] 
[ERROR] To see the full stack trace of the errors, re-run Maven with the -e switch.
[ERROR] Re-run Maven using the -X switch to enable full debug logging.
[ERROR] 
[ERROR] For more information about the errors and possible solutions, please read the following
articles:
[ERROR] [Help 1] http://cwiki.apache.org/confluence/display/MAVEN/MojoExecutionException
[ERROR] 
[ERROR] After correcting the problems, you can resume the build with the command
[ERROR]   mvn <goals> -rf :jena-elephas-io
channel stopped

Mime
View raw message