jena-commits mailing list archives

Site index · List index
Message view « Date » · « Thread »
Top « Date » · « Thread »
From Apache Jenkins Server <jenk...@builds.apache.org>
Subject Build failed in Jenkins: Jena_Development_Test_Windows » Apache Jena - ARQ (SPARQL 1.1 Query Engine) #606
Date Sun, 12 Jul 2015 08:53:16 GMT
See <https://builds.apache.org/job/Jena_Development_Test_Windows/org.apache.jena$jena-arq/606/>

------------------------------------------
[INFO]                                                                         
[INFO] ------------------------------------------------------------------------
[INFO] Building Apache Jena - ARQ (SPARQL 1.1 Query Engine) 3.0.0-SNAPSHOT
[INFO] ------------------------------------------------------------------------
[INFO] 
[INFO] --- maven-clean-plugin:2.5:clean (default-clean) @ jena-arq ---
[INFO] 
[INFO] --- maven-enforcer-plugin:1.3.1:enforce (enforce) @ jena-arq ---
[INFO] 
[INFO] --- apache-rat-plugin:0.11:check (rat-checks) @ jena-arq ---
[INFO] 51 implicit excludes (use -debug for more details).
[INFO] Exclude: **/src-examples/data/*
[INFO] Exclude: **/dist/ABOUT
[INFO] Exclude: **/SEE_FUSEKI2
[INFO] Exclude: **/src/main/webapp/css/*
[INFO] Exclude: **/src/main/webapp/fonts/*
[INFO] Exclude: **/src/main/webapp/js/**/*
[INFO] Exclude: **/vocabularies/*
[INFO] Exclude: **/Vocabularies/*
[INFO] Exclude: **/src/main/**/*.html
[INFO] Exclude: **/src/**/package-info.java
[INFO] Exclude: **/DEPENDENCIES
[INFO] Exclude: **/*.txt
[INFO] Exclude: **/*.md
[INFO] Exclude: **/META-INF/services/*
[INFO] Exclude: **/src/test/resources/**/*
[INFO] Exclude: **/testing/**/*
[INFO] Exclude: **/log4j.properties
[INFO] Exclude: **/log4j-testing.properties
[INFO] Exclude: **/derby.log
[INFO] Exclude: **/DB/**/*
[INFO] Exclude: **/tdb*.cfg
[INFO] Exclude: **/run/**/*
[INFO] Exclude: **/*.classpath
[INFO] Exclude: **/target/**/*
[INFO] Exclude: **/dependency-reduced-pom.xml
[INFO] 1735 resources included (use -debug for more details)
Warning:  org.apache.xerces.jaxp.SAXParserImpl$JAXPSAXParser: Property 'http://www.oracle.com/xml/jaxp/properties/entityExpansionLimit'
is not recognized.
Compiler warnings:
  WARNING:  'org.apache.xerces.jaxp.SAXParserImpl: Property 'http://javax.xml.XMLConstants/property/accessExternalDTD'
is not recognized.'
Warning:  org.apache.xerces.parsers.SAXParser: Feature 'http://javax.xml.XMLConstants/feature/secure-processing'
is not recognized.
Warning:  org.apache.xerces.parsers.SAXParser: Property 'http://javax.xml.XMLConstants/property/accessExternalDTD'
is not recognized.
Warning:  org.apache.xerces.parsers.SAXParser: Property 'http://www.oracle.com/xml/jaxp/properties/entityExpansionLimit'
is not recognized.
[INFO] Rat check: Summary of files. Unapproved: 0 unknown: 0 generated: 0 approved: 1680 licence.
[INFO] 
[INFO] --- maven-remote-resources-plugin:1.5:process (default) @ jena-arq ---
[INFO] 
[INFO] --- maven-resources-plugin:2.6:resources (default-resources) @ jena-arq ---
[INFO] Using 'UTF-8' encoding to copy filtered resources.
[INFO] Copying 1 resource
[INFO] Copying 3 resources
[INFO] Copying 3 resources
[INFO] 
[INFO] --- maven-compiler-plugin:3.1:compile (default-compile) @ jena-arq ---
[INFO] Changes detected - recompiling the module!
[INFO] Compiling 1390 source files to F:\jenkins\jenkins-slave\workspace\Jena_Development_Test_Windows\jena-arq\target\classes
[INFO] -------------------------------------------------------------
[ERROR] COMPILATION ERROR : 
[INFO] -------------------------------------------------------------
[ERROR] /F:/jenkins/jenkins-slave/workspace/Jena_Development_Test_Windows/jena-arq/src/main/java/org/apache/jena/sparql/algebra/optimize/TransformEliminateAssignments.java:[565,1]
illegal start of type
[ERROR] /F:/jenkins/jenkins-slave/workspace/Jena_Development_Test_Windows/jena-arq/src/main/java/org/apache/jena/sparql/algebra/optimize/TransformEliminateAssignments.java:[565,3]
';' expected
[ERROR] /F:/jenkins/jenkins-slave/workspace/Jena_Development_Test_Windows/jena-arq/src/main/java/org/apache/jena/sparql/algebra/optimize/TransformEliminateAssignments.java:[565,5]
illegal start of type
[ERROR] /F:/jenkins/jenkins-slave/workspace/Jena_Development_Test_Windows/jena-arq/src/main/java/org/apache/jena/sparql/algebra/optimize/TransformEliminateAssignments.java:[565,7]
<identifier> expected
[ERROR] /F:/jenkins/jenkins-slave/workspace/Jena_Development_Test_Windows/jena-arq/src/main/java/org/apache/jena/sparql/algebra/optimize/TransformEliminateAssignments.java:[565,8]
';' expected
[ERROR] /F:/jenkins/jenkins-slave/workspace/Jena_Development_Test_Windows/jena-arq/src/main/java/org/apache/jena/sparql/algebra/optimize/TransformEliminateAssignments.java:[565,13]
illegal start of type
[ERROR] /F:/jenkins/jenkins-slave/workspace/Jena_Development_Test_Windows/jena-arq/src/main/java/org/apache/jena/sparql/algebra/optimize/TransformEliminateAssignments.java:[565,18]
';' expected
[ERROR] /F:/jenkins/jenkins-slave/workspace/Jena_Development_Test_Windows/jena-arq/src/main/java/org/apache/jena/sparql/algebra/optimize/TransformEliminateAssignments.java:[565,22]
<identifier> expected
[ERROR] /F:/jenkins/jenkins-slave/workspace/Jena_Development_Test_Windows/jena-arq/src/main/java/org/apache/jena/sparql/algebra/optimize/TransformEliminateAssignments.java:[565,26]
<identifier> expected
[ERROR] /F:/jenkins/jenkins-slave/workspace/Jena_Development_Test_Windows/jena-arq/src/main/java/org/apache/jena/sparql/algebra/optimize/TransformEliminateAssignments.java:[565,31]
<identifier> expected
[ERROR] /F:/jenkins/jenkins-slave/workspace/Jena_Development_Test_Windows/jena-arq/src/main/java/org/apache/jena/sparql/algebra/optimize/TransformEliminateAssignments.java:[565,36]
<identifier> expected
[ERROR] /F:/jenkins/jenkins-slave/workspace/Jena_Development_Test_Windows/jena-arq/src/main/java/org/apache/jena/sparql/algebra/optimize/TransformEliminateAssignments.java:[565,40]
<identifier> expected
[ERROR] /F:/jenkins/jenkins-slave/workspace/Jena_Development_Test_Windows/jena-arq/src/main/java/org/apache/jena/sparql/algebra/optimize/TransformEliminateAssignments.java:[565,47]
<identifier> expected
[ERROR] /F:/jenkins/jenkins-slave/workspace/Jena_Development_Test_Windows/jena-arq/src/main/java/org/apache/jena/sparql/algebra/optimize/TransformEliminateAssignments.java:[565,52]
<identifier> expected
[ERROR] /F:/jenkins/jenkins-slave/workspace/Jena_Development_Test_Windows/jena-arq/src/main/java/org/apache/jena/sparql/algebra/optimize/TransformEliminateAssignments.java:[565,59]
<identifier> expected
[ERROR] /F:/jenkins/jenkins-slave/workspace/Jena_Development_Test_Windows/jena-arq/src/main/java/org/apache/jena/sparql/algebra/optimize/TransformEliminateAssignments.java:[565,67]
<identifier> expected
[ERROR] /F:/jenkins/jenkins-slave/workspace/Jena_Development_Test_Windows/jena-arq/src/main/java/org/apache/jena/sparql/algebra/optimize/TransformEliminateAssignments.java:[565,76]
<identifier> expected
[ERROR] /F:/jenkins/jenkins-slave/workspace/Jena_Development_Test_Windows/jena-arq/src/main/java/org/apache/jena/sparql/algebra/optimize/TransformEliminateAssignments.java:[565,111]
<identifier> expected
[ERROR] /F:/jenkins/jenkins-slave/workspace/Jena_Development_Test_Windows/jena-arq/src/main/java/org/apache/jena/sparql/algebra/optimize/TransformEliminateAssignments.java:[566,3]
illegal start of type
[ERROR] /F:/jenkins/jenkins-slave/workspace/Jena_Development_Test_Windows/jena-arq/src/main/java/org/apache/jena/sparql/algebra/optimize/TransformEliminateAssignments.java:[566,5]
<identifier> expected
[ERROR] /F:/jenkins/jenkins-slave/workspace/Jena_Development_Test_Windows/jena-arq/src/main/java/org/apache/jena/sparql/algebra/optimize/TransformEliminateAssignments.java:[568,9]
illegal start of expression
[ERROR] /F:/jenkins/jenkins-slave/workspace/Jena_Development_Test_Windows/jena-arq/src/main/java/org/apache/jena/sparql/algebra/optimize/TransformEliminateAssignments.java:[568,15]
';' expected
[ERROR] /F:/jenkins/jenkins-slave/workspace/Jena_Development_Test_Windows/jena-arq/src/main/java/org/apache/jena/sparql/algebra/optimize/TransformEliminateAssignments.java:[568,21]
invalid method declaration; return type required
[ERROR] /F:/jenkins/jenkins-slave/workspace/Jena_Development_Test_Windows/jena-arq/src/main/java/org/apache/jena/sparql/algebra/optimize/TransformEliminateAssignments.java:[610,1]
illegal start of type
[ERROR] /F:/jenkins/jenkins-slave/workspace/Jena_Development_Test_Windows/jena-arq/src/main/java/org/apache/jena/sparql/algebra/optimize/TransformEliminateAssignments.java:[610,4]
';' expected
[ERROR] /F:/jenkins/jenkins-slave/workspace/Jena_Development_Test_Windows/jena-arq/src/main/java/org/apache/jena/sparql/algebra/optimize/TransformEliminateAssignments.java:[610,7]
illegal start of type
[ERROR] /F:/jenkins/jenkins-slave/workspace/Jena_Development_Test_Windows/jena-arq/src/main/java/org/apache/jena/sparql/algebra/optimize/TransformEliminateAssignments.java:[610,8]
<identifier> expected
[ERROR] /F:/jenkins/jenkins-slave/workspace/Jena_Development_Test_Windows/jena-arq/src/main/java/org/apache/jena/sparql/algebra/optimize/TransformEliminateAssignments.java:[610,11]
';' expected
[ERROR] /F:/jenkins/jenkins-slave/workspace/Jena_Development_Test_Windows/jena-arq/src/main/java/org/apache/jena/sparql/algebra/optimize/TransformEliminateAssignments.java:[610,16]
illegal start of type
[ERROR] /F:/jenkins/jenkins-slave/workspace/Jena_Development_Test_Windows/jena-arq/src/main/java/org/apache/jena/sparql/algebra/optimize/TransformEliminateAssignments.java:[610,30]
';' expected
[ERROR] /F:/jenkins/jenkins-slave/workspace/Jena_Development_Test_Windows/jena-arq/src/main/java/org/apache/jena/sparql/algebra/optimize/TransformEliminateAssignments.java:[610,40]
';' expected
[ERROR] /F:/jenkins/jenkins-slave/workspace/Jena_Development_Test_Windows/jena-arq/src/main/java/org/apache/jena/sparql/algebra/optimize/TransformEliminateAssignments.java:[610,46]
<identifier> expected
[ERROR] /F:/jenkins/jenkins-slave/workspace/Jena_Development_Test_Windows/jena-arq/src/main/java/org/apache/jena/sparql/algebra/optimize/TransformEliminateAssignments.java:[610,76]
<identifier> expected
[ERROR] /F:/jenkins/jenkins-slave/workspace/Jena_Development_Test_Windows/jena-arq/src/main/java/org/apache/jena/sparql/algebra/optimize/TransformEliminateAssignments.java:[610,77]
';' expected
[ERROR] /F:/jenkins/jenkins-slave/workspace/Jena_Development_Test_Windows/jena-arq/src/main/java/org/apache/jena/sparql/algebra/optimize/TransformEliminateAssignments.java:[610,80]
illegal start of type
[ERROR] /F:/jenkins/jenkins-slave/workspace/Jena_Development_Test_Windows/jena-arq/src/main/java/org/apache/jena/sparql/algebra/optimize/TransformEliminateAssignments.java:[610,81]
<identifier> expected
[ERROR] /F:/jenkins/jenkins-slave/workspace/Jena_Development_Test_Windows/jena-arq/src/main/java/org/apache/jena/sparql/algebra/optimize/TransformEliminateAssignments.java:[610,82]
';' expected
[ERROR] /F:/jenkins/jenkins-slave/workspace/Jena_Development_Test_Windows/jena-arq/src/main/java/org/apache/jena/sparql/algebra/optimize/TransformEliminateAssignments.java:[610,86]
illegal start of type
[ERROR] /F:/jenkins/jenkins-slave/workspace/Jena_Development_Test_Windows/jena-arq/src/main/java/org/apache/jena/sparql/algebra/optimize/TransformEliminateAssignments.java:[610,90]
';' expected
[ERROR] /F:/jenkins/jenkins-slave/workspace/Jena_Development_Test_Windows/jena-arq/src/main/java/org/apache/jena/sparql/algebra/optimize/TransformEliminateAssignments.java:[610,94]
<identifier> expected
[ERROR] /F:/jenkins/jenkins-slave/workspace/Jena_Development_Test_Windows/jena-arq/src/main/java/org/apache/jena/sparql/algebra/optimize/TransformEliminateAssignments.java:[610,99]
<identifier> expected
[ERROR] /F:/jenkins/jenkins-slave/workspace/Jena_Development_Test_Windows/jena-arq/src/main/java/org/apache/jena/sparql/algebra/optimize/TransformEliminateAssignments.java:[610,104]
<identifier> expected
[ERROR] /F:/jenkins/jenkins-slave/workspace/Jena_Development_Test_Windows/jena-arq/src/main/java/org/apache/jena/sparql/algebra/optimize/TransformEliminateAssignments.java:[610,108]
<identifier> expected
[ERROR] /F:/jenkins/jenkins-slave/workspace/Jena_Development_Test_Windows/jena-arq/src/main/java/org/apache/jena/sparql/algebra/optimize/TransformEliminateAssignments.java:[610,111]
<identifier> expected
[ERROR] /F:/jenkins/jenkins-slave/workspace/Jena_Development_Test_Windows/jena-arq/src/main/java/org/apache/jena/sparql/algebra/optimize/TransformEliminateAssignments.java:[610,115]
<identifier> expected
[ERROR] /F:/jenkins/jenkins-slave/workspace/Jena_Development_Test_Windows/jena-arq/src/main/java/org/apache/jena/sparql/algebra/optimize/TransformEliminateAssignments.java:[610,120]
<identifier> expected
[ERROR] /F:/jenkins/jenkins-slave/workspace/Jena_Development_Test_Windows/jena-arq/src/main/java/org/apache/jena/sparql/algebra/optimize/TransformEliminateAssignments.java:[610,127]
<identifier> expected
[ERROR] /F:/jenkins/jenkins-slave/workspace/Jena_Development_Test_Windows/jena-arq/src/main/java/org/apache/jena/sparql/algebra/optimize/TransformEliminateAssignments.java:[610,135]
<identifier> expected
[ERROR] /F:/jenkins/jenkins-slave/workspace/Jena_Development_Test_Windows/jena-arq/src/main/java/org/apache/jena/sparql/algebra/optimize/TransformEliminateAssignments.java:[610,144]
<identifier> expected
[ERROR] /F:/jenkins/jenkins-slave/workspace/Jena_Development_Test_Windows/jena-arq/src/main/java/org/apache/jena/sparql/algebra/optimize/TransformEliminateAssignments.java:[610,179]
<identifier> expected
[ERROR] /F:/jenkins/jenkins-slave/workspace/Jena_Development_Test_Windows/jena-arq/src/main/java/org/apache/jena/sparql/algebra/optimize/TransformEliminateAssignments.java:[650,2]
reached end of file while parsing
[INFO] 51 errors 
[INFO] -------------------------------------------------------------
[JENKINS] Archiving disabled

Mime
View raw message