jena-commits mailing list archives

Site index · List index
Message view « Date » · « Thread »
Top « Date » · « Thread »
From Apache Jenkins Server <jenk...@builds.apache.org>
Subject Build failed in Jenkins: Jena_Development_Test #2012
Date Sun, 19 Jul 2015 10:06:28 GMT
See <https://builds.apache.org/job/Jena_Development_Test/2012/changes>

Changes:

[claude] Moved permission exceptions into jena-core so they can be included by Fuseki and
other applications that may need to respond to them.

------------------------------------------
[...truncated 296 lines...]
[INFO] 51 implicit excludes (use -debug for more details).
[INFO] Exclude: **/src-examples/data/*
[INFO] Exclude: **/dist/ABOUT
[INFO] Exclude: **/SEE_FUSEKI2
[INFO] Exclude: **/src/main/webapp/css/*
[INFO] Exclude: **/src/main/webapp/fonts/*
[INFO] Exclude: **/src/main/webapp/js/**/*
[INFO] Exclude: **/vocabularies/*
[INFO] Exclude: **/Vocabularies/*
[INFO] Exclude: **/src/main/**/*.html
[INFO] Exclude: **/src/**/package-info.java
[INFO] Exclude: **/DEPENDENCIES
[INFO] Exclude: **/*.txt
[INFO] Exclude: **/*.md
[INFO] Exclude: **/META-INF/services/*
[INFO] Exclude: **/src/test/resources/**/*
[INFO] Exclude: **/testing/**/*
[INFO] Exclude: **/log4j.properties
[INFO] Exclude: **/log4j-testing.properties
[INFO] Exclude: **/derby.log
[INFO] Exclude: **/DB/**/*
[INFO] Exclude: **/tdb*.cfg
[INFO] Exclude: **/run/**/*
[INFO] Exclude: **/*.classpath
[INFO] Exclude: **/target/**/*
[INFO] Exclude: **/dependency-reduced-pom.xml
[INFO] 192 resources included (use -debug for more details)
Warning:  org.apache.xerces.jaxp.SAXParserImpl$JAXPSAXParser: Property 'http://www.oracle.com/xml/jaxp/properties/entityExpansionLimit'
is not recognized.
Compiler warnings:
  WARNING:  'org.apache.xerces.jaxp.SAXParserImpl: Property 'http://javax.xml.XMLConstants/property/accessExternalDTD'
is not recognized.'
Warning:  org.apache.xerces.parsers.SAXParser: Feature 'http://javax.xml.XMLConstants/feature/secure-processing'
is not recognized.
Warning:  org.apache.xerces.parsers.SAXParser: Property 'http://javax.xml.XMLConstants/property/accessExternalDTD'
is not recognized.
Warning:  org.apache.xerces.parsers.SAXParser: Property 'http://www.oracle.com/xml/jaxp/properties/entityExpansionLimit'
is not recognized.
[INFO] Rat check: Summary of files. Unapproved: 0 unknown: 0 generated: 0 approved: 192 licence.
[INFO] 
[INFO] --- maven-remote-resources-plugin:1.5:process (default) @ jena-base ---
[INFO] 
[INFO] --- maven-resources-plugin:2.6:resources (default-resources) @ jena-base ---
[INFO] Using 'UTF-8' encoding to copy filtered resources.
[INFO] skip non existing resourceDirectory <https://builds.apache.org/job/Jena_Development_Test/ws/jena-base/src/main/resources>
[INFO] Copying 3 resources
[INFO] 
[INFO] --- maven-compiler-plugin:3.1:compile (default-compile) @ jena-base ---
[INFO] Changes detected - recompiling the module!
[INFO] Compiling 146 source files to <https://builds.apache.org/job/Jena_Development_Test/ws/jena-base/target/classes>
[WARNING] <https://builds.apache.org/job/Jena_Development_Test/ws/jena-base/src/main/java/org/apache/jena/atlas/lib/Tuple.java>:
<https://builds.apache.org/job/Jena_Development_Test/ws/jena-base/src/main/java/org/apache/jena/atlas/lib/Tuple.java>
uses unchecked or unsafe operations.
[WARNING] <https://builds.apache.org/job/Jena_Development_Test/ws/jena-base/src/main/java/org/apache/jena/atlas/lib/Tuple.java>:
Recompile with -Xlint:unchecked for details.
[INFO] 
[INFO] --- maven-resources-plugin:2.6:testResources (default-testResources) @ jena-base ---
[INFO] Using 'UTF-8' encoding to copy filtered resources.
[INFO] skip non existing resourceDirectory <https://builds.apache.org/job/Jena_Development_Test/ws/jena-base/src/test/resources>
[INFO] Copying 3 resources
[INFO] 
[INFO] --- maven-compiler-plugin:3.1:testCompile (default-testCompile) @ jena-base ---
[INFO] Changes detected - recompiling the module!
[INFO] Compiling 46 source files to <https://builds.apache.org/job/Jena_Development_Test/ws/jena-base/target/test-classes>
[WARNING] <https://builds.apache.org/job/Jena_Development_Test/ws/jena-base/src/test/java/org/apache/jena/atlas/iterator/TestIteratorArray.java>:
<https://builds.apache.org/job/Jena_Development_Test/ws/jena-base/src/test/java/org/apache/jena/atlas/iterator/TestIteratorArray.java>
uses or overrides a deprecated API.
[WARNING] <https://builds.apache.org/job/Jena_Development_Test/ws/jena-base/src/test/java/org/apache/jena/atlas/iterator/TestIteratorArray.java>:
Recompile with -Xlint:deprecation for details.
[INFO] 
[INFO] --- maven-surefire-plugin:2.17:test (default-test) @ jena-base ---
[INFO] Surefire report directory: <https://builds.apache.org/job/Jena_Development_Test/ws/jena-base/target/surefire-reports>

-------------------------------------------------------
 T E S T S
-------------------------------------------------------
Running org.apache.jena.atlas.io.TS_IO
Tests run: 112, Failures: 0, Errors: 0, Skipped: 0, Time elapsed: 0.338 sec - in org.apache.jena.atlas.io.TS_IO
Running org.apache.jena.atlas.lib.TS_Lib
Tests run: 341, Failures: 0, Errors: 0, Skipped: 0, Time elapsed: 2.413 sec - in org.apache.jena.atlas.lib.TS_Lib
Running org.apache.jena.atlas.iterator.TS_Iterator
Tests run: 74, Failures: 0, Errors: 0, Skipped: 0, Time elapsed: 0.104 sec - in org.apache.jena.atlas.iterator.TS_Iterator

Results :

Tests run: 527, Failures: 0, Errors: 0, Skipped: 0

[JENKINS] Recording test results
log4j:WARN No appenders could be found for logger (org.apache.commons.beanutils.converters.BooleanConverter).
log4j:WARN Please initialize the log4j system properly.
[INFO] 
[INFO] --- maven-jar-plugin:2.5:jar (default-jar) @ jena-base ---
[INFO] Building jar: <https://builds.apache.org/job/Jena_Development_Test/ws/jena-base/target/jena-base-3.0.0-SNAPSHOT.jar>
[INFO] 
[INFO] --- maven-site-plugin:3.4:attach-descriptor (attach-descriptor) @ jena-base ---
[INFO] 
[INFO] --- maven-jar-plugin:2.5:test-jar (default) @ jena-base ---
[INFO] Building jar: <https://builds.apache.org/job/Jena_Development_Test/ws/jena-base/target/jena-base-3.0.0-SNAPSHOT-tests.jar>
[INFO] 
[INFO] --- maven-source-plugin:2.3:jar-no-fork (attach-sources) @ jena-base ---
[INFO] Building jar: <https://builds.apache.org/job/Jena_Development_Test/ws/jena-base/target/jena-base-3.0.0-SNAPSHOT-sources.jar>
[INFO] 
[INFO] --- maven-javadoc-plugin:2.9.1:jar (attach-javadocs) @ jena-base ---
[INFO] The goal 'org.apache.maven.plugins:maven-javadoc-plugin:2.9.1:javadoc' has not been
previously called for the module: 'org.apache.jena:jena-shaded-guava:jar:3.0.0-SNAPSHOT'.
Trying to invoke it...
Warning:  org.apache.xerces.jaxp.SAXParserImpl$JAXPSAXParser: Property 'http://www.oracle.com/xml/jaxp/properties/entityExpansionLimit'
is not recognized.
Compiler warnings:
  WARNING:  'org.apache.xerces.jaxp.SAXParserImpl: Property 'http://javax.xml.XMLConstants/property/accessExternalDTD'
is not recognized.'
Warning:  org.apache.xerces.parsers.SAXParser: Feature 'http://javax.xml.XMLConstants/feature/secure-processing'
is not recognized.
Warning:  org.apache.xerces.parsers.SAXParser: Property 'http://javax.xml.XMLConstants/property/accessExternalDTD'
is not recognized.
Warning:  org.apache.xerces.parsers.SAXParser: Property 'http://www.oracle.com/xml/jaxp/properties/entityExpansionLimit'
is not recognized.
[WARNING] Creating fake javadoc directory to prevent repeated invocations: <https://builds.apache.org/job/Jena_Development_Test/ws/jena-shaded-guava/target/apidocs>
[ERROR] Error fetching link: <https://builds.apache.org/job/Jena_Development_Test/ws/jena-shaded-guava/target/apidocs/package-list.>
Ignored it.
[INFO] 
1 warning
[WARNING] Javadoc Warnings
[WARNING] javadoc: warning - Error fetching URL: http://jena.apache.org/documentation/javadoc/fuseki/
[INFO] Building jar: <https://builds.apache.org/job/Jena_Development_Test/ws/jena-base/target/jena-base-3.0.0-SNAPSHOT-javadoc.jar>
[JENKINS] Archiving disabled
[INFO]                                                                         
[INFO] ------------------------------------------------------------------------
[INFO] Building Apache Jena - Core 3.0.0-SNAPSHOT
[INFO] ------------------------------------------------------------------------
[INFO] 
[INFO] --- maven-clean-plugin:2.5:clean (default-clean) @ jena-core ---
[INFO] Deleting <https://builds.apache.org/job/Jena_Development_Test/ws/jena-core/target>
[INFO] 
[INFO] --- maven-enforcer-plugin:1.3.1:enforce (enforce) @ jena-core ---
[INFO] 
[INFO] --- apache-rat-plugin:0.11:check (rat-checks) @ jena-core ---
[INFO] 51 implicit excludes (use -debug for more details).
[INFO] Exclude: **/src-examples/data/*
[INFO] Exclude: **/dist/ABOUT
[INFO] Exclude: **/SEE_FUSEKI2
[INFO] Exclude: **/src/main/webapp/css/*
[INFO] Exclude: **/src/main/webapp/fonts/*
[INFO] Exclude: **/src/main/webapp/js/**/*
[INFO] Exclude: **/vocabularies/*
[INFO] Exclude: **/Vocabularies/*
[INFO] Exclude: **/src/main/**/*.html
[INFO] Exclude: **/src/**/package-info.java
[INFO] Exclude: **/DEPENDENCIES
[INFO] Exclude: **/*.txt
[INFO] Exclude: **/*.md
[INFO] Exclude: **/META-INF/services/*
[INFO] Exclude: **/src/test/resources/**/*
[INFO] Exclude: **/testing/**/*
[INFO] Exclude: **/log4j.properties
[INFO] Exclude: **/log4j-testing.properties
[INFO] Exclude: **/derby.log
[INFO] Exclude: **/DB/**/*
[INFO] Exclude: **/tdb*.cfg
[INFO] Exclude: **/run/**/*
[INFO] Exclude: **/*.classpath
[INFO] Exclude: **/target/**/*
[INFO] Exclude: **/dependency-reduced-pom.xml
[INFO] 1168 resources included (use -debug for more details)
Warning:  org.apache.xerces.jaxp.SAXParserImpl$JAXPSAXParser: Property 'http://www.oracle.com/xml/jaxp/properties/entityExpansionLimit'
is not recognized.
Compiler warnings:
  WARNING:  'org.apache.xerces.jaxp.SAXParserImpl: Property 'http://javax.xml.XMLConstants/property/accessExternalDTD'
is not recognized.'
Warning:  org.apache.xerces.parsers.SAXParser: Feature 'http://javax.xml.XMLConstants/feature/secure-processing'
is not recognized.
Warning:  org.apache.xerces.parsers.SAXParser: Property 'http://javax.xml.XMLConstants/property/accessExternalDTD'
is not recognized.
Warning:  org.apache.xerces.parsers.SAXParser: Property 'http://www.oracle.com/xml/jaxp/properties/entityExpansionLimit'
is not recognized.
[INFO] Rat check: Summary of files. Unapproved: 1 unknown: 1 generated: 0 approved: 1156 licence.
[JENKINS] Archiving disabled
[JENKINS] Archiving disabled
[JENKINS] Archiving disabled
[JENKINS] Archiving disabled
[JENKINS] Archiving disabled
[JENKINS] Archiving disabled
[JENKINS] Archiving disabled
[JENKINS] Archiving disabled
[JENKINS] Archiving disabled
[JENKINS] Archiving disabled
[JENKINS] Archiving disabled
[JENKINS] Archiving disabled
[JENKINS] Archiving disabled
[JENKINS] Archiving disabled
[JENKINS] Archiving disabled
[JENKINS] Archiving disabled
[JENKINS] Archiving disabled
[JENKINS] Archiving disabled
[JENKINS] Archiving disabled
[JENKINS] Archiving disabled
[JENKINS] Archiving disabled
[JENKINS] Archiving disabled
[JENKINS] Archiving disabled
[JENKINS] Archiving disabled
[JENKINS] Archiving disabled
[JENKINS] Archiving disabled
[JENKINS] Archiving disabled
[JENKINS] Archiving disabled
[JENKINS] Archiving disabled
[JENKINS] Archiving disabled
[JENKINS] Archiving disabled
[JENKINS] Archiving disabled
[JENKINS] Archiving disabled
[JENKINS] Archiving disabled
[JENKINS] Archiving disabled
[JENKINS] Archiving disabled
[JENKINS] Archiving disabled
[JENKINS] Archiving disabled[INFO] ------------------------------------------------------------------------
[INFO] Reactor Summary:
[INFO] 
[INFO] Apache Jena - Parent ............................... SUCCESS [  5.024 s]
[INFO] Apache Jena - Shadowed external libraries .......... SUCCESS [  4.777 s]
[INFO] Apache Jena - IRI .................................. SUCCESS [ 12.436 s]
[INFO] Apache Jena - Base Common Environment .............. SUCCESS [ 37.003 s]
[INFO] Apache Jena - Core ................................. FAILURE [  3.483 s]
[INFO] Apache Jena - ARQ (SPARQL 1.1 Query Engine) ........ SKIPPED
[INFO] Apache Jena - TDB (Native Triple Store) ............ SKIPPED
[INFO] Apache Jena - Libraries POM ........................ SKIPPED
[INFO] Apache Jena - SPARQL Text Search ................... SKIPPED
[INFO] Apache Jena - SPARQL Spatial Search ................ SKIPPED
[INFO] Apache Jena - Data Tables for RDF and SPARQL ....... SKIPPED
[INFO] Apache Jena - SDB (SQL based triple store) ......... SKIPPED
[INFO] Apache Jena - Fuseki1 .............................. SKIPPED
[INFO] Apache Jena - Fuseki - A SPARQL 1.1 Server ......... SKIPPED
[INFO] Apache Jena - Fuseki Server Engine ................. SKIPPED
[INFO] Apache Jena - Fuseki WAR File ...................... SKIPPED
[INFO] Apache Jena - Fuseki Server Standalone Jar ......... SKIPPED
[INFO] Apache Jena - Fuseki Binary Distribution ........... SKIPPED
[INFO] Apache Jena - Security Permissions ................. SKIPPED
[INFO] Apache Jena - JDBC Parent .......................... SKIPPED
[INFO] Apache Jena - JDBC Core API ........................ SKIPPED
[INFO] Apache Jena - JDBC Remote Endpoint Driver .......... SKIPPED
[INFO] Apache Jena - JDBC In-Memory Driver ................ SKIPPED
[INFO] Apache Jena - JDBC TDB Driver ...................... SKIPPED
[INFO] Apache Jena - JDBC Driver Bundle ................... SKIPPED
[INFO] Apache Jena - Maven Plugins, including schemagen ... SKIPPED
[INFO] Apache Jena - Elephas .............................. SKIPPED
[INFO] Apache Jena - Elephas - Common API ................. SKIPPED
[INFO] Apache Jena - Elephas - I/O ........................ SKIPPED
[INFO] Apache Jena - Elephas - Map/Reduce ................. SKIPPED
[INFO] Apache Jena - Elephas - Statistics Demo App ........ SKIPPED
[INFO] Apache Jena - Distribution ......................... SKIPPED
[INFO] Apache Jena - OSGi ................................. SKIPPED
[INFO] Apache Jena - OSGi bundle .......................... SKIPPED
[INFO] Apache Jena - Extras ............................... SKIPPED
[INFO] Apache Jena - Extras - Query Builder ............... SKIPPED
[INFO] Apache Jena ........................................ SKIPPED
[INFO] ------------------------------------------------------------------------
[INFO] BUILD FAILURE
[INFO] ------------------------------------------------------------------------
[INFO] Total time: 01:13 min
[INFO] Finished at: 2015-07-19T10:06:34+00:00

[INFO] Final Memory: 56M/1238M
[INFO] ------------------------------------------------------------------------
Waiting for Jenkins to finish collecting data
[ERROR] Failed to execute goal org.apache.rat:apache-rat-plugin:0.11:check (rat-checks) on
project jena-core: Too many files with unapproved license: 1 See RAT report in: <https://builds.apache.org/job/Jena_Development_Test/ws/jena-core/target/rat.txt>
-> [Help 1]
[ERROR] 
[ERROR] To see the full stack trace of the errors, re-run Maven with the -e switch.
[ERROR] Re-run Maven using the -X switch to enable full debug logging.
[ERROR] 
[ERROR] For more information about the errors and possible solutions, please read the following
articles:
[ERROR] [Help 1] http://cwiki.apache.org/confluence/display/MAVEN/MojoFailureException
[ERROR] 
[ERROR] After correcting the problems, you can resume the build with the command
[ERROR]   mvn <goals> -rf :jena-core
channel stopped

Mime
View raw message