jena-commits mailing list archives

Site index · List index
Message view « Date » · « Thread »
Top « Date » · « Thread »
From Apache Jenkins Server <jenk...@builds.apache.org>
Subject Build failed in Jenkins: Jena_Development_Test #1875
Date Fri, 01 May 2015 14:12:56 GMT
See <https://builds.apache.org/job/Jena_Development_Test/1875/changes>

Changes:

[ajs6f] Deprecating Map1 in favor of Java8 Function

[andy] JENA-929: PR#54: Deprecating Map1 in favor of Java8 Function

------------------------------------------
[...truncated 3422 lines...]
Tests run: 12, Failures: 0, Errors: 0, Skipped: 3, Time elapsed: 72.267 sec - in org.apache.jena.hadoop.rdf.io.input.trix.TriXInputTest
Running org.apache.jena.hadoop.rdf.io.input.thrift.ThriftQuadInputTest
Tests run: 12, Failures: 0, Errors: 0, Skipped: 3, Time elapsed: 7.554 sec - in org.apache.jena.hadoop.rdf.io.input.thrift.ThriftQuadInputTest
Running org.apache.jena.hadoop.rdf.io.input.thrift.ThriftTripleInputTest
Tests run: 12, Failures: 0, Errors: 0, Skipped: 3, Time elapsed: 7.133 sec - in org.apache.jena.hadoop.rdf.io.input.thrift.ThriftTripleInputTest
Running org.apache.jena.hadoop.rdf.io.input.turtle.TurtleInputTest
Tests run: 12, Failures: 0, Errors: 0, Skipped: 3, Time elapsed: 1.126 sec - in org.apache.jena.hadoop.rdf.io.input.turtle.TurtleInputTest
Running org.apache.jena.hadoop.rdf.io.input.rdfjson.RdfJsonInputTest
Tests run: 12, Failures: 0, Errors: 0, Skipped: 3, Time elapsed: 1.859 sec - in org.apache.jena.hadoop.rdf.io.input.rdfjson.RdfJsonInputTest
Running org.apache.jena.hadoop.rdf.io.input.jsonld.JsonLDTripleInputTest
Tests run: 12, Failures: 0, Errors: 0, Skipped: 3, Time elapsed: 72.201 sec - in org.apache.jena.hadoop.rdf.io.input.jsonld.JsonLDTripleInputTest
Running org.apache.jena.hadoop.rdf.io.input.jsonld.JsonLDQuadInputTest
Tests run: 12, Failures: 0, Errors: 0, Skipped: 3, Time elapsed: 70.885 sec - in org.apache.jena.hadoop.rdf.io.input.jsonld.JsonLDQuadInputTest
Running org.apache.jena.hadoop.rdf.io.input.rdfxml.RdfXmlInputTest
Tests run: 12, Failures: 0, Errors: 0, Skipped: 3, Time elapsed: 10.17 sec - in org.apache.jena.hadoop.rdf.io.input.rdfxml.RdfXmlInputTest
Running org.apache.jena.hadoop.rdf.io.input.compressed.trig.DeflatedTriGInputTest
Tests run: 12, Failures: 0, Errors: 0, Skipped: 3, Time elapsed: 1.482 sec - in org.apache.jena.hadoop.rdf.io.input.compressed.trig.DeflatedTriGInputTest
Running org.apache.jena.hadoop.rdf.io.input.compressed.trig.GZippedTriGInputTest
Tests run: 12, Failures: 0, Errors: 0, Skipped: 3, Time elapsed: 1.334 sec - in org.apache.jena.hadoop.rdf.io.input.compressed.trig.GZippedTriGInputTest
Running org.apache.jena.hadoop.rdf.io.input.compressed.trig.BZippedTriGInputTest
Tests run: 12, Failures: 0, Errors: 0, Skipped: 3, Time elapsed: 5.573 sec - in org.apache.jena.hadoop.rdf.io.input.compressed.trig.BZippedTriGInputTest
Running org.apache.jena.hadoop.rdf.io.input.compressed.trix.BZippedTriXInputTest
Tests run: 12, Failures: 0, Errors: 0, Skipped: 3, Time elapsed: 5.303 sec - in org.apache.jena.hadoop.rdf.io.input.compressed.trix.BZippedTriXInputTest
Running org.apache.jena.hadoop.rdf.io.input.compressed.trix.GZippedTriXInputTest
Tests run: 12, Failures: 0, Errors: 0, Skipped: 3, Time elapsed: 1.543 sec - in org.apache.jena.hadoop.rdf.io.input.compressed.trix.GZippedTriXInputTest
Running org.apache.jena.hadoop.rdf.io.input.compressed.trix.DeflatedTriXInputTest
Tests run: 12, Failures: 0, Errors: 0, Skipped: 3, Time elapsed: 1.257 sec - in org.apache.jena.hadoop.rdf.io.input.compressed.trix.DeflatedTriXInputTest
Running org.apache.jena.hadoop.rdf.io.input.compressed.thrift.GZippedThriftTripleInputTest
Tests run: 12, Failures: 0, Errors: 0, Skipped: 3, Time elapsed: 7.361 sec - in org.apache.jena.hadoop.rdf.io.input.compressed.thrift.GZippedThriftTripleInputTest
Running org.apache.jena.hadoop.rdf.io.input.compressed.thrift.DeflatedThriftQuadInputTest
Tests run: 12, Failures: 0, Errors: 0, Skipped: 3, Time elapsed: 8.122 sec - in org.apache.jena.hadoop.rdf.io.input.compressed.thrift.DeflatedThriftQuadInputTest
Running org.apache.jena.hadoop.rdf.io.input.compressed.thrift.BZippedThriftTripleInputTest
Tests run: 12, Failures: 0, Errors: 0, Skipped: 3, Time elapsed: 16.605 sec - in org.apache.jena.hadoop.rdf.io.input.compressed.thrift.BZippedThriftTripleInputTest
Running org.apache.jena.hadoop.rdf.io.input.compressed.thrift.DeflatedThriftTripleInputTest
Tests run: 12, Failures: 0, Errors: 0, Skipped: 3, Time elapsed: 7.463 sec - in org.apache.jena.hadoop.rdf.io.input.compressed.thrift.DeflatedThriftTripleInputTest
Running org.apache.jena.hadoop.rdf.io.input.compressed.thrift.BZippedThriftQuadInputTest
Tests run: 12, Failures: 0, Errors: 0, Skipped: 3, Time elapsed: 17.3 sec - in org.apache.jena.hadoop.rdf.io.input.compressed.thrift.BZippedThriftQuadInputTest
Running org.apache.jena.hadoop.rdf.io.input.compressed.thrift.GZippedThriftQuadInputTest
Tests run: 12, Failures: 0, Errors: 0, Skipped: 3, Time elapsed: 7.732 sec - in org.apache.jena.hadoop.rdf.io.input.compressed.thrift.GZippedThriftQuadInputTest
Running org.apache.jena.hadoop.rdf.io.input.compressed.turtle.BZippedTurtleInputTest
Tests run: 12, Failures: 0, Errors: 0, Skipped: 3, Time elapsed: 5.478 sec - in org.apache.jena.hadoop.rdf.io.input.compressed.turtle.BZippedTurtleInputTest
Running org.apache.jena.hadoop.rdf.io.input.compressed.turtle.GZippedTurtleInputTest
Tests run: 12, Failures: 0, Errors: 0, Skipped: 3, Time elapsed: 1.376 sec - in org.apache.jena.hadoop.rdf.io.input.compressed.turtle.GZippedTurtleInputTest
Running org.apache.jena.hadoop.rdf.io.input.compressed.turtle.DeflatedTurtleInputTest
Tests run: 12, Failures: 0, Errors: 0, Skipped: 3, Time elapsed: 1.298 sec - in org.apache.jena.hadoop.rdf.io.input.compressed.turtle.DeflatedTurtleInputTest
Running org.apache.jena.hadoop.rdf.io.input.compressed.rdfjson.BZippedRdfJsonInputTest
Tests run: 12, Failures: 0, Errors: 0, Skipped: 3, Time elapsed: 14.983 sec - in org.apache.jena.hadoop.rdf.io.input.compressed.rdfjson.BZippedRdfJsonInputTest
Running org.apache.jena.hadoop.rdf.io.input.compressed.rdfjson.DeflatedRdfJsonInputTest
Tests run: 12, Failures: 0, Errors: 0, Skipped: 3, Time elapsed: 2.315 sec - in org.apache.jena.hadoop.rdf.io.input.compressed.rdfjson.DeflatedRdfJsonInputTest
Running org.apache.jena.hadoop.rdf.io.input.compressed.rdfjson.GZippedRdfJsonInputTest
Tests run: 12, Failures: 0, Errors: 0, Skipped: 3, Time elapsed: 2.401 sec - in org.apache.jena.hadoop.rdf.io.input.compressed.rdfjson.GZippedRdfJsonInputTest
Running org.apache.jena.hadoop.rdf.io.input.compressed.jsonld.GZippedJsonLDTripleInputTest
Tests run: 12, Failures: 0, Errors: 0, Skipped: 3, Time elapsed: 71.063 sec - in org.apache.jena.hadoop.rdf.io.input.compressed.jsonld.GZippedJsonLDTripleInputTest
Running org.apache.jena.hadoop.rdf.io.input.compressed.jsonld.DeflatedJsonLDQuadInputTest
Tests run: 12, Failures: 0, Errors: 0, Skipped: 3, Time elapsed: 71.608 sec - in org.apache.jena.hadoop.rdf.io.input.compressed.jsonld.DeflatedJsonLDQuadInputTest
Running org.apache.jena.hadoop.rdf.io.input.compressed.jsonld.GZippedJsonLDQuadInputTest
Tests run: 12, Failures: 0, Errors: 0, Skipped: 3, Time elapsed: 71.52 sec - in org.apache.jena.hadoop.rdf.io.input.compressed.jsonld.GZippedJsonLDQuadInputTest
Running org.apache.jena.hadoop.rdf.io.input.compressed.jsonld.BZippedJsonLDTripleInputTest
Tests run: 12, Failures: 0, Errors: 0, Skipped: 3, Time elapsed: 72.143 sec - in org.apache.jena.hadoop.rdf.io.input.compressed.jsonld.BZippedJsonLDTripleInputTest
Running org.apache.jena.hadoop.rdf.io.input.compressed.jsonld.BZippedJsonLDQuadInputTest
Tests run: 12, Failures: 0, Errors: 0, Skipped: 3, Time elapsed: 77.604 sec - in org.apache.jena.hadoop.rdf.io.input.compressed.jsonld.BZippedJsonLDQuadInputTest
Running org.apache.jena.hadoop.rdf.io.input.compressed.jsonld.DeflatedJsonLDTripleInputTest
Tests run: 12, Failures: 0, Errors: 0, Skipped: 3, Time elapsed: 70.825 sec - in org.apache.jena.hadoop.rdf.io.input.compressed.jsonld.DeflatedJsonLDTripleInputTest
Running org.apache.jena.hadoop.rdf.io.input.compressed.rdfxml.BZippedRdfXmlInputTest
Tests run: 12, Failures: 0, Errors: 0, Skipped: 3, Time elapsed: 19.281 sec - in org.apache.jena.hadoop.rdf.io.input.compressed.rdfxml.BZippedRdfXmlInputTest
Running org.apache.jena.hadoop.rdf.io.input.compressed.rdfxml.GZippedRdfXmlInputTest
Tests run: 12, Failures: 0, Errors: 0, Skipped: 3, Time elapsed: 10.433 sec - in org.apache.jena.hadoop.rdf.io.input.compressed.rdfxml.GZippedRdfXmlInputTest
Running org.apache.jena.hadoop.rdf.io.input.compressed.rdfxml.DeflatedRdfXmlInputTest
Tests run: 12, Failures: 0, Errors: 0, Skipped: 3, Time elapsed: 10.349 sec - in org.apache.jena.hadoop.rdf.io.input.compressed.rdfxml.DeflatedRdfXmlInputTest
Running org.apache.jena.hadoop.rdf.io.input.compressed.ntriples.BZippedWholeFileNTriplesInputTest
Tests run: 12, Failures: 0, Errors: 0, Skipped: 3, Time elapsed: 10.429 sec - in org.apache.jena.hadoop.rdf.io.input.compressed.ntriples.BZippedWholeFileNTriplesInputTest
Running org.apache.jena.hadoop.rdf.io.input.compressed.ntriples.DeflatedNTriplesInputTest
Tests run: 12, Failures: 0, Errors: 0, Skipped: 3, Time elapsed: 1.185 sec - in org.apache.jena.hadoop.rdf.io.input.compressed.ntriples.DeflatedNTriplesInputTest
Running org.apache.jena.hadoop.rdf.io.input.compressed.ntriples.GZippedWholeFileNTriplesInputTest
Tests run: 12, Failures: 0, Errors: 0, Skipped: 3, Time elapsed: 1.613 sec - in org.apache.jena.hadoop.rdf.io.input.compressed.ntriples.GZippedWholeFileNTriplesInputTest
Running org.apache.jena.hadoop.rdf.io.input.compressed.ntriples.BZippedNTriplesInputTest
Tests run: 12, Failures: 0, Errors: 0, Skipped: 3, Time elapsed: 3.51 sec - in org.apache.jena.hadoop.rdf.io.input.compressed.ntriples.BZippedNTriplesInputTest
Running org.apache.jena.hadoop.rdf.io.input.compressed.ntriples.DeflatedWholeFileNTriplesInputTest
Tests run: 12, Failures: 0, Errors: 0, Skipped: 3, Time elapsed: 1.479 sec - in org.apache.jena.hadoop.rdf.io.input.compressed.ntriples.DeflatedWholeFileNTriplesInputTest
Running org.apache.jena.hadoop.rdf.io.input.compressed.ntriples.GZippedNTriplesInputTest
Tests run: 12, Failures: 0, Errors: 0, Skipped: 3, Time elapsed: 1.095 sec - in org.apache.jena.hadoop.rdf.io.input.compressed.ntriples.GZippedNTriplesInputTest
Running org.apache.jena.hadoop.rdf.io.input.compressed.nquads.DeflatedWholeFileNQuadsInputTest
Tests run: 12, Failures: 0, Errors: 0, Skipped: 3, Time elapsed: 1.546 sec - in org.apache.jena.hadoop.rdf.io.input.compressed.nquads.DeflatedWholeFileNQuadsInputTest
Running org.apache.jena.hadoop.rdf.io.input.compressed.nquads.BZipppedNQuadsInputTest
Tests run: 12, Failures: 0, Errors: 0, Skipped: 3, Time elapsed: 4.614 sec - in org.apache.jena.hadoop.rdf.io.input.compressed.nquads.BZipppedNQuadsInputTest
Running org.apache.jena.hadoop.rdf.io.input.compressed.nquads.DeflatedNQuadsInputTest
Tests run: 12, Failures: 0, Errors: 0, Skipped: 3, Time elapsed: 1.2 sec - in org.apache.jena.hadoop.rdf.io.input.compressed.nquads.DeflatedNQuadsInputTest
Running org.apache.jena.hadoop.rdf.io.input.compressed.nquads.BZipppedWholeFileNQuadsInputTest
Tests run: 12, Failures: 0, Errors: 0, Skipped: 3, Time elapsed: 10.769 sec - in org.apache.jena.hadoop.rdf.io.input.compressed.nquads.BZipppedWholeFileNQuadsInputTest
Running org.apache.jena.hadoop.rdf.io.input.compressed.nquads.GZippedWholeFileNQuadsInputTest
Tests run: 12, Failures: 0, Errors: 0, Skipped: 3, Time elapsed: 1.703 sec - in org.apache.jena.hadoop.rdf.io.input.compressed.nquads.GZippedWholeFileNQuadsInputTest
Running org.apache.jena.hadoop.rdf.io.input.compressed.nquads.GZippedNQuadsInputTest
Tests run: 12, Failures: 0, Errors: 0, Skipped: 3, Time elapsed: 1.293 sec - in org.apache.jena.hadoop.rdf.io.input.compressed.nquads.GZippedNQuadsInputTest
Running org.apache.jena.hadoop.rdf.io.input.ntriples.NTriplesInputTest
Tests run: 12, Failures: 0, Errors: 0, Skipped: 0, Time elapsed: 1.086 sec - in org.apache.jena.hadoop.rdf.io.input.ntriples.NTriplesInputTest
Running org.apache.jena.hadoop.rdf.io.input.ntriples.WholeFileNTriplesInputTest
Tests run: 12, Failures: 0, Errors: 0, Skipped: 3, Time elapsed: 0.991 sec - in org.apache.jena.hadoop.rdf.io.input.ntriples.WholeFileNTriplesInputTest
Running org.apache.jena.hadoop.rdf.io.input.ntriples.BlockedNTriplesInputTest
Tests run: 12, Failures: 0, Errors: 0, Skipped: 0, Time elapsed: 3.845 sec - in org.apache.jena.hadoop.rdf.io.input.ntriples.BlockedNTriplesInputTest
Running org.apache.jena.hadoop.rdf.io.input.nquads.NQuadsInputTest
Tests run: 12, Failures: 0, Errors: 0, Skipped: 0, Time elapsed: 1.124 sec - in org.apache.jena.hadoop.rdf.io.input.nquads.NQuadsInputTest
Running org.apache.jena.hadoop.rdf.io.input.nquads.WholeFileNQuadsInputTest
Tests run: 12, Failures: 0, Errors: 0, Skipped: 3, Time elapsed: 1.179 sec - in org.apache.jena.hadoop.rdf.io.input.nquads.WholeFileNQuadsInputTest
Running org.apache.jena.hadoop.rdf.io.input.nquads.BlockedNQuadsInputTest
Tests run: 12, Failures: 0, Errors: 0, Skipped: 0, Time elapsed: 5.801 sec - in org.apache.jena.hadoop.rdf.io.input.nquads.BlockedNQuadsInputTest
Running org.apache.jena.hadoop.rdf.io.registry.TestHadoopRdfIORegistry
Tests run: 10, Failures: 0, Errors: 0, Skipped: 0, Time elapsed: 0.016 sec - in org.apache.jena.hadoop.rdf.io.registry.TestHadoopRdfIORegistry
Running org.apache.jena.hadoop.rdf.io.output.trig.StreamedTriGOutputTest
Tests run: 16, Failures: 0, Errors: 0, Skipped: 0, Time elapsed: 11.321 sec - in org.apache.jena.hadoop.rdf.io.output.trig.StreamedTriGOutputTest
Running org.apache.jena.hadoop.rdf.io.output.trig.BatchedTriGOutputTest
Tests run: 16, Failures: 0, Errors: 0, Skipped: 0, Time elapsed: 164.274 sec - in org.apache.jena.hadoop.rdf.io.output.trig.BatchedTriGOutputTest
Running org.apache.jena.hadoop.rdf.io.output.trix.TriXOutputTest
Tests run: 4, Failures: 0, Errors: 0, Skipped: 0, Time elapsed: 3.504 sec - in org.apache.jena.hadoop.rdf.io.output.trix.TriXOutputTest
Running org.apache.jena.hadoop.rdf.io.output.thrift.ThriftQuadOutputTest
Tests run: 4, Failures: 0, Errors: 0, Skipped: 0, Time elapsed: 0.86 sec - in org.apache.jena.hadoop.rdf.io.output.thrift.ThriftQuadOutputTest
Running org.apache.jena.hadoop.rdf.io.output.thrift.ThriftTripleOutputTest
Tests run: 4, Failures: 0, Errors: 0, Skipped: 0, Time elapsed: 0.802 sec - in org.apache.jena.hadoop.rdf.io.output.thrift.ThriftTripleOutputTest
Running org.apache.jena.hadoop.rdf.io.output.turtle.BatchedTurtleOutputTest
Tests run: 16, Failures: 0, Errors: 0, Skipped: 0, Time elapsed: 9.326 sec - in org.apache.jena.hadoop.rdf.io.output.turtle.BatchedTurtleOutputTest
Running org.apache.jena.hadoop.rdf.io.output.turtle.StreamedTurtleOutputTest
Tests run: 16, Failures: 0, Errors: 0, Skipped: 0, Time elapsed: 5.605 sec - in org.apache.jena.hadoop.rdf.io.output.turtle.StreamedTurtleOutputTest
Running org.apache.jena.hadoop.rdf.io.output.rdfjson.RdfJsonOutputTest
Tests run: 4, Failures: 0, Errors: 0, Skipped: 0, Time elapsed: 4.359 sec - in org.apache.jena.hadoop.rdf.io.output.rdfjson.RdfJsonOutputTest
Running org.apache.jena.hadoop.rdf.io.output.jsonld.JsonLdTripleOutputTest
Tests run: 4, Failures: 0, Errors: 0, Skipped: 0, Time elapsed: 6.018 sec - in org.apache.jena.hadoop.rdf.io.output.jsonld.JsonLdTripleOutputTest
Running org.apache.jena.hadoop.rdf.io.output.jsonld.JsonLdQuadOutputTest
Tests run: 4, Failures: 0, Errors: 0, Skipped: 0, Time elapsed: 6.268 sec - in org.apache.jena.hadoop.rdf.io.output.jsonld.JsonLdQuadOutputTest
Running org.apache.jena.hadoop.rdf.io.output.rdfxml.RdfXmlOutputTest
Tests run: 4, Failures: 0, Errors: 0, Skipped: 0, Time elapsed: 10.686 sec - in org.apache.jena.hadoop.rdf.io.output.rdfxml.RdfXmlOutputTest
Running org.apache.jena.hadoop.rdf.io.output.ntriples.NTriplesOutputTest
Tests run: 4, Failures: 0, Errors: 0, Skipped: 0, Time elapsed: 0.487 sec - in org.apache.jena.hadoop.rdf.io.output.ntriples.NTriplesOutputTest
Running org.apache.jena.hadoop.rdf.io.output.nquads.NQuadsOutputTest
Tests run: 4, Failures: 0, Errors: 0, Skipped: 0, Time elapsed: 0.631 sec - in org.apache.jena.hadoop.rdf.io.output.nquads.NQuadsOutputTest

Results :

Tests run: 898, Failures: 0, Errors: 0, Skipped: 162

[JENKINS] Recording test results
[INFO] 
[INFO] --- maven-jar-plugin:2.5:jar (default-jar) @ jena-elephas-io ---
[INFO] Building jar: <https://builds.apache.org/job/Jena_Development_Test/ws/jena-elephas/jena-elephas-io/target/jena-elephas-io-3.0.0-SNAPSHOT.jar>
[INFO] 
[INFO] --- maven-site-plugin:3.4:attach-descriptor (attach-descriptor) @ jena-elephas-io ---
[INFO] 
[INFO] --- maven-javadoc-plugin:2.9.1:jar (attach-javadocs) @ jena-elephas-io ---
[INFO] 
1 error
[JENKINS] Archiving disabled
[JENKINS] Archiving disabled
[JENKINS] Archiving disabled
[JENKINS] Archiving disabled
[JENKINS] Archiving disabled
[JENKINS] Archiving disabled
[JENKINS] Archiving disabled
[JENKINS] Archiving disabled
[JENKINS] Archiving disabled
[JENKINS] Archiving disabled
[JENKINS] Archiving disabled
[JENKINS] Archiving disabled
[JENKINS] Archiving disabled
[JENKINS] Archiving disabled
[JENKINS] Archiving disabled
[JENKINS] Archiving disabled
[JENKINS] Archiving disabled
[JENKINS] Archiving disabled
[JENKINS] Archiving disabled
[JENKINS] Archiving disabled
[JENKINS] Archiving disabled
[JENKINS] Archiving disabled
[JENKINS] Archiving disabled
[JENKINS] Archiving disabled
[JENKINS] Archiving disabled
[JENKINS] Archiving disabled
[JENKINS] Archiving disabled
[JENKINS] Archiving disabled
[JENKINS] Archiving disabled
[JENKINS] Archiving disabled
[JENKINS] Archiving disabled
[JENKINS] Archiving disabled
[JENKINS] Archiving disabled
[JENKINS] Archiving disabled
[JENKINS] Archiving disabled
[JENKINS] Archiving disabled
[JENKINS] Archiving disabled[INFO] ------------------------------------------------------------------------
[INFO] Reactor Summary:
[INFO] 
[INFO] Apache Jena - Parent .............................. SUCCESS [  3.561 s]
[INFO] Apache Jena - Shadowed external libraries ......... SUCCESS [  4.674 s]
[INFO] Apache Jena - IRI ................................. SUCCESS [ 15.868 s]
[INFO] Apache Jena - Base Common Environment ............. SUCCESS [ 30.276 s]
[INFO] Apache Jena - Core ................................ SUCCESS [01:00 min]
[INFO] Apache Jena - ARQ (SPARQL 1.1 Query Engine) ....... SUCCESS [01:05 min]
[INFO] Apache Jena - TDB (Native Triple Store) ........... SUCCESS [01:38 min]
[INFO] Apache Jena - Libraries POM ....................... SUCCESS [  0.585 s]
[INFO] Apache Jena - SPARQL Text Search .................. SUCCESS [ 35.020 s]
[INFO] Apache Jena - SPARQL Spatial Search ............... SUCCESS [ 20.820 s]
[INFO] Apache Jena - Data Tables for RDF and SPARQL ...... SUCCESS [  7.614 s]
[INFO] Apache Jena - SDB (SQL based triple store) ........ SUCCESS [ 49.942 s]
[INFO] Apache Jena - Fuseki1 ............................. SUCCESS [ 19.696 s]
[INFO] Apache Jena - Fuseki - A SPARQL 1.1 Server ........ SUCCESS [  0.547 s]
[INFO] Apache Jena - Fuseki Server Engine ................ SUCCESS [ 14.309 s]
[INFO] Apache Jena - Fuseki WAR File ..................... SUCCESS [  5.218 s]
[INFO] Apache Jena - Fuseki Server Standalone Jar ........ SUCCESS [  4.600 s]
[INFO] Apache Jena - Fuseki Binary Distribution .......... SUCCESS [  6.652 s]
[INFO] Apache Jena - JDBC Parent ......................... SUCCESS [  1.520 s]
[INFO] Apache Jena - JDBC Core API ....................... SUCCESS [ 50.852 s]
[INFO] Apache Jena - JDBC Remote Endpoint Driver ......... SUCCESS [ 49.441 s]
[INFO] Apache Jena - JDBC In-Memory Driver ............... SUCCESS [ 18.774 s]
[INFO] Apache Jena - JDBC TDB Driver ..................... SUCCESS [05:19 min]
[INFO] Apache Jena - JDBC Driver Bundle .................. SUCCESS [ 18.091 s]
[INFO] Apache Jena - Maven Plugins, including schemagen .. SUCCESS [01:22 min]
[INFO] Apache Jena - Elephas ............................. SUCCESS [  0.836 s]
[INFO] Apache Jena - Elephas - Common API ................ SUCCESS [  6.110 s]
[INFO] Apache Jena - Elephas - I/O ....................... FAILURE [18:38 min]
[INFO] Apache Jena - Elephas - Map/Reduce ................ SKIPPED
[INFO] Apache Jena - Elephas - Statistics Demo App ....... SKIPPED
[INFO] Apache Jena - Distribution ........................ SKIPPED
[INFO] Apache Jena - OSGi ................................ SKIPPED
[INFO] Apache Jena - OSGi bundle ......................... SKIPPED
[INFO] Apache Jena - Extras .............................. SKIPPED
[INFO] Apache Jena - Extras - Query Builder .............. SKIPPED
[INFO] Apache Jena ....................................... SKIPPED
[INFO] ------------------------------------------------------------------------
[INFO] BUILD FAILURE
[INFO] ------------------------------------------------------------------------
[INFO] Total time: 35:30 min
[INFO] Finished at: 2015-05-01T14:12:21+00:00

[INFO] Final Memory: 115M/558M
[INFO] ------------------------------------------------------------------------
Waiting for Jenkins to finish collecting data
[ERROR] Failed to execute goal org.apache.maven.plugins:maven-javadoc-plugin:2.9.1:jar (attach-javadocs)
on project jena-elephas-io: MavenReportException: Error while creating archive:
[ERROR] Exit code: 1 - error: error reading /home/jenkins/jenkins-slave/maven-repositories/1/com/sun/jersey/jersey-client/1.9/jersey-client-1.9.jar;
error in opening zip file
[ERROR] 
[ERROR] Command line was: /home/jenkins/tools/java/jdk1.8.0/jre/../bin/javadoc @options @packages
[ERROR] 
[ERROR] Refer to the generated Javadoc files in '<https://builds.apache.org/job/Jena_Development_Test/ws/jena-elephas/jena-elephas-io/target/apidocs'>
dir.
[ERROR] -> [Help 1]
[ERROR] 
[ERROR] To see the full stack trace of the errors, re-run Maven with the -e switch.
[ERROR] Re-run Maven using the -X switch to enable full debug logging.
[ERROR] 
[ERROR] For more information about the errors and possible solutions, please read the following
articles:
[ERROR] [Help 1] http://cwiki.apache.org/confluence/display/MAVEN/MojoExecutionException
[ERROR] 
[ERROR] After correcting the problems, you can resume the build with the command
[ERROR]   mvn <goals> -rf :jena-elephas-io
channel stopped

Mime
View raw message