jena-commits mailing list archives

Site index · List index
Message view « Date » · « Thread »
Top « Date » · « Thread »
From Apache Jenkins Server <jenk...@builds.apache.org>
Subject Build failed in Jenkins: Jena_Development_Test #1844
Date Wed, 22 Apr 2015 17:44:01 GMT
See <https://builds.apache.org/job/Jena_Development_Test/1844/changes>

Changes:

[andy] JENA-911 : Code for stricter IRI parsing (not enabled).

[andy] JENA-911 : No need to keep old code.

------------------------------------------
[...truncated 2078 lines...]

-------------------------------------------------------
 T E S T S
-------------------------------------------------------
Running org.apache.jena.jdbc.remote.statements.TestRemoteEndpointStatements
Tests run: 183, Failures: 0, Errors: 0, Skipped: 0, Time elapsed: 2.762 sec - in org.apache.jena.jdbc.remote.statements.TestRemoteEndpointStatements
Running org.apache.jena.jdbc.remote.TestRemoteEndpointDriver
Tests run: 27, Failures: 0, Errors: 0, Skipped: 0, Time elapsed: 0.026 sec - in org.apache.jena.jdbc.remote.TestRemoteEndpointDriver
Running org.apache.jena.jdbc.remote.connections.TestRemoteEndpointConnectionWithGraphUris
Tests run: 99, Failures: 0, Errors: 0, Skipped: 8, Time elapsed: 0.988 sec - in org.apache.jena.jdbc.remote.connections.TestRemoteEndpointConnectionWithGraphUris
Running org.apache.jena.jdbc.remote.connections.TestRemoteEndpointConnectionWithAuth
Tests run: 1, Failures: 0, Errors: 0, Skipped: 1, Time elapsed: 0 sec - in org.apache.jena.jdbc.remote.connections.TestRemoteEndpointConnectionWithAuth
Running org.apache.jena.jdbc.remote.connections.TestRemoteEndpointConnectionWithResultSetTypes
Tests run: 99, Failures: 0, Errors: 0, Skipped: 8, Time elapsed: 0.651 sec - in org.apache.jena.jdbc.remote.connections.TestRemoteEndpointConnectionWithResultSetTypes
Running org.apache.jena.jdbc.remote.connections.TestRemoteEndpointConnection
Tests run: 99, Failures: 0, Errors: 0, Skipped: 8, Time elapsed: 0.614 sec - in org.apache.jena.jdbc.remote.connections.TestRemoteEndpointConnection
Running org.apache.jena.jdbc.remote.metadata.TestRemoteConnectionMetadata
Tests run: 2, Failures: 0, Errors: 0, Skipped: 0, Time elapsed: 0.069 sec - in org.apache.jena.jdbc.remote.metadata.TestRemoteConnectionMetadata
Running org.apache.jena.jdbc.remote.results.TestRemoteEndpointResults
Tests run: 221, Failures: 0, Errors: 0, Skipped: 0, Time elapsed: 3.344 sec - in org.apache.jena.jdbc.remote.results.TestRemoteEndpointResults
Running org.apache.jena.jdbc.remote.results.TestRemoteEndpointResultsWithAuth
Tests run: 1, Failures: 0, Errors: 0, Skipped: 1, Time elapsed: 0 sec - in org.apache.jena.jdbc.remote.results.TestRemoteEndpointResultsWithAuth
Running org.apache.jena.jdbc.remote.results.TestRemoteEndpointResultsWithResultSetTypes
Tests run: 221, Failures: 0, Errors: 0, Skipped: 0, Time elapsed: 2.38 sec - in org.apache.jena.jdbc.remote.results.TestRemoteEndpointResultsWithResultSetTypes
Running org.apache.jena.jdbc.remote.results.TestRemoteEndpointResultsWithGraphUris
Tests run: 221, Failures: 0, Errors: 0, Skipped: 0, Time elapsed: 2.873 sec - in org.apache.jena.jdbc.remote.results.TestRemoteEndpointResultsWithGraphUris

Results :

Tests run: 1174, Failures: 0, Errors: 0, Skipped: 26

[JENKINS] Recording test results
[INFO] 
[INFO] --- maven-jar-plugin:2.4:jar (default-jar) @ jena-jdbc-driver-remote ---
[INFO] Building jar: <https://builds.apache.org/job/Jena_Development_Test/ws/jena-jdbc/jena-jdbc-driver-remote/target/jena-jdbc-driver-remote-1.1.3-SNAPSHOT.jar>
[INFO] 
[INFO] --- maven-site-plugin:3.4:attach-descriptor (attach-descriptor) @ jena-jdbc-driver-remote
---
[INFO] 
[INFO] --- maven-license-plugin:1.9.0:check (default) @ jena-jdbc-driver-remote ---
[INFO] Checking licenses...
[INFO] 
[INFO] --- maven-source-plugin:2.1.1:jar-no-fork (attach-sources) @ jena-jdbc-driver-remote
---
[INFO] Building jar: <https://builds.apache.org/job/Jena_Development_Test/ws/jena-jdbc/jena-jdbc-driver-remote/target/jena-jdbc-driver-remote-1.1.3-SNAPSHOT-sources.jar>
[INFO] 
[INFO] --- maven-source-plugin:2.1.1:jar-no-fork (bundle-sources) @ jena-jdbc-driver-remote
---
[INFO] 
[INFO] --- maven-jar-plugin:2.4:test-jar (default) @ jena-jdbc-driver-remote ---
[INFO] Building jar: <https://builds.apache.org/job/Jena_Development_Test/ws/jena-jdbc/jena-jdbc-driver-remote/target/jena-jdbc-driver-remote-1.1.3-SNAPSHOT-tests.jar>
[INFO] 
[INFO] --- maven-javadoc-plugin:2.9:jar (attach-javadocs) @ jena-jdbc-driver-remote ---
[INFO] 
1 warning
[WARNING] Javadoc Warnings
[WARNING] javadoc: warning - Error fetching URL: http://jena.apache.org/documentation/javadoc/fuseki/package-list
[INFO] Building jar: <https://builds.apache.org/job/Jena_Development_Test/ws/jena-jdbc/jena-jdbc-driver-remote/target/jena-jdbc-driver-remote-1.1.3-SNAPSHOT-javadoc.jar>
[INFO] 
[INFO] --- maven-javadoc-plugin:2.9:jar (default) @ jena-jdbc-driver-remote ---
[INFO] 
1 warning
[WARNING] Javadoc Warnings
[WARNING] javadoc: warning - Error fetching URL: http://jena.apache.org/documentation/javadoc/fuseki/package-list
[INFO] Building jar: <https://builds.apache.org/job/Jena_Development_Test/ws/jena-jdbc/jena-jdbc-driver-remote/target/jena-jdbc-driver-remote-1.1.3-SNAPSHOT-javadoc.jar>
[INFO] 
[INFO] --- maven-javadoc-plugin:2.9:test-jar (default) @ jena-jdbc-driver-remote ---
[INFO] The goal 'org.apache.maven.plugins:maven-javadoc-plugin:2.9:javadoc' has not been previously
called for the module: 'org.apache.jena:jena-fuseki1:jar:1.1.3-SNAPSHOT'. Trying to invoke
it...
[WARNING] Creating fake javadoc directory to prevent repeated invocations: <https://builds.apache.org/job/Jena_Development_Test/ws/jena-fuseki1/target/testapidocs>
[ERROR] Error fetching link: <https://builds.apache.org/job/Jena_Development_Test/ws/jena-fuseki1/target/testapidocs/package-list.>
Ignored it.
[INFO] 
1 warning
[WARNING] Javadoc Warnings
[WARNING] javadoc: warning - Error fetching URL: http://jena.apache.org/documentation/javadoc/fuseki/package-list
[INFO] Building jar: <https://builds.apache.org/job/Jena_Development_Test/ws/jena-jdbc/jena-jdbc-driver-remote/target/jena-jdbc-driver-remote-1.1.3-SNAPSHOT-test-javadoc.jar>
[JENKINS] Archiving disabled
[INFO]                                                                         
[INFO] ------------------------------------------------------------------------
[INFO] Building Apache Jena - JDBC In-Memory Driver 1.1.3-SNAPSHOT
[INFO] ------------------------------------------------------------------------
[INFO] 
[INFO] --- maven-clean-plugin:2.5:clean (default-clean) @ jena-jdbc-driver-mem ---
[INFO] Deleting <https://builds.apache.org/job/Jena_Development_Test/ws/jena-jdbc/jena-jdbc-driver-mem/target>
[INFO] 
[INFO] --- maven-enforcer-plugin:1.3.1:enforce (enforce) @ jena-jdbc-driver-mem ---
[INFO] 
[INFO] --- apache-rat-plugin:0.11:check (rat-checks) @ jena-jdbc-driver-mem ---
[INFO] 51 implicit excludes (use -debug for more details).
[INFO] Exclude: **/src-examples/data/*
[INFO] Exclude: **/dist/ABOUT
[INFO] Exclude: **/SEE_FUSEKI2
[INFO] Exclude: **/src/main/webapp/css/*
[INFO] Exclude: **/src/main/webapp/fonts/*
[INFO] Exclude: **/src/main/webapp/js/**/*
[INFO] Exclude: **/vocabularies/*
[INFO] Exclude: **/Vocabularies/*
[INFO] Exclude: **/src/main/**/*.html
[INFO] Exclude: **/src/**/package-info.java
[INFO] Exclude: **/DEPENDENCIES
[INFO] Exclude: **/*.txt
[INFO] Exclude: **/*.md
[INFO] Exclude: **/META-INF/services/*
[INFO] Exclude: **/src/test/resources/**/*
[INFO] Exclude: **/testing/**/*
[INFO] Exclude: **/log4j.properties
[INFO] Exclude: **/log4j-testing.properties
[INFO] Exclude: **/derby.log
[INFO] Exclude: **/DB/**/*
[INFO] Exclude: **/tdb*.cfg
[INFO] Exclude: **/run/**/*
[INFO] Exclude: **/*.classpath
[INFO] Exclude: **/target/**/*
[INFO] Exclude: **/dependency-reduced-pom.xml
[INFO] 15 resources included (use -debug for more details)
[INFO] Rat check: Summary of files. Unapproved: 0 unknown: 0 generated: 0 approved: 13 licence.
[INFO] 
[INFO] --- maven-remote-resources-plugin:1.5:process (default) @ jena-jdbc-driver-mem ---
[INFO] 
[INFO] --- maven-resources-plugin:2.6:resources (default-resources) @ jena-jdbc-driver-mem
---
[INFO] Using 'UTF-8' encoding to copy filtered resources.
[INFO] Copying 1 resource
[INFO] Copying 3 resources
[INFO] 
[INFO] --- maven-compiler-plugin:3.1:compile (default-compile) @ jena-jdbc-driver-mem ---
[INFO] Changes detected - recompiling the module!
[INFO] Compiling 3 source files to <https://builds.apache.org/job/Jena_Development_Test/ws/jena-jdbc/jena-jdbc-driver-mem/target/classes>
[INFO] 
[INFO] --- maven-resources-plugin:2.6:testResources (default-testResources) @ jena-jdbc-driver-mem
---
[INFO] Using 'UTF-8' encoding to copy filtered resources.
[INFO] Copying 1 resource
[INFO] Copying 3 resources
[INFO] 
[INFO] --- maven-compiler-plugin:3.1:testCompile (default-testCompile) @ jena-jdbc-driver-mem
---
[INFO] Changes detected - recompiling the module!
[INFO] Compiling 9 source files to <https://builds.apache.org/job/Jena_Development_Test/ws/jena-jdbc/jena-jdbc-driver-mem/target/test-classes>
[INFO] 
[INFO] --- maven-surefire-plugin:2.17:test (default-test) @ jena-jdbc-driver-mem ---
[INFO] Surefire report directory: <https://builds.apache.org/job/Jena_Development_Test/ws/jena-jdbc/jena-jdbc-driver-mem/target/surefire-reports>

-------------------------------------------------------
 T E S T S
-------------------------------------------------------
Running org.apache.jena.jdbc.mem.statements.TestMemStatements
Tests run: 183, Failures: 0, Errors: 0, Skipped: 0, Time elapsed: 1.263 sec - in org.apache.jena.jdbc.mem.statements.TestMemStatements
Running org.apache.jena.jdbc.mem.TestMemDriverWithLogging
Tests run: 24, Failures: 0, Errors: 0, Skipped: 0, Time elapsed: 0.043 sec - in org.apache.jena.jdbc.mem.TestMemDriverWithLogging
Running org.apache.jena.jdbc.mem.TestMemDriver
Tests run: 24, Failures: 0, Errors: 0, Skipped: 0, Time elapsed: 0.017 sec - in org.apache.jena.jdbc.mem.TestMemDriver
Running org.apache.jena.jdbc.mem.connections.TestDatasetConnection
Killed

Results :

Tests run: 231, Failures: 0, Errors: 0, Skipped: 0

[JENKINS] Recording test results
[JENKINS] Archiving disabled
[JENKINS] Archiving disabled
[JENKINS] Archiving disabled
[JENKINS] Archiving disabled
[JENKINS] Archiving disabled
[JENKINS] Archiving disabled
[JENKINS] Archiving disabled
[JENKINS] Archiving disabled
[JENKINS] Archiving disabled
[JENKINS] Archiving disabled
[JENKINS] Archiving disabled
[JENKINS] Archiving disabled
[JENKINS] Archiving disabled
[JENKINS] Archiving disabled
[JENKINS] Archiving disabled
[JENKINS] Archiving disabled
[JENKINS] Archiving disabled
[JENKINS] Archiving disabled
[JENKINS] Archiving disabled
[JENKINS] Archiving disabled
[JENKINS] Archiving disabled
[JENKINS] Archiving disabled
[JENKINS] Archiving disabled
[JENKINS] Archiving disabled
[JENKINS] Archiving disabled
[JENKINS] Archiving disabled
[JENKINS] Archiving disabled
[JENKINS] Archiving disabled
[JENKINS] Archiving disabled
[JENKINS] Archiving disabled
[JENKINS] Archiving disabled
[JENKINS] Archiving disabled
[JENKINS] Archiving disabled
[JENKINS] Archiving disabled
[JENKINS] Archiving disabled
[JENKINS] Archiving disabled
[JENKINS] Archiving disabled[INFO] ------------------------------------------------------------------------
[INFO] Reactor Summary:
[INFO] 
[INFO] Apache Jena - Parent .............................. SUCCESS [  3.670 s]
[INFO] Apache Jena - Shadowed external libraries ......... SUCCESS [  5.728 s]
[INFO] Apache Jena - IRI ................................. SUCCESS [  8.090 s]
[INFO] Apache Jena - Core ................................ SUCCESS [01:06 min]
[INFO] Apache Jena - ARQ (SPARQL 1.1 Query Engine) ....... SUCCESS [01:26 min]
[INFO] Apache Jena - TDB (Native Triple Store) ........... SUCCESS [ 13.781 s]
[INFO] Apache Jena - Libraries POM ....................... SUCCESS [  0.496 s]
[INFO] Apache Jena - SPARQL Text Search .................. SUCCESS [ 19.858 s]
[INFO] Apache Jena - SPARQL Spatial Search ............... SUCCESS [  8.440 s]
[INFO] Apache Jena - Data Tables for RDF and SPARQL ...... SUCCESS [  6.076 s]
[INFO] Apache Jena - SDB (SQL based triple store) ........ SUCCESS [ 30.632 s]
[INFO] Apache Jena - Fuseki1 ............................. SUCCESS [ 20.998 s]
[INFO] Apache Jena - Fuseki - A SPARQL 1.1 Server ........ SUCCESS [  0.720 s]
[INFO] Apache Jena - Fuseki Server Engine ................ SUCCESS [ 10.353 s]
[INFO] Apache Jena - Fuseki WAR File ..................... SUCCESS [  6.365 s]
[INFO] Apache Jena - Fuseki Server Standalone Jar ........ SUCCESS [  5.672 s]
[INFO] Apache Jena - Fuseki Binary Distribution .......... SUCCESS [  8.253 s]
[INFO] Apache Jena - Security ............................ SUCCESS [ 21.930 s]
[INFO] Apache Jena - JDBC Parent ......................... SUCCESS [  3.043 s]
[INFO] Apache Jena - JDBC Core API ....................... SUCCESS [ 43.861 s]
[INFO] Apache Jena - JDBC Remote Endpoint Driver ......... SUCCESS [ 35.959 s]
[INFO] Apache Jena - JDBC In-Memory Driver ............... FAILURE [  3.890 s]
[INFO] Apache Jena - JDBC TDB Driver ..................... SKIPPED
[INFO] Apache Jena - JDBC Driver Bundle .................. SKIPPED
[INFO] Apache Jena - Maven Plugins, including schemagen .. SKIPPED
[INFO] Apache Jena - Elephas ............................. SKIPPED
[INFO] Apache Jena - Elephas - Common API ................ SKIPPED
[INFO] Apache Jena - Elephas - I/O ....................... SKIPPED
[INFO] Apache Jena - Elephas - Map/Reduce ................ SKIPPED
[INFO] Apache Jena - Elephas - Statistics Demo App ....... SKIPPED
[INFO] Apache Jena - Distribution ........................ SKIPPED
[INFO] Apache Jena - OSGi ................................ SKIPPED
[INFO] Apache Jena - OSGi bundle ......................... SKIPPED
[INFO] Apache Jena - Extras .............................. SKIPPED
[INFO] Apache Jena - Extras - Query Builder .............. SKIPPED
[INFO] Apache Jena ....................................... SKIPPED
[INFO] ------------------------------------------------------------------------
[INFO] BUILD FAILURE
[INFO] ------------------------------------------------------------------------
[INFO] Total time: 07:14 min
[INFO] Finished at: 2015-04-22T17:41:46+00:00

[INFO] Final Memory: 87M/492M
[INFO] ------------------------------------------------------------------------
[ERROR] Failed to execute goal org.apache.maven.plugins:maven-surefire-plugin:2.17:test (default-test)
on project jena-jdbc-driver-mem: Execution default-test of goal org.apache.maven.plugins:maven-surefire-plugin:2.17:test
failed: The forked VM terminated without properly saying goodbye. VM crash or System.exit
called?
[ERROR] Command was /bin/sh -c cd <https://builds.apache.org/job/Jena_Development_Test/ws/jena-jdbc/jena-jdbc-driver-mem>
&& /home/jenkins/tools/java/jdk1.7.0_25-32/jre/bin/java -jar <https://builds.apache.org/job/Jena_Development_Test/ws/jena-jdbc/jena-jdbc-driver-mem/target/surefire/surefirebooter6343798930420643440.jar>
<https://builds.apache.org/job/Jena_Development_Test/ws/jena-jdbc/jena-jdbc-driver-mem/target/surefire/surefire8390475994024195842tmp>
<https://builds.apache.org/job/Jena_Development_Test/ws/jena-jdbc/jena-jdbc-driver-mem/target/surefire/surefire_122658972810672862238tmp>
[ERROR] -> [Help 1]
[ERROR] 
[ERROR] To see the full stack trace of the errors, re-run Maven with the -e switch.
[ERROR] Re-run Maven using the -X switch to enable full debug logging.
[ERROR] 
[ERROR] For more information about the errors and possible solutions, please read the following
articles:
[ERROR] [Help 1] http://cwiki.apache.org/confluence/display/MAVEN/PluginExecutionException
[ERROR] 
[ERROR] After correcting the problems, you can resume the build with the command
[ERROR]   mvn <goals> -rf :jena-jdbc-driver-mem
channel stopped

Mime
View raw message