jena-commits mailing list archives

Site index · List index
Message view « Date » · « Thread »
Top « Date » · « Thread »
From Apache Jenkins Server <jenk...@builds.apache.org>
Subject Build failed in Jenkins: Jena_Development_Test_Java8 #186
Date Thu, 05 Mar 2015 20:24:09 GMT
See <https://builds.apache.org/job/Jena_Development_Test_Java8/186/changes>

Changes:

[andy] code format

[stain] Updated yasr 2.4.12

[stain] Updated yasqe 2.3.9

[andy] Skip potential "log4j.properties" if they look like test resources.

[andy] JENA-894 : Use a backup file within the server runtime area.

[andy] Remove junk in log4j.properties

[andy] Rename folder jena-fuseki to jena-fuseki1

[andy] Rename artifact jena-fuseki as jena-fuseki1

[andy] Update for jena-fuseki1 rename

------------------------------------------
[...truncated 3274 lines...]
Running org.apache.jena.hadoop.rdf.io.input.trix.TriXInputTest
Tests run: 12, Failures: 0, Errors: 0, Skipped: 3, Time elapsed: 72.275 sec - in org.apache.jena.hadoop.rdf.io.input.trix.TriXInputTest
Running org.apache.jena.hadoop.rdf.io.input.thrift.ThriftQuadInputTest
Tests run: 12, Failures: 0, Errors: 0, Skipped: 3, Time elapsed: 7.751 sec - in org.apache.jena.hadoop.rdf.io.input.thrift.ThriftQuadInputTest
Running org.apache.jena.hadoop.rdf.io.input.thrift.ThriftTripleInputTest
Tests run: 12, Failures: 0, Errors: 0, Skipped: 3, Time elapsed: 7.142 sec - in org.apache.jena.hadoop.rdf.io.input.thrift.ThriftTripleInputTest
Running org.apache.jena.hadoop.rdf.io.input.turtle.TurtleInputTest
Tests run: 12, Failures: 0, Errors: 0, Skipped: 3, Time elapsed: 1.184 sec - in org.apache.jena.hadoop.rdf.io.input.turtle.TurtleInputTest
Running org.apache.jena.hadoop.rdf.io.input.rdfjson.RdfJsonInputTest
Tests run: 12, Failures: 0, Errors: 0, Skipped: 3, Time elapsed: 1.893 sec - in org.apache.jena.hadoop.rdf.io.input.rdfjson.RdfJsonInputTest
Running org.apache.jena.hadoop.rdf.io.input.jsonld.JsonLDTripleInputTest
Tests run: 12, Failures: 0, Errors: 0, Skipped: 3, Time elapsed: 71.823 sec - in org.apache.jena.hadoop.rdf.io.input.jsonld.JsonLDTripleInputTest
Running org.apache.jena.hadoop.rdf.io.input.jsonld.JsonLDQuadInputTest
Tests run: 12, Failures: 0, Errors: 0, Skipped: 3, Time elapsed: 70.755 sec - in org.apache.jena.hadoop.rdf.io.input.jsonld.JsonLDQuadInputTest
Running org.apache.jena.hadoop.rdf.io.input.rdfxml.RdfXmlInputTest
Tests run: 12, Failures: 0, Errors: 0, Skipped: 3, Time elapsed: 10.367 sec - in org.apache.jena.hadoop.rdf.io.input.rdfxml.RdfXmlInputTest
Running org.apache.jena.hadoop.rdf.io.input.compressed.trig.DeflatedTriGInputTest
Tests run: 12, Failures: 0, Errors: 0, Skipped: 3, Time elapsed: 1.572 sec - in org.apache.jena.hadoop.rdf.io.input.compressed.trig.DeflatedTriGInputTest
Running org.apache.jena.hadoop.rdf.io.input.compressed.trig.GZippedTriGInputTest
Tests run: 12, Failures: 0, Errors: 0, Skipped: 3, Time elapsed: 1.282 sec - in org.apache.jena.hadoop.rdf.io.input.compressed.trig.GZippedTriGInputTest
Running org.apache.jena.hadoop.rdf.io.input.compressed.trig.BZippedTriGInputTest
Tests run: 12, Failures: 0, Errors: 0, Skipped: 3, Time elapsed: 5.73 sec - in org.apache.jena.hadoop.rdf.io.input.compressed.trig.BZippedTriGInputTest
Running org.apache.jena.hadoop.rdf.io.input.compressed.trix.BZippedTriXInputTest
Tests run: 12, Failures: 0, Errors: 0, Skipped: 3, Time elapsed: 5.339 sec - in org.apache.jena.hadoop.rdf.io.input.compressed.trix.BZippedTriXInputTest
Running org.apache.jena.hadoop.rdf.io.input.compressed.trix.GZippedTriXInputTest
Tests run: 12, Failures: 0, Errors: 0, Skipped: 3, Time elapsed: 1.478 sec - in org.apache.jena.hadoop.rdf.io.input.compressed.trix.GZippedTriXInputTest
Running org.apache.jena.hadoop.rdf.io.input.compressed.trix.DeflatedTriXInputTest
Tests run: 12, Failures: 0, Errors: 0, Skipped: 3, Time elapsed: 1.382 sec - in org.apache.jena.hadoop.rdf.io.input.compressed.trix.DeflatedTriXInputTest
Running org.apache.jena.hadoop.rdf.io.input.compressed.thrift.GZippedThriftTripleInputTest
Tests run: 12, Failures: 0, Errors: 0, Skipped: 3, Time elapsed: 7.515 sec - in org.apache.jena.hadoop.rdf.io.input.compressed.thrift.GZippedThriftTripleInputTest
Running org.apache.jena.hadoop.rdf.io.input.compressed.thrift.DeflatedThriftQuadInputTest
Tests run: 12, Failures: 0, Errors: 0, Skipped: 3, Time elapsed: 7.704 sec - in org.apache.jena.hadoop.rdf.io.input.compressed.thrift.DeflatedThriftQuadInputTest
Running org.apache.jena.hadoop.rdf.io.input.compressed.thrift.BZippedThriftTripleInputTest
Tests run: 12, Failures: 0, Errors: 0, Skipped: 3, Time elapsed: 16.971 sec - in org.apache.jena.hadoop.rdf.io.input.compressed.thrift.BZippedThriftTripleInputTest
Running org.apache.jena.hadoop.rdf.io.input.compressed.thrift.DeflatedThriftTripleInputTest
Tests run: 12, Failures: 0, Errors: 0, Skipped: 3, Time elapsed: 7.465 sec - in org.apache.jena.hadoop.rdf.io.input.compressed.thrift.DeflatedThriftTripleInputTest
Running org.apache.jena.hadoop.rdf.io.input.compressed.thrift.BZippedThriftQuadInputTest
Tests run: 12, Failures: 0, Errors: 0, Skipped: 3, Time elapsed: 18.217 sec - in org.apache.jena.hadoop.rdf.io.input.compressed.thrift.BZippedThriftQuadInputTest
Running org.apache.jena.hadoop.rdf.io.input.compressed.thrift.GZippedThriftQuadInputTest
Tests run: 12, Failures: 0, Errors: 0, Skipped: 3, Time elapsed: 7.672 sec - in org.apache.jena.hadoop.rdf.io.input.compressed.thrift.GZippedThriftQuadInputTest
Running org.apache.jena.hadoop.rdf.io.input.compressed.turtle.BZippedTurtleInputTest
Tests run: 12, Failures: 0, Errors: 0, Skipped: 3, Time elapsed: 4.949 sec - in org.apache.jena.hadoop.rdf.io.input.compressed.turtle.BZippedTurtleInputTest
Running org.apache.jena.hadoop.rdf.io.input.compressed.turtle.GZippedTurtleInputTest
Tests run: 12, Failures: 0, Errors: 0, Skipped: 3, Time elapsed: 1.29 sec - in org.apache.jena.hadoop.rdf.io.input.compressed.turtle.GZippedTurtleInputTest
Running org.apache.jena.hadoop.rdf.io.input.compressed.turtle.DeflatedTurtleInputTest
Tests run: 12, Failures: 0, Errors: 0, Skipped: 3, Time elapsed: 1.36 sec - in org.apache.jena.hadoop.rdf.io.input.compressed.turtle.DeflatedTurtleInputTest
Running org.apache.jena.hadoop.rdf.io.input.compressed.rdfjson.BZippedRdfJsonInputTest
Tests run: 12, Failures: 0, Errors: 0, Skipped: 3, Time elapsed: 16.195 sec - in org.apache.jena.hadoop.rdf.io.input.compressed.rdfjson.BZippedRdfJsonInputTest
Running org.apache.jena.hadoop.rdf.io.input.compressed.rdfjson.DeflatedRdfJsonInputTest
Tests run: 12, Failures: 0, Errors: 0, Skipped: 3, Time elapsed: 2.497 sec - in org.apache.jena.hadoop.rdf.io.input.compressed.rdfjson.DeflatedRdfJsonInputTest
Running org.apache.jena.hadoop.rdf.io.input.compressed.rdfjson.GZippedRdfJsonInputTest
Tests run: 12, Failures: 0, Errors: 0, Skipped: 3, Time elapsed: 2.836 sec - in org.apache.jena.hadoop.rdf.io.input.compressed.rdfjson.GZippedRdfJsonInputTest
Running org.apache.jena.hadoop.rdf.io.input.compressed.jsonld.GZippedJsonLDTripleInputTest
Tests run: 12, Failures: 0, Errors: 0, Skipped: 3, Time elapsed: 70.716 sec - in org.apache.jena.hadoop.rdf.io.input.compressed.jsonld.GZippedJsonLDTripleInputTest
Running org.apache.jena.hadoop.rdf.io.input.compressed.jsonld.DeflatedJsonLDQuadInputTest
Tests run: 12, Failures: 0, Errors: 0, Skipped: 3, Time elapsed: 71.037 sec - in org.apache.jena.hadoop.rdf.io.input.compressed.jsonld.DeflatedJsonLDQuadInputTest
Running org.apache.jena.hadoop.rdf.io.input.compressed.jsonld.GZippedJsonLDQuadInputTest
Tests run: 12, Failures: 0, Errors: 0, Skipped: 3, Time elapsed: 71.105 sec - in org.apache.jena.hadoop.rdf.io.input.compressed.jsonld.GZippedJsonLDQuadInputTest
Running org.apache.jena.hadoop.rdf.io.input.compressed.jsonld.BZippedJsonLDTripleInputTest
Tests run: 12, Failures: 0, Errors: 0, Skipped: 3, Time elapsed: 71.619 sec - in org.apache.jena.hadoop.rdf.io.input.compressed.jsonld.BZippedJsonLDTripleInputTest
Running org.apache.jena.hadoop.rdf.io.input.compressed.jsonld.BZippedJsonLDQuadInputTest
Tests run: 12, Failures: 0, Errors: 0, Skipped: 3, Time elapsed: 77.751 sec - in org.apache.jena.hadoop.rdf.io.input.compressed.jsonld.BZippedJsonLDQuadInputTest
Running org.apache.jena.hadoop.rdf.io.input.compressed.jsonld.DeflatedJsonLDTripleInputTest
Tests run: 12, Failures: 0, Errors: 0, Skipped: 3, Time elapsed: 70.651 sec - in org.apache.jena.hadoop.rdf.io.input.compressed.jsonld.DeflatedJsonLDTripleInputTest
Running org.apache.jena.hadoop.rdf.io.input.compressed.rdfxml.BZippedRdfXmlInputTest
Tests run: 12, Failures: 0, Errors: 0, Skipped: 3, Time elapsed: 18.598 sec - in org.apache.jena.hadoop.rdf.io.input.compressed.rdfxml.BZippedRdfXmlInputTest
Running org.apache.jena.hadoop.rdf.io.input.compressed.rdfxml.GZippedRdfXmlInputTest
Tests run: 12, Failures: 0, Errors: 0, Skipped: 3, Time elapsed: 10.256 sec - in org.apache.jena.hadoop.rdf.io.input.compressed.rdfxml.GZippedRdfXmlInputTest
Running org.apache.jena.hadoop.rdf.io.input.compressed.rdfxml.DeflatedRdfXmlInputTest
Tests run: 12, Failures: 0, Errors: 0, Skipped: 3, Time elapsed: 10.188 sec - in org.apache.jena.hadoop.rdf.io.input.compressed.rdfxml.DeflatedRdfXmlInputTest
Running org.apache.jena.hadoop.rdf.io.input.compressed.ntriples.BZippedWholeFileNTriplesInputTest
Tests run: 12, Failures: 0, Errors: 0, Skipped: 3, Time elapsed: 10.463 sec - in org.apache.jena.hadoop.rdf.io.input.compressed.ntriples.BZippedWholeFileNTriplesInputTest
Running org.apache.jena.hadoop.rdf.io.input.compressed.ntriples.DeflatedNTriplesInputTest
Tests run: 12, Failures: 0, Errors: 0, Skipped: 3, Time elapsed: 1.075 sec - in org.apache.jena.hadoop.rdf.io.input.compressed.ntriples.DeflatedNTriplesInputTest
Running org.apache.jena.hadoop.rdf.io.input.compressed.ntriples.GZippedWholeFileNTriplesInputTest
Tests run: 12, Failures: 0, Errors: 0, Skipped: 3, Time elapsed: 1.402 sec - in org.apache.jena.hadoop.rdf.io.input.compressed.ntriples.GZippedWholeFileNTriplesInputTest
Running org.apache.jena.hadoop.rdf.io.input.compressed.ntriples.BZippedNTriplesInputTest
Tests run: 12, Failures: 0, Errors: 0, Skipped: 3, Time elapsed: 3.311 sec - in org.apache.jena.hadoop.rdf.io.input.compressed.ntriples.BZippedNTriplesInputTest
Running org.apache.jena.hadoop.rdf.io.input.compressed.ntriples.DeflatedWholeFileNTriplesInputTest
Tests run: 12, Failures: 0, Errors: 0, Skipped: 3, Time elapsed: 1.298 sec - in org.apache.jena.hadoop.rdf.io.input.compressed.ntriples.DeflatedWholeFileNTriplesInputTest
Running org.apache.jena.hadoop.rdf.io.input.compressed.ntriples.GZippedNTriplesInputTest
Tests run: 12, Failures: 0, Errors: 0, Skipped: 3, Time elapsed: 1.052 sec - in org.apache.jena.hadoop.rdf.io.input.compressed.ntriples.GZippedNTriplesInputTest
Running org.apache.jena.hadoop.rdf.io.input.compressed.nquads.DeflatedWholeFileNQuadsInputTest
Tests run: 12, Failures: 0, Errors: 0, Skipped: 3, Time elapsed: 1.561 sec - in org.apache.jena.hadoop.rdf.io.input.compressed.nquads.DeflatedWholeFileNQuadsInputTest
Running org.apache.jena.hadoop.rdf.io.input.compressed.nquads.BZipppedNQuadsInputTest
Tests run: 12, Failures: 0, Errors: 0, Skipped: 3, Time elapsed: 4.692 sec - in org.apache.jena.hadoop.rdf.io.input.compressed.nquads.BZipppedNQuadsInputTest
Running org.apache.jena.hadoop.rdf.io.input.compressed.nquads.DeflatedNQuadsInputTest
Tests run: 12, Failures: 0, Errors: 0, Skipped: 3, Time elapsed: 1.136 sec - in org.apache.jena.hadoop.rdf.io.input.compressed.nquads.DeflatedNQuadsInputTest
Running org.apache.jena.hadoop.rdf.io.input.compressed.nquads.BZipppedWholeFileNQuadsInputTest
Tests run: 12, Failures: 0, Errors: 0, Skipped: 3, Time elapsed: 11.295 sec - in org.apache.jena.hadoop.rdf.io.input.compressed.nquads.BZipppedWholeFileNQuadsInputTest
Running org.apache.jena.hadoop.rdf.io.input.compressed.nquads.GZippedWholeFileNQuadsInputTest
Tests run: 12, Failures: 0, Errors: 0, Skipped: 3, Time elapsed: 1.767 sec - in org.apache.jena.hadoop.rdf.io.input.compressed.nquads.GZippedWholeFileNQuadsInputTest
Running org.apache.jena.hadoop.rdf.io.input.compressed.nquads.GZippedNQuadsInputTest
Tests run: 12, Failures: 0, Errors: 0, Skipped: 3, Time elapsed: 1.134 sec - in org.apache.jena.hadoop.rdf.io.input.compressed.nquads.GZippedNQuadsInputTest
Running org.apache.jena.hadoop.rdf.io.input.ntriples.NTriplesInputTest
Tests run: 12, Failures: 0, Errors: 0, Skipped: 0, Time elapsed: 0.921 sec - in org.apache.jena.hadoop.rdf.io.input.ntriples.NTriplesInputTest
Running org.apache.jena.hadoop.rdf.io.input.ntriples.WholeFileNTriplesInputTest
Tests run: 12, Failures: 0, Errors: 0, Skipped: 3, Time elapsed: 0.657 sec - in org.apache.jena.hadoop.rdf.io.input.ntriples.WholeFileNTriplesInputTest
Running org.apache.jena.hadoop.rdf.io.input.ntriples.BlockedNTriplesInputTest
Tests run: 12, Failures: 0, Errors: 0, Skipped: 0, Time elapsed: 3.292 sec - in org.apache.jena.hadoop.rdf.io.input.ntriples.BlockedNTriplesInputTest
Running org.apache.jena.hadoop.rdf.io.input.nquads.NQuadsInputTest
Tests run: 12, Failures: 0, Errors: 0, Skipped: 0, Time elapsed: 0.964 sec - in org.apache.jena.hadoop.rdf.io.input.nquads.NQuadsInputTest
Running org.apache.jena.hadoop.rdf.io.input.nquads.WholeFileNQuadsInputTest
Tests run: 12, Failures: 0, Errors: 0, Skipped: 3, Time elapsed: 0.921 sec - in org.apache.jena.hadoop.rdf.io.input.nquads.WholeFileNQuadsInputTest
Running org.apache.jena.hadoop.rdf.io.input.nquads.BlockedNQuadsInputTest
Tests run: 12, Failures: 0, Errors: 0, Skipped: 0, Time elapsed: 5.606 sec - in org.apache.jena.hadoop.rdf.io.input.nquads.BlockedNQuadsInputTest
Running org.apache.jena.hadoop.rdf.io.registry.TestHadoopRdfIORegistry
Tests run: 10, Failures: 0, Errors: 0, Skipped: 0, Time elapsed: 0.015 sec - in org.apache.jena.hadoop.rdf.io.registry.TestHadoopRdfIORegistry
Running org.apache.jena.hadoop.rdf.io.output.trig.StreamedTriGOutputTest
Tests run: 16, Failures: 0, Errors: 0, Skipped: 0, Time elapsed: 9.478 sec - in org.apache.jena.hadoop.rdf.io.output.trig.StreamedTriGOutputTest
Running org.apache.jena.hadoop.rdf.io.output.trig.BatchedTriGOutputTest
Tests run: 16, Failures: 0, Errors: 0, Skipped: 0, Time elapsed: 162.191 sec - in org.apache.jena.hadoop.rdf.io.output.trig.BatchedTriGOutputTest
Running org.apache.jena.hadoop.rdf.io.output.trix.TriXOutputTest
Tests run: 4, Failures: 0, Errors: 0, Skipped: 0, Time elapsed: 3.374 sec - in org.apache.jena.hadoop.rdf.io.output.trix.TriXOutputTest
Running org.apache.jena.hadoop.rdf.io.output.thrift.ThriftQuadOutputTest
Tests run: 4, Failures: 0, Errors: 0, Skipped: 0, Time elapsed: 0.798 sec - in org.apache.jena.hadoop.rdf.io.output.thrift.ThriftQuadOutputTest
Running org.apache.jena.hadoop.rdf.io.output.thrift.ThriftTripleOutputTest
Tests run: 4, Failures: 0, Errors: 0, Skipped: 0, Time elapsed: 0.716 sec - in org.apache.jena.hadoop.rdf.io.output.thrift.ThriftTripleOutputTest
Running org.apache.jena.hadoop.rdf.io.output.turtle.BatchedTurtleOutputTest
Tests run: 16, Failures: 0, Errors: 0, Skipped: 0, Time elapsed: 8.209 sec - in org.apache.jena.hadoop.rdf.io.output.turtle.BatchedTurtleOutputTest
Running org.apache.jena.hadoop.rdf.io.output.turtle.StreamedTurtleOutputTest
Tests run: 16, Failures: 0, Errors: 0, Skipped: 0, Time elapsed: 5.102 sec - in org.apache.jena.hadoop.rdf.io.output.turtle.StreamedTurtleOutputTest
Running org.apache.jena.hadoop.rdf.io.output.rdfjson.RdfJsonOutputTest
Tests run: 4, Failures: 0, Errors: 0, Skipped: 0, Time elapsed: 4.179 sec - in org.apache.jena.hadoop.rdf.io.output.rdfjson.RdfJsonOutputTest
Running org.apache.jena.hadoop.rdf.io.output.jsonld.JsonLdTripleOutputTest
Tests run: 4, Failures: 0, Errors: 0, Skipped: 0, Time elapsed: 5.3 sec - in org.apache.jena.hadoop.rdf.io.output.jsonld.JsonLdTripleOutputTest
Running org.apache.jena.hadoop.rdf.io.output.jsonld.JsonLdQuadOutputTest
Tests run: 4, Failures: 0, Errors: 0, Skipped: 0, Time elapsed: 4.55 sec - in org.apache.jena.hadoop.rdf.io.output.jsonld.JsonLdQuadOutputTest
Running org.apache.jena.hadoop.rdf.io.output.rdfxml.RdfXmlOutputTest
Tests run: 4, Failures: 0, Errors: 0, Skipped: 0, Time elapsed: 9.442 sec - in org.apache.jena.hadoop.rdf.io.output.rdfxml.RdfXmlOutputTest
Running org.apache.jena.hadoop.rdf.io.output.ntriples.NTriplesOutputTest
Tests run: 4, Failures: 0, Errors: 0, Skipped: 0, Time elapsed: 0.636 sec - in org.apache.jena.hadoop.rdf.io.output.ntriples.NTriplesOutputTest
Running org.apache.jena.hadoop.rdf.io.output.nquads.NQuadsOutputTest
Tests run: 4, Failures: 0, Errors: 0, Skipped: 0, Time elapsed: 0.739 sec - in org.apache.jena.hadoop.rdf.io.output.nquads.NQuadsOutputTest

Results :

Tests run: 898, Failures: 0, Errors: 0, Skipped: 162

[JENKINS] Recording test results
[INFO] 
[INFO] --- maven-jar-plugin:2.5:jar (default-jar) @ jena-elephas-io ---
[INFO] Building jar: <https://builds.apache.org/job/Jena_Development_Test_Java8/ws/jena-elephas/jena-elephas-io/target/jena-elephas-io-0.9.0-SNAPSHOT.jar>
[INFO] 
[INFO] --- maven-site-plugin:3.4:attach-descriptor (attach-descriptor) @ jena-elephas-io ---
[INFO] 
[INFO] --- maven-javadoc-plugin:2.9.1:jar (attach-javadocs) @ jena-elephas-io ---
[INFO] 
1 error
[JENKINS] Archiving disabled
[JENKINS] Archiving disabled
[JENKINS] Archiving disabled
[JENKINS] Archiving disabled
[JENKINS] Archiving disabled
[JENKINS] Archiving disabled
[JENKINS] Archiving disabled
[JENKINS] Archiving disabled
[JENKINS] Archiving disabled
[JENKINS] Archiving disabled
[JENKINS] Archiving disabled
[JENKINS] Archiving disabled
[JENKINS] Archiving disabled
[JENKINS] Archiving disabled
[JENKINS] Archiving disabled
[JENKINS] Archiving disabled
[JENKINS] Archiving disabled
[JENKINS] Archiving disabled
[JENKINS] Archiving disabled
[JENKINS] Archiving disabled
[JENKINS] Archiving disabled
[JENKINS] Archiving disabled
[JENKINS] Archiving disabled
[JENKINS] Archiving disabled
[JENKINS] Archiving disabled
[JENKINS] Archiving disabled
[JENKINS] Archiving disabled
[JENKINS] Archiving disabled
[JENKINS] Archiving disabled
[JENKINS] Archiving disabled
[JENKINS] Archiving disabled
[JENKINS] Archiving disabled
[JENKINS] Archiving disabled
[JENKINS] Archiving disabled
[JENKINS] Archiving disabled
[JENKINS] Archiving disabled
[JENKINS] Archiving disabled[INFO] ------------------------------------------------------------------------
[INFO] Reactor Summary:
[INFO] 
[INFO] Apache Jena - Parent .............................. SUCCESS [3.974s]
[INFO] Apache Jena - IRI ................................. SUCCESS [14.947s]
[INFO] Apache Jena - Core ................................ SUCCESS [1:19.934s]
[INFO] Apache Jena - ARQ (SPARQL 1.1 Query Engine) ....... SUCCESS [1:15.830s]
[INFO] Apache Jena - TDB (Native Triple Store) ........... SUCCESS [21.223s]
[INFO] Apache Jena - Libraries POM ....................... SUCCESS [0.718s]
[INFO] Apache Jena - SPARQL Text Search .................. SUCCESS [27.179s]
[INFO] Apache Jena - SPARQL Spatial Search ............... SUCCESS [12.793s]
[INFO] Apache Jena - Data Tables for RDF and SPARQL ...... SUCCESS [9.012s]
[INFO] Apache Jena - SDB (SQL based triple store) ........ SUCCESS [32.970s]
[INFO] Apache Jena - Fuseki1 (SPARQL 1.1 Server) ......... SUCCESS [20.165s]
[INFO] Apache Jena - Fuseki .............................. SUCCESS [0.938s]
[INFO] Apache Jena - Fuseki Server Engine ................ SUCCESS [18.463s]
[INFO] Apache Jena - Fuseki WAR File ..................... SUCCESS [5.175s]
[INFO] Apache Jena - Fuseki Server Standalone Jar ........ SUCCESS [4.804s]
[INFO] Apache Jena - Fuseki Binary Distribution .......... SUCCESS [6.409s]
[INFO] Apache Jena - Security ............................ SUCCESS [26.398s]
[INFO] Apache Jena - JDBC Parent ......................... SUCCESS [1.680s]
[INFO] Apache Jena - JDBC Core API ....................... SUCCESS [50.765s]
[INFO] Apache Jena - JDBC Remote Endpoint Driver ......... SUCCESS [48.112s]
[INFO] Apache Jena - JDBC In-Memory Driver ............... SUCCESS [24.220s]
[INFO] Apache Jena - JDBC TDB Driver ..................... SUCCESS [1:01.898s]
[INFO] Apache Jena - JDBC Driver Bundle .................. SUCCESS [18.035s]
[INFO] Apache Jena - Maven Plugins, including schemagen .. SUCCESS [41.164s]
[INFO] Apache Jena - Elephas ............................. SUCCESS [1.746s]
[INFO] Apache Jena - Elephas - Common API ................ SUCCESS [6.255s]
[INFO] Apache Jena - Elephas - I/O ....................... FAILURE [18:27.328s]
[INFO] Apache Jena - Elephas - Map/Reduce ................ SKIPPED
[INFO] Apache Jena - Elephas - Statistics Demo App ....... SKIPPED
[INFO] Apache Jena - Distribution ........................ SKIPPED
[INFO] Apache Jena - OSGi ................................ SKIPPED
[INFO] Apache Jena - OSGi bundle ......................... SKIPPED
[INFO] Apache Jena - OSGi integration tests .............. SKIPPED
[INFO] Apache Jena - Extras .............................. SKIPPED
[INFO] Apache Jena - Extras - Query Builder .............. SKIPPED
[INFO] Apache Jena ....................................... SKIPPED
[INFO] ------------------------------------------------------------------------
[INFO] BUILD FAILURE
[INFO] ------------------------------------------------------------------------
[INFO] Total time: 29:14.161s
[INFO] Finished at: Thu Mar 05 20:24:04 UTC 2015

[INFO] Final Memory: 114M/350M
[INFO] ------------------------------------------------------------------------
[ERROR] Failed to execute goal org.apache.maven.plugins:maven-javadoc-plugin:2.9.1:jar (attach-javadocs)
on project jena-elephas-io: MavenReportException: Error while creating archive:
[ERROR] Exit code: 1 - error: error reading /home/jenkins/jenkins-slave/maven-repositories/1/com/sun/jersey/jersey-client/1.9/jersey-client-1.9.jar;
error in opening zip file
[ERROR] 
[ERROR] Command line was: /home/jenkins/tools/java/jdk1.8.0/jre/../bin/javadoc @options @packages
[ERROR] 
[ERROR] Refer to the generated Javadoc files in '<https://builds.apache.org/job/Jena_Development_Test_Java8/ws/jena-elephas/jena-elephas-io/target/apidocs'>
dir.
[ERROR] -> [Help 1]
[ERROR] 
[ERROR] To see the full stack trace of the errors, re-run Maven with the -e switch.
[ERROR] Re-run Maven using the -X switch to enable full debug logging.
[ERROR] 
[ERROR] For more information about the errors and possible solutions, please read the following
articles:
[ERROR] [Help 1] http://cwiki.apache.org/confluence/display/MAVEN/MojoExecutionException
[ERROR] 
[ERROR] After correcting the problems, you can resume the build with the command
[ERROR]   mvn <goals> -rf :jena-elephas-io
channel stopped

Mime
View raw message