jena-commits mailing list archives

Site index · List index
Message view « Date » · « Thread »
Top « Date » · « Thread »
From Apache Jenkins Server <jenk...@builds.apache.org>
Subject Build failed in Jenkins: Jena_Development_Deploy #869
Date Tue, 24 Feb 2015 10:35:21 GMT
See <https://builds.apache.org/job/Jena_Development_Deploy/869/changes>

Changes:

[rvesse] Fix stale references to old Jena Elephas module names

[andy] Must use explicit version to use the release plugin

[andy] Untab

[andy] Improve permuting arrays in support of randomized testing

[andy] Fix stale references to old Jena Elephas module names

[andy] Must use explicit version to use the release plugin

[andy] Untab

[andy] Meta files for jena-osgi modules

[andy] Finalised NOTICE

------------------------------------------
[...truncated 3448 lines...]
Running org.apache.jena.hadoop.rdf.io.input.trix.TriXInputTest
Tests run: 12, Failures: 0, Errors: 0, Skipped: 3, Time elapsed: 72.299 sec - in org.apache.jena.hadoop.rdf.io.input.trix.TriXInputTest
Running org.apache.jena.hadoop.rdf.io.input.thrift.ThriftQuadInputTest
Tests run: 12, Failures: 0, Errors: 0, Skipped: 3, Time elapsed: 7.573 sec - in org.apache.jena.hadoop.rdf.io.input.thrift.ThriftQuadInputTest
Running org.apache.jena.hadoop.rdf.io.input.thrift.ThriftTripleInputTest
Tests run: 12, Failures: 0, Errors: 0, Skipped: 3, Time elapsed: 7.039 sec - in org.apache.jena.hadoop.rdf.io.input.thrift.ThriftTripleInputTest
Running org.apache.jena.hadoop.rdf.io.input.turtle.TurtleInputTest
Tests run: 12, Failures: 0, Errors: 0, Skipped: 3, Time elapsed: 1.164 sec - in org.apache.jena.hadoop.rdf.io.input.turtle.TurtleInputTest
Running org.apache.jena.hadoop.rdf.io.input.rdfjson.RdfJsonInputTest
Tests run: 12, Failures: 0, Errors: 0, Skipped: 3, Time elapsed: 2.095 sec - in org.apache.jena.hadoop.rdf.io.input.rdfjson.RdfJsonInputTest
Running org.apache.jena.hadoop.rdf.io.input.jsonld.JsonLDTripleInputTest
Tests run: 12, Failures: 0, Errors: 0, Skipped: 3, Time elapsed: 72.644 sec - in org.apache.jena.hadoop.rdf.io.input.jsonld.JsonLDTripleInputTest
Running org.apache.jena.hadoop.rdf.io.input.jsonld.JsonLDQuadInputTest
Tests run: 12, Failures: 0, Errors: 0, Skipped: 3, Time elapsed: 70.842 sec - in org.apache.jena.hadoop.rdf.io.input.jsonld.JsonLDQuadInputTest
Running org.apache.jena.hadoop.rdf.io.input.rdfxml.RdfXmlInputTest
Tests run: 12, Failures: 0, Errors: 0, Skipped: 3, Time elapsed: 10.882 sec - in org.apache.jena.hadoop.rdf.io.input.rdfxml.RdfXmlInputTest
Running org.apache.jena.hadoop.rdf.io.input.compressed.trig.DeflatedTriGInputTest
Tests run: 12, Failures: 0, Errors: 0, Skipped: 3, Time elapsed: 1.716 sec - in org.apache.jena.hadoop.rdf.io.input.compressed.trig.DeflatedTriGInputTest
Running org.apache.jena.hadoop.rdf.io.input.compressed.trig.GZippedTriGInputTest
Tests run: 12, Failures: 0, Errors: 0, Skipped: 3, Time elapsed: 1.535 sec - in org.apache.jena.hadoop.rdf.io.input.compressed.trig.GZippedTriGInputTest
Running org.apache.jena.hadoop.rdf.io.input.compressed.trig.BZippedTriGInputTest
Tests run: 12, Failures: 0, Errors: 0, Skipped: 3, Time elapsed: 5.846 sec - in org.apache.jena.hadoop.rdf.io.input.compressed.trig.BZippedTriGInputTest
Running org.apache.jena.hadoop.rdf.io.input.compressed.trix.BZippedTriXInputTest
Tests run: 12, Failures: 0, Errors: 0, Skipped: 3, Time elapsed: 5.803 sec - in org.apache.jena.hadoop.rdf.io.input.compressed.trix.BZippedTriXInputTest
Running org.apache.jena.hadoop.rdf.io.input.compressed.trix.GZippedTriXInputTest
Tests run: 12, Failures: 0, Errors: 0, Skipped: 3, Time elapsed: 1.574 sec - in org.apache.jena.hadoop.rdf.io.input.compressed.trix.GZippedTriXInputTest
Running org.apache.jena.hadoop.rdf.io.input.compressed.trix.DeflatedTriXInputTest
Tests run: 12, Failures: 0, Errors: 0, Skipped: 3, Time elapsed: 1.692 sec - in org.apache.jena.hadoop.rdf.io.input.compressed.trix.DeflatedTriXInputTest
Running org.apache.jena.hadoop.rdf.io.input.compressed.thrift.GZippedThriftTripleInputTest
Tests run: 12, Failures: 0, Errors: 0, Skipped: 3, Time elapsed: 7.586 sec - in org.apache.jena.hadoop.rdf.io.input.compressed.thrift.GZippedThriftTripleInputTest
Running org.apache.jena.hadoop.rdf.io.input.compressed.thrift.DeflatedThriftQuadInputTest
Tests run: 12, Failures: 0, Errors: 0, Skipped: 3, Time elapsed: 7.727 sec - in org.apache.jena.hadoop.rdf.io.input.compressed.thrift.DeflatedThriftQuadInputTest
Running org.apache.jena.hadoop.rdf.io.input.compressed.thrift.BZippedThriftTripleInputTest
Tests run: 12, Failures: 0, Errors: 0, Skipped: 3, Time elapsed: 17.29 sec - in org.apache.jena.hadoop.rdf.io.input.compressed.thrift.BZippedThriftTripleInputTest
Running org.apache.jena.hadoop.rdf.io.input.compressed.thrift.DeflatedThriftTripleInputTest
Tests run: 12, Failures: 0, Errors: 0, Skipped: 3, Time elapsed: 7.587 sec - in org.apache.jena.hadoop.rdf.io.input.compressed.thrift.DeflatedThriftTripleInputTest
Running org.apache.jena.hadoop.rdf.io.input.compressed.thrift.BZippedThriftQuadInputTest
Tests run: 12, Failures: 0, Errors: 0, Skipped: 3, Time elapsed: 19.375 sec - in org.apache.jena.hadoop.rdf.io.input.compressed.thrift.BZippedThriftQuadInputTest
Running org.apache.jena.hadoop.rdf.io.input.compressed.thrift.GZippedThriftQuadInputTest
Tests run: 12, Failures: 0, Errors: 0, Skipped: 3, Time elapsed: 7.728 sec - in org.apache.jena.hadoop.rdf.io.input.compressed.thrift.GZippedThriftQuadInputTest
Running org.apache.jena.hadoop.rdf.io.input.compressed.turtle.BZippedTurtleInputTest
Tests run: 12, Failures: 0, Errors: 0, Skipped: 3, Time elapsed: 5.743 sec - in org.apache.jena.hadoop.rdf.io.input.compressed.turtle.BZippedTurtleInputTest
Running org.apache.jena.hadoop.rdf.io.input.compressed.turtle.GZippedTurtleInputTest
Tests run: 12, Failures: 0, Errors: 0, Skipped: 3, Time elapsed: 1.599 sec - in org.apache.jena.hadoop.rdf.io.input.compressed.turtle.GZippedTurtleInputTest
Running org.apache.jena.hadoop.rdf.io.input.compressed.turtle.DeflatedTurtleInputTest
Tests run: 12, Failures: 0, Errors: 0, Skipped: 3, Time elapsed: 1.591 sec - in org.apache.jena.hadoop.rdf.io.input.compressed.turtle.DeflatedTurtleInputTest
Running org.apache.jena.hadoop.rdf.io.input.compressed.rdfjson.BZippedRdfJsonInputTest
Tests run: 12, Failures: 0, Errors: 0, Skipped: 3, Time elapsed: 16.93 sec - in org.apache.jena.hadoop.rdf.io.input.compressed.rdfjson.BZippedRdfJsonInputTest
Running org.apache.jena.hadoop.rdf.io.input.compressed.rdfjson.DeflatedRdfJsonInputTest
Tests run: 12, Failures: 0, Errors: 0, Skipped: 3, Time elapsed: 2.535 sec - in org.apache.jena.hadoop.rdf.io.input.compressed.rdfjson.DeflatedRdfJsonInputTest
Running org.apache.jena.hadoop.rdf.io.input.compressed.rdfjson.GZippedRdfJsonInputTest
Tests run: 12, Failures: 0, Errors: 0, Skipped: 3, Time elapsed: 2.52 sec - in org.apache.jena.hadoop.rdf.io.input.compressed.rdfjson.GZippedRdfJsonInputTest
Running org.apache.jena.hadoop.rdf.io.input.compressed.jsonld.GZippedJsonLDTripleInputTest
Tests run: 12, Failures: 0, Errors: 0, Skipped: 3, Time elapsed: 70.912 sec - in org.apache.jena.hadoop.rdf.io.input.compressed.jsonld.GZippedJsonLDTripleInputTest
Running org.apache.jena.hadoop.rdf.io.input.compressed.jsonld.DeflatedJsonLDQuadInputTest
Tests run: 12, Failures: 0, Errors: 0, Skipped: 3, Time elapsed: 71.247 sec - in org.apache.jena.hadoop.rdf.io.input.compressed.jsonld.DeflatedJsonLDQuadInputTest
Running org.apache.jena.hadoop.rdf.io.input.compressed.jsonld.GZippedJsonLDQuadInputTest
Tests run: 12, Failures: 0, Errors: 0, Skipped: 3, Time elapsed: 71.254 sec - in org.apache.jena.hadoop.rdf.io.input.compressed.jsonld.GZippedJsonLDQuadInputTest
Running org.apache.jena.hadoop.rdf.io.input.compressed.jsonld.BZippedJsonLDTripleInputTest
Tests run: 12, Failures: 0, Errors: 0, Skipped: 3, Time elapsed: 71.964 sec - in org.apache.jena.hadoop.rdf.io.input.compressed.jsonld.BZippedJsonLDTripleInputTest
Running org.apache.jena.hadoop.rdf.io.input.compressed.jsonld.BZippedJsonLDQuadInputTest
Tests run: 12, Failures: 0, Errors: 0, Skipped: 3, Time elapsed: 78.279 sec - in org.apache.jena.hadoop.rdf.io.input.compressed.jsonld.BZippedJsonLDQuadInputTest
Running org.apache.jena.hadoop.rdf.io.input.compressed.jsonld.DeflatedJsonLDTripleInputTest
Tests run: 12, Failures: 0, Errors: 0, Skipped: 3, Time elapsed: 70.945 sec - in org.apache.jena.hadoop.rdf.io.input.compressed.jsonld.DeflatedJsonLDTripleInputTest
Running org.apache.jena.hadoop.rdf.io.input.compressed.rdfxml.BZippedRdfXmlInputTest
Tests run: 12, Failures: 0, Errors: 0, Skipped: 3, Time elapsed: 19.887 sec - in org.apache.jena.hadoop.rdf.io.input.compressed.rdfxml.BZippedRdfXmlInputTest
Running org.apache.jena.hadoop.rdf.io.input.compressed.rdfxml.GZippedRdfXmlInputTest
Tests run: 12, Failures: 0, Errors: 0, Skipped: 3, Time elapsed: 10.454 sec - in org.apache.jena.hadoop.rdf.io.input.compressed.rdfxml.GZippedRdfXmlInputTest
Running org.apache.jena.hadoop.rdf.io.input.compressed.rdfxml.DeflatedRdfXmlInputTest
Tests run: 12, Failures: 0, Errors: 0, Skipped: 3, Time elapsed: 10.377 sec - in org.apache.jena.hadoop.rdf.io.input.compressed.rdfxml.DeflatedRdfXmlInputTest
Running org.apache.jena.hadoop.rdf.io.input.compressed.ntriples.BZippedWholeFileNTriplesInputTest
Tests run: 12, Failures: 0, Errors: 0, Skipped: 3, Time elapsed: 11.248 sec - in org.apache.jena.hadoop.rdf.io.input.compressed.ntriples.BZippedWholeFileNTriplesInputTest
Running org.apache.jena.hadoop.rdf.io.input.compressed.ntriples.DeflatedNTriplesInputTest
Tests run: 12, Failures: 0, Errors: 0, Skipped: 3, Time elapsed: 1.401 sec - in org.apache.jena.hadoop.rdf.io.input.compressed.ntriples.DeflatedNTriplesInputTest
Running org.apache.jena.hadoop.rdf.io.input.compressed.ntriples.GZippedWholeFileNTriplesInputTest
Tests run: 12, Failures: 0, Errors: 0, Skipped: 3, Time elapsed: 1.776 sec - in org.apache.jena.hadoop.rdf.io.input.compressed.ntriples.GZippedWholeFileNTriplesInputTest
Running org.apache.jena.hadoop.rdf.io.input.compressed.ntriples.BZippedNTriplesInputTest
Tests run: 12, Failures: 0, Errors: 0, Skipped: 3, Time elapsed: 3.619 sec - in org.apache.jena.hadoop.rdf.io.input.compressed.ntriples.BZippedNTriplesInputTest
Running org.apache.jena.hadoop.rdf.io.input.compressed.ntriples.DeflatedWholeFileNTriplesInputTest
Tests run: 12, Failures: 0, Errors: 0, Skipped: 3, Time elapsed: 1.848 sec - in org.apache.jena.hadoop.rdf.io.input.compressed.ntriples.DeflatedWholeFileNTriplesInputTest
Running org.apache.jena.hadoop.rdf.io.input.compressed.ntriples.GZippedNTriplesInputTest
Tests run: 12, Failures: 0, Errors: 0, Skipped: 3, Time elapsed: 1.164 sec - in org.apache.jena.hadoop.rdf.io.input.compressed.ntriples.GZippedNTriplesInputTest
Running org.apache.jena.hadoop.rdf.io.input.compressed.nquads.DeflatedWholeFileNQuadsInputTest
Tests run: 12, Failures: 0, Errors: 0, Skipped: 3, Time elapsed: 2.099 sec - in org.apache.jena.hadoop.rdf.io.input.compressed.nquads.DeflatedWholeFileNQuadsInputTest
Running org.apache.jena.hadoop.rdf.io.input.compressed.nquads.BZipppedNQuadsInputTest
Tests run: 12, Failures: 0, Errors: 0, Skipped: 3, Time elapsed: 4.92 sec - in org.apache.jena.hadoop.rdf.io.input.compressed.nquads.BZipppedNQuadsInputTest
Running org.apache.jena.hadoop.rdf.io.input.compressed.nquads.DeflatedNQuadsInputTest
Tests run: 12, Failures: 0, Errors: 0, Skipped: 3, Time elapsed: 1.296 sec - in org.apache.jena.hadoop.rdf.io.input.compressed.nquads.DeflatedNQuadsInputTest
Running org.apache.jena.hadoop.rdf.io.input.compressed.nquads.BZipppedWholeFileNQuadsInputTest
Tests run: 12, Failures: 0, Errors: 0, Skipped: 3, Time elapsed: 12.219 sec - in org.apache.jena.hadoop.rdf.io.input.compressed.nquads.BZipppedWholeFileNQuadsInputTest
Running org.apache.jena.hadoop.rdf.io.input.compressed.nquads.GZippedWholeFileNQuadsInputTest
Tests run: 12, Failures: 0, Errors: 0, Skipped: 3, Time elapsed: 1.829 sec - in org.apache.jena.hadoop.rdf.io.input.compressed.nquads.GZippedWholeFileNQuadsInputTest
Running org.apache.jena.hadoop.rdf.io.input.compressed.nquads.GZippedNQuadsInputTest
Tests run: 12, Failures: 0, Errors: 0, Skipped: 3, Time elapsed: 1.319 sec - in org.apache.jena.hadoop.rdf.io.input.compressed.nquads.GZippedNQuadsInputTest
Running org.apache.jena.hadoop.rdf.io.input.ntriples.NTriplesInputTest
Tests run: 12, Failures: 0, Errors: 0, Skipped: 0, Time elapsed: 1.037 sec - in org.apache.jena.hadoop.rdf.io.input.ntriples.NTriplesInputTest
Running org.apache.jena.hadoop.rdf.io.input.ntriples.WholeFileNTriplesInputTest
Tests run: 12, Failures: 0, Errors: 0, Skipped: 3, Time elapsed: 1.007 sec - in org.apache.jena.hadoop.rdf.io.input.ntriples.WholeFileNTriplesInputTest
Running org.apache.jena.hadoop.rdf.io.input.ntriples.BlockedNTriplesInputTest
Tests run: 12, Failures: 0, Errors: 0, Skipped: 0, Time elapsed: 4.145 sec - in org.apache.jena.hadoop.rdf.io.input.ntriples.BlockedNTriplesInputTest
Running org.apache.jena.hadoop.rdf.io.input.nquads.NQuadsInputTest
Tests run: 12, Failures: 0, Errors: 0, Skipped: 0, Time elapsed: 1.122 sec - in org.apache.jena.hadoop.rdf.io.input.nquads.NQuadsInputTest
Running org.apache.jena.hadoop.rdf.io.input.nquads.WholeFileNQuadsInputTest
Tests run: 12, Failures: 0, Errors: 0, Skipped: 3, Time elapsed: 1.062 sec - in org.apache.jena.hadoop.rdf.io.input.nquads.WholeFileNQuadsInputTest
Running org.apache.jena.hadoop.rdf.io.input.nquads.BlockedNQuadsInputTest
Tests run: 12, Failures: 0, Errors: 0, Skipped: 0, Time elapsed: 7.289 sec - in org.apache.jena.hadoop.rdf.io.input.nquads.BlockedNQuadsInputTest
Running org.apache.jena.hadoop.rdf.io.registry.TestHadoopRdfIORegistry
Tests run: 10, Failures: 0, Errors: 0, Skipped: 0, Time elapsed: 0.016 sec - in org.apache.jena.hadoop.rdf.io.registry.TestHadoopRdfIORegistry
Running org.apache.jena.hadoop.rdf.io.output.trig.StreamedTriGOutputTest
Tests run: 16, Failures: 0, Errors: 0, Skipped: 0, Time elapsed: 10.581 sec - in org.apache.jena.hadoop.rdf.io.output.trig.StreamedTriGOutputTest
Running org.apache.jena.hadoop.rdf.io.output.trig.BatchedTriGOutputTest
Tests run: 16, Failures: 0, Errors: 0, Skipped: 0, Time elapsed: 186.893 sec - in org.apache.jena.hadoop.rdf.io.output.trig.BatchedTriGOutputTest
Running org.apache.jena.hadoop.rdf.io.output.trix.TriXOutputTest
Tests run: 4, Failures: 0, Errors: 0, Skipped: 0, Time elapsed: 3.694 sec - in org.apache.jena.hadoop.rdf.io.output.trix.TriXOutputTest
Running org.apache.jena.hadoop.rdf.io.output.thrift.ThriftQuadOutputTest
Tests run: 4, Failures: 0, Errors: 0, Skipped: 0, Time elapsed: 0.953 sec - in org.apache.jena.hadoop.rdf.io.output.thrift.ThriftQuadOutputTest
Running org.apache.jena.hadoop.rdf.io.output.thrift.ThriftTripleOutputTest
Tests run: 4, Failures: 0, Errors: 0, Skipped: 0, Time elapsed: 0.81 sec - in org.apache.jena.hadoop.rdf.io.output.thrift.ThriftTripleOutputTest
Running org.apache.jena.hadoop.rdf.io.output.turtle.BatchedTurtleOutputTest
Tests run: 16, Failures: 0, Errors: 0, Skipped: 0, Time elapsed: 10.76 sec - in org.apache.jena.hadoop.rdf.io.output.turtle.BatchedTurtleOutputTest
Running org.apache.jena.hadoop.rdf.io.output.turtle.StreamedTurtleOutputTest
Tests run: 16, Failures: 0, Errors: 0, Skipped: 0, Time elapsed: 5.99 sec - in org.apache.jena.hadoop.rdf.io.output.turtle.StreamedTurtleOutputTest
Running org.apache.jena.hadoop.rdf.io.output.rdfjson.RdfJsonOutputTest
Tests run: 4, Failures: 0, Errors: 0, Skipped: 0, Time elapsed: 5.607 sec - in org.apache.jena.hadoop.rdf.io.output.rdfjson.RdfJsonOutputTest
Running org.apache.jena.hadoop.rdf.io.output.jsonld.JsonLdTripleOutputTest
Tests run: 4, Failures: 0, Errors: 0, Skipped: 0, Time elapsed: 6.586 sec - in org.apache.jena.hadoop.rdf.io.output.jsonld.JsonLdTripleOutputTest
Running org.apache.jena.hadoop.rdf.io.output.jsonld.JsonLdQuadOutputTest
Tests run: 4, Failures: 0, Errors: 0, Skipped: 0, Time elapsed: 9.93 sec - in org.apache.jena.hadoop.rdf.io.output.jsonld.JsonLdQuadOutputTest
Running org.apache.jena.hadoop.rdf.io.output.rdfxml.RdfXmlOutputTest
Tests run: 4, Failures: 0, Errors: 0, Skipped: 0, Time elapsed: 9.923 sec - in org.apache.jena.hadoop.rdf.io.output.rdfxml.RdfXmlOutputTest
Running org.apache.jena.hadoop.rdf.io.output.ntriples.NTriplesOutputTest
Tests run: 4, Failures: 0, Errors: 0, Skipped: 0, Time elapsed: 0.815 sec - in org.apache.jena.hadoop.rdf.io.output.ntriples.NTriplesOutputTest
Running org.apache.jena.hadoop.rdf.io.output.nquads.NQuadsOutputTest
Tests run: 4, Failures: 0, Errors: 0, Skipped: 0, Time elapsed: 0.938 sec - in org.apache.jena.hadoop.rdf.io.output.nquads.NQuadsOutputTest

Results :

Tests run: 898, Failures: 0, Errors: 0, Skipped: 162

[JENKINS] Recording test results
[INFO] 
[INFO] --- maven-jar-plugin:2.4:jar (default-jar) @ jena-elephas-io ---
[INFO] Building jar: <https://builds.apache.org/job/Jena_Development_Deploy/ws/jena-elephas/jena-elephas-io/target/jena-elephas-io-0.9.0-SNAPSHOT.jar>
[INFO] 
[INFO] --- maven-site-plugin:3.3:attach-descriptor (attach-descriptor) @ jena-elephas-io ---
[INFO] 
[INFO] --- maven-javadoc-plugin:2.9.1:jar (attach-javadocs) @ jena-elephas-io ---
[INFO] 
1 error
[JENKINS] Archiving disabled
[JENKINS] Archiving disabled
[JENKINS] Archiving disabled
[JENKINS] Archiving disabled
[JENKINS] Archiving disabled
[JENKINS] Archiving disabled
[JENKINS] Archiving disabled
[JENKINS] Archiving disabled
[JENKINS] Archiving disabled
[JENKINS] Archiving disabled
[JENKINS] Archiving disabled
[JENKINS] Archiving disabled
[JENKINS] Archiving disabled
[JENKINS] Archiving disabled
[JENKINS] Archiving disabled
[JENKINS] Archiving disabled
[JENKINS] Archiving disabled
[JENKINS] Archiving disabled
[JENKINS] Archiving disabled
[JENKINS] Archiving disabled
[JENKINS] Archiving disabled
[JENKINS] Archiving disabled
[JENKINS] Archiving disabled
[JENKINS] Archiving disabled
[JENKINS] Archiving disabled
[JENKINS] Archiving disabled
[JENKINS] Archiving disabled
[JENKINS] Archiving disabled
[JENKINS] Archiving disabled
[JENKINS] Archiving disabled
[JENKINS] Archiving disabled
[JENKINS] Archiving disabled
[JENKINS] Archiving disabled
[JENKINS] Archiving disabled
[JENKINS] Archiving disabled
[JENKINS] Archiving disabled[INFO] ------------------------------------------------------------------------
[INFO] Reactor Summary:
[INFO] 
[INFO] Apache Jena - Parent .............................. SUCCESS [7.771s]
[INFO] Apache Jena - IRI ................................. SUCCESS [14.522s]
[INFO] Apache Jena - Core ................................ SUCCESS [1:25.160s]
[INFO] Apache Jena - ARQ (SPARQL 1.1 Query Engine) ....... SUCCESS [1:24.565s]
[INFO] Apache Jena - TDB (Native Triple Store) ........... SUCCESS [23.995s]
[INFO] Apache Jena - Libraries POM ....................... SUCCESS [3.027s]
[INFO] Apache Jena - SPARQL Text Search .................. SUCCESS [24.541s]
[INFO] Apache Jena - SPARQL Spatial Search ............... SUCCESS [19.522s]
[INFO] Apache Jena - Data Tables for RDF and SPARQL ...... SUCCESS [12.461s]
[INFO] Apache Jena - SDB (SQL based triple store) ........ SUCCESS [36.202s]
[INFO] Apache Jena - Fuseki1 (SPARQL 1.1 Server) ......... SUCCESS [42.235s]
[INFO] Apache Jena - Fuseki .............................. SUCCESS [3.083s]
[INFO] Apache Jena - Fuseki Server Engine ................ SUCCESS [14.809s]
[INFO] Apache Jena - Fuseki WAR File ..................... SUCCESS [13.289s]
[INFO] Apache Jena - Fuseki Server Standalone Jar ........ SUCCESS [14.353s]
[INFO] Apache Jena - Fuseki Binary Distribution .......... SUCCESS [28.507s]
[INFO] Apache Jena - Security ............................ SUCCESS [29.433s]
[INFO] Apache Jena - JDBC Parent ......................... SUCCESS [4.442s]
[INFO] Apache Jena - JDBC Core API ....................... SUCCESS [50.337s]
[INFO] Apache Jena - JDBC Remote Endpoint Driver ......... SUCCESS [41.980s]
[INFO] Apache Jena - JDBC In-Memory Driver ............... SUCCESS [24.111s]
[INFO] Apache Jena - JDBC TDB Driver ..................... SUCCESS [51.987s]
[INFO] Apache Jena - JDBC Driver Bundle .................. SUCCESS [23.886s]
[INFO] Apache Jena - Maven Plugins, including schemagen .. SUCCESS [38.827s]
[INFO] Apache Jena - Elephas ............................. SUCCESS [3.335s]
[INFO] Apache Jena - Elephas - Common API ................ SUCCESS [13.330s]
[INFO] Apache Jena - Elephas - I/O ....................... FAILURE [19:23.055s]
[INFO] Apache Jena - Elephas - Map/Reduce ................ SKIPPED
[INFO] Apache Jena - Elephas - Statistics Demo App ....... SKIPPED
[INFO] Apache Jena - Distribution ........................ SKIPPED
[INFO] Apache Jena - OSGi ................................ SKIPPED
[INFO] Apache Jena - OSGi bundle ......................... SKIPPED
[INFO] Apache Jena - OSGi integration tests .............. SKIPPED
[INFO] Apache Jena - Extras .............................. SKIPPED
[INFO] Apache Jena - Extras - Query Builder .............. SKIPPED
[INFO] Apache Jena ....................................... SKIPPED
[INFO] ------------------------------------------------------------------------
[INFO] BUILD FAILURE
[INFO] ------------------------------------------------------------------------
[INFO] Total time: 31:44.822s
[INFO] Finished at: Tue Feb 24 10:35:17 UTC 2015

[INFO] Final Memory: 74M/495M
[INFO] ------------------------------------------------------------------------
Waiting for Jenkins to finish collecting data[ERROR] Failed to execute goal org.apache.maven.plugins:maven-javadoc-plugin:2.9.1:jar
(attach-javadocs) on project jena-elephas-io: MavenReportException: Error while creating archive:
[ERROR] Exit code: 1 - error: error reading /home/jenkins/jenkins-slave/maven-repositories/1/com/sun/jersey/jersey-client/1.9/jersey-client-1.9.jar;
error in opening zip file
[ERROR] 
[ERROR] Command line was: /home/jenkins/tools/java/jdk1.7.0_25-32/jre/../bin/javadoc @options
@packages
[ERROR] 
[ERROR] Refer to the generated Javadoc files in '<https://builds.apache.org/job/Jena_Development_Deploy/ws/jena-elephas/jena-elephas-io/target/apidocs'>
dir.
[ERROR] -> [Help 1]
[ERROR] 
[ERROR] To see the full stack trace of the errors, re-run Maven with the -e switch.
[ERROR] Re-run Maven using the -X switch to enable full debug logging.
[ERROR] 
[ERROR] For more information about the errors and possible solutions, please read the following
articles:
[ERROR] [Help 1] http://cwiki.apache.org/confluence/display/MAVEN/MojoExecutionException
[ERROR] 
[ERROR] After correcting the problems, you can resume the build with the command
[ERROR]   mvn <goals> -rf :jena-elephas-io

channel stopped

Mime
View raw message