jena-commits mailing list archives

Site index · List index
Message view « Date » · « Thread »
Top « Date » · « Thread »
From Apache Jenkins Server <jenk...@builds.apache.org>
Subject Build failed in Jenkins: Jena_Development_Test_Windows #509
Date Sat, 17 Jan 2015 08:52:54 GMT
See <https://builds.apache.org/job/Jena_Development_Test_Windows/509/changes>

Changes:

[andy] JENA-846 : Add IRIFactoryI.create(URI) and IRIFactoryI.construct(URI)

------------------------------------------
[...truncated 502 lines...]
[INFO] --- maven-compiler-plugin:3.1:compile (default-compile) @ jena-spatial ---
[INFO] Changes detected - recompiling the module!
[INFO] Compiling 38 source files to F:\hudson\hudson-slave\workspace\Jena_Development_Test_Windows\jena-spatial\target\classes
[INFO] 
[INFO] --- maven-resources-plugin:2.6:testResources (default-testResources) @ jena-spatial
---
[INFO] Using 'UTF-8' encoding to copy filtered resources.
[INFO] Copying 9 resources
[INFO] Copying 3 resources
[INFO] 
[INFO] --- maven-compiler-plugin:3.1:testCompile (default-testCompile) @ jena-spatial ---
[INFO] Changes detected - recompiling the module!
[INFO] Compiling 37 source files to F:\hudson\hudson-slave\workspace\Jena_Development_Test_Windows\jena-spatial\target\test-classes
[INFO] 
[INFO] --- maven-surefire-plugin:2.16:test (default-test) @ jena-spatial ---
[INFO] Surefire report directory: F:\hudson\hudson-slave\workspace\Jena_Development_Test_Windows\jena-spatial\target\surefire-reports

-------------------------------------------------------
 T E S T S
-------------------------------------------------------
Running org.apache.jena.query.spatial.TS_Spatial
Tests run: 53, Failures: 0, Errors: 0, Skipped: 0, Time elapsed: 7.288 sec - in org.apache.jena.query.spatial.TS_Spatial

Results :

Tests run: 53, Failures: 0, Errors: 0, Skipped: 0

[JENKINS] Recording test results
[JENKINS] Archiving disabled
[INFO]                                                                         
[INFO] ------------------------------------------------------------------------
[INFO] Building Apache Jena - Data Tables for RDF and SPARQL 1.0.1-SNAPSHOT
[INFO] ------------------------------------------------------------------------
[INFO] 
[INFO] --- maven-clean-plugin:2.5:clean (default-clean) @ jena-csv ---
[INFO] Deleting F:\hudson\hudson-slave\workspace\Jena_Development_Test_Windows\jena-csv\target
[INFO] 
[INFO] --- maven-enforcer-plugin:1.3.1:enforce (enforce) @ jena-csv ---
[INFO] 
[INFO] --- maven-enforcer-plugin:1.3.1:enforce (enforce-java) @ jena-csv ---
[INFO] 
[INFO] --- maven-remote-resources-plugin:1.5:process (default) @ jena-csv ---
[INFO] 
[INFO] --- maven-resources-plugin:2.6:resources (default-resources) @ jena-csv ---
[INFO] Using 'UTF-8' encoding to copy filtered resources.
[INFO] Copying 0 resource
[INFO] Copying 3 resources
[INFO] 
[INFO] --- maven-compiler-plugin:3.1:compile (default-compile) @ jena-csv ---
[INFO] Changes detected - recompiling the module!
[INFO] Compiling 19 source files to F:\hudson\hudson-slave\workspace\Jena_Development_Test_Windows\jena-csv\target\classes
[INFO] 
[INFO] --- maven-resources-plugin:2.6:testResources (default-testResources) @ jena-csv ---
[INFO] Using 'UTF-8' encoding to copy filtered resources.
[INFO] Copying 5 resources
[INFO] Copying 3 resources
[INFO] 
[INFO] --- maven-compiler-plugin:3.1:testCompile (default-testCompile) @ jena-csv ---
[INFO] Changes detected - recompiling the module!
[INFO] Compiling 12 source files to F:\hudson\hudson-slave\workspace\Jena_Development_Test_Windows\jena-csv\target\test-classes
[INFO] 
[INFO] --- maven-surefire-plugin:2.16:test (default-test) @ jena-csv ---
[INFO] Surefire report directory: F:\hudson\hudson-slave\workspace\Jena_Development_Test_Windows\jena-csv\target\surefire-reports

-------------------------------------------------------
 T E S T S
-------------------------------------------------------
Running org.apache.jena.propertytable.TS_PropertyTable
Tests run: 60, Failures: 0, Errors: 0, Skipped: 0, Time elapsed: 1.874 sec - in org.apache.jena.propertytable.TS_PropertyTable

Results :

Tests run: 60, Failures: 0, Errors: 0, Skipped: 0

[JENKINS] Recording test results
[JENKINS] Archiving disabled
[INFO]                                                                         
[INFO] ------------------------------------------------------------------------
[INFO] Building Apache Jena - SDB (SQL based triple store) 1.5.2-SNAPSHOT
[INFO] ------------------------------------------------------------------------
[INFO] 
[INFO] --- maven-clean-plugin:2.5:clean (default-clean) @ jena-sdb ---
[INFO] Deleting F:\hudson\hudson-slave\workspace\Jena_Development_Test_Windows\jena-sdb\target
[INFO] 
[INFO] --- maven-enforcer-plugin:1.3.1:enforce (enforce) @ jena-sdb ---
[INFO] 
[INFO] --- maven-enforcer-plugin:1.3.1:enforce (enforce-java) @ jena-sdb ---
[INFO] 
[INFO] --- maven-remote-resources-plugin:1.5:process (default) @ jena-sdb ---
[INFO] 
[INFO] --- maven-resources-plugin:2.6:resources (default-resources) @ jena-sdb ---
[INFO] Using 'UTF-8' encoding to copy filtered resources.
[INFO] Copying 1 resource to com/hp/hpl/jena/sdb/
[INFO] Copying 3 resources
[INFO] 
[INFO] --- maven-compiler-plugin:3.1:compile (default-compile) @ jena-sdb ---
[INFO] Changes detected - recompiling the module!
[INFO] Compiling 348 source files to F:\hudson\hudson-slave\workspace\Jena_Development_Test_Windows\jena-sdb\target\classes
[INFO] 
[INFO] --- maven-resources-plugin:2.6:testResources (default-testResources) @ jena-sdb ---
[INFO] Using 'UTF-8' encoding to copy filtered resources.
[INFO] skip non existing resourceDirectory F:\hudson\hudson-slave\workspace\Jena_Development_Test_Windows\jena-sdb\src\test\resources
[INFO] Copying 3 resources
[INFO] 
[INFO] --- maven-compiler-plugin:3.1:testCompile (default-testCompile) @ jena-sdb ---
[INFO] Changes detected - recompiling the module!
[INFO] Compiling 68 source files to F:\hudson\hudson-slave\workspace\Jena_Development_Test_Windows\jena-sdb\target\test-classes
[INFO] 
[INFO] --- maven-surefire-plugin:2.16:test (default-test) @ jena-sdb ---
[INFO] Surefire report directory: F:\hudson\hudson-slave\workspace\Jena_Development_Test_Windows\jena-sdb\target\surefire-reports

-------------------------------------------------------
 T E S T S
-------------------------------------------------------
Running com.hp.hpl.jena.sdb.test.SDBTestAll
Tests run: 524, Failures: 0, Errors: 0, Skipped: 0, Time elapsed: 34.729 sec - in com.hp.hpl.jena.sdb.test.SDBTestAll

Results :

Tests run: 524, Failures: 0, Errors: 0, Skipped: 0

[JENKINS] Recording test results
[JENKINS] Archiving disabled
[INFO]                                                                         
[INFO] ------------------------------------------------------------------------
[INFO] Building Apache Jena - Fuseki1 (SPARQL 1.1 Server) 1.1.2-SNAPSHOT
[INFO] ------------------------------------------------------------------------
[INFO] 
[INFO] --- maven-clean-plugin:2.5:clean (default-clean) @ jena-fuseki ---
[INFO] Deleting F:\hudson\hudson-slave\workspace\Jena_Development_Test_Windows\jena-fuseki\target
[INFO] 
[INFO] --- maven-enforcer-plugin:1.3.1:enforce (enforce) @ jena-fuseki ---
[INFO] 
[INFO] --- maven-enforcer-plugin:1.3.1:enforce (enforce-java) @ jena-fuseki ---
[INFO] 
[INFO] --- maven-remote-resources-plugin:1.5:process (default) @ jena-fuseki ---
[INFO] 
[INFO] --- maven-resources-plugin:2.6:resources (default-resources) @ jena-fuseki ---
[INFO] Using 'UTF-8' encoding to copy filtered resources.
[INFO] Copying 0 resource
[INFO] Copying 1 resource
[INFO] Copying 3 resources
[INFO] 
[INFO] --- maven-compiler-plugin:3.1:compile (default-compile) @ jena-fuseki ---
[INFO] Changes detected - recompiling the module!
[INFO] Compiling 70 source files to F:\hudson\hudson-slave\workspace\Jena_Development_Test_Windows\jena-fuseki\target\classes
[INFO] 
[INFO] --- maven-resources-plugin:2.6:testResources (default-testResources) @ jena-fuseki
---
[INFO] Using 'UTF-8' encoding to copy filtered resources.
[INFO] Copying 1 resource
[INFO] Copying 3 resources
[INFO] 
[INFO] --- maven-compiler-plugin:3.1:testCompile (default-testCompile) @ jena-fuseki ---
[INFO] Changes detected - recompiling the module!
[INFO] Compiling 8 source files to F:\hudson\hudson-slave\workspace\Jena_Development_Test_Windows\jena-fuseki\target\test-classes
[INFO] 
[INFO] --- maven-surefire-plugin:2.16:test (default-test) @ jena-fuseki ---
[INFO] Surefire report directory: F:\hudson\hudson-slave\workspace\Jena_Development_Test_Windows\jena-fuseki\target\surefire-reports

-------------------------------------------------------
 T E S T S
-------------------------------------------------------
Running org.apache.jena.fuseki.TS_Fuseki
08:52:43 ERROR Server                    :: SPARQLServer: Failed to start server: Address
already in use: bind

Results :

Tests run: 0, Failures: 0, Errors: 0, Skipped: 0

[JENKINS] Recording test results
[JENKINS] Archiving disabled
[JENKINS] Archiving disabled
[JENKINS] Archiving disabled
[JENKINS] Archiving disabled
[JENKINS] Archiving disabled
[JENKINS] Archiving disabled
[JENKINS] Archiving disabled
[JENKINS] Archiving disabled
[JENKINS] Archiving disabled
[JENKINS] Archiving disabled
[JENKINS] Archiving disabled
[JENKINS] Archiving disabled
[JENKINS] Archiving disabled
[JENKINS] Archiving disabled
[JENKINS] Archiving disabled
[JENKINS] Archiving disabled
[JENKINS] Archiving disabled
[JENKINS] Archiving disabled
[JENKINS] Archiving disabled
[JENKINS] Archiving disabled
[JENKINS] Archiving disabled
[JENKINS] Archiving disabled
[JENKINS] Archiving disabled
[JENKINS] Archiving disabled
[JENKINS] Archiving disabled
[JENKINS] Archiving disabled
[JENKINS] Archiving disabled
[JENKINS] Archiving disabled
[INFO] ------------------------------------------------------------------------
[INFO] Reactor Summary:
[INFO] 
[INFO] Apache Jena - Parent .............................. SUCCESS [4.351s]
[INFO] Apache Jena - IRI ................................. SUCCESS [5.364s]
[INFO] Apache Jena - Core ................................ SUCCESS [1:39.523s]
[INFO] Apache Jena - ARQ (SPARQL 1.1 Query Engine) ....... SUCCESS [1:50.978s]
[INFO] Apache Jena - TDB (Native Triple Store) ........... SUCCESS [1:24.364s]
[INFO] Apache Jena - Libraries POM ....................... SUCCESS [0.675s]
[INFO] Apache Jena - SPARQL Text Search .................. SUCCESS [21.440s]
[INFO] Apache Jena - SPARQL Spatial Search ............... SUCCESS [10.277s]
[INFO] Apache Jena - Data Tables for RDF and SPARQL ...... SUCCESS [4.006s]
[INFO] Apache Jena - SDB (SQL based triple store) ........ SUCCESS [41.810s]
[INFO] Apache Jena - Fuseki1 (SPARQL 1.1 Server) ......... FAILURE [6.440s]
[INFO] Apache Jena - Fuseki, SPARQL 1.1 Server ........... SKIPPED
[INFO] Apache Jena - Fuseki Server Engine ................ SKIPPED
[INFO] Apache Jena - Fuseki WAR File ..................... SKIPPED
[INFO] Apache Jena - Fuseki Server Standalone Jar ........ SKIPPED
[INFO] Apache Jena - Fuseki Binary Distribution .......... SKIPPED
[INFO] Apache Jena - Security ............................ SKIPPED
[INFO] Apache Jena - JDBC Parent ......................... SKIPPED
[INFO] Apache Jena - JDBC Core API ....................... SKIPPED
[INFO] Apache Jena - JDBC Remote Endpoint Driver ......... SKIPPED
[INFO] Apache Jena - JDBC In-Memory Driver ............... SKIPPED
[INFO] Apache Jena - JDBC TDB Driver ..................... SKIPPED
[INFO] Apache Jena - JDBC Driver Bundle .................. SKIPPED
[INFO] Apache Jena - Maven Plugins, including schemagen .. SKIPPED
[INFO] Apache Jena - Distribution ........................ SKIPPED
[INFO] Apache Jena - Extras .............................. SKIPPED
[INFO] Apache Jena - Extras - Query Builder .............. SKIPPED
[INFO] Apache Jena ....................................... SKIPPED
[INFO] ------------------------------------------------------------------------
[INFO] BUILD FAILURE
[INFO] ------------------------------------------------------------------------
[INFO] Total time: 6:34.599s
[INFO] Finished at: Sat Jan 17 08:52:44 GMT 2015
[INFO] Final Memory: 77M/761M
[INFO] ------------------------------------------------------------------------
[ERROR] Failed to execute goal org.apache.maven.plugins:maven-surefire-plugin:2.16:test (default-test)
on project jena-fuseki: Execution default-test of goal org.apache.maven.plugins:maven-surefire-plugin:2.16:test
failed: The forked VM terminated without saying properly goodbye. VM crash or System.exit
called ?
[ERROR] Command wascmd.exe /X /C "f:\hudson\tools\java\latest-1.7-64\jre\bin\java -jar F:\hudson\hudson-slave\workspace\Jena_Development_Test_Windows\jena-fuseki\target\surefire\surefirebooter7239238347269953943.jar
F:\hudson\hudson-slave\workspace\Jena_Development_Test_Windows\jena-fuseki\target\surefire\surefire391641704800491233tmp
F:\hudson\hudson-slave\workspace\Jena_Development_Test_Windows\jena-fuseki\target\surefire\surefire_7996806317613293011tmp"
[ERROR] -> [Help 1]
[ERROR] 
[ERROR] To see the full stack trace of the errors, re-run Maven with the -e switch.
[ERROR] Re-run Maven using the -X switch to enable full debug logging.
[ERROR] 
[ERROR] For more information about the errors and possible solutions, please read the following
articles:
[ERROR] [Help 1] http://cwiki.apache.org/confluence/display/MAVEN/PluginExecutionException
[ERROR] 
[ERROR] After correcting the problems, you can resume the build with the command
[ERROR]   mvn <goals> -rf :jena-fuseki
Sending e-mails to: commits@jena.apache.org
channel stopped

Mime
View raw message