jena-commits mailing list archives

Site index · List index
Message view « Date » · « Thread »
Top « Date » · « Thread »
From Apache Jenkins Server <jenk...@builds.apache.org>
Subject Build failed in Jenkins: Jena_New_Tests #204
Date Mon, 19 Jan 2015 21:07:53 GMT
See <https://builds.apache.org/job/Jena_New_Tests/204/changes>

Changes:

[claude] Fixes for JENA-854

------------------------------------------
[...truncated 667 lines...]
[INFO] Copying 1 resource
[INFO] Copying 3 resources
[INFO] 
[INFO] --- maven-compiler-plugin:3.1:compile (default-compile) @ jena-fuseki-core ---
[INFO] Changes detected - recompiling the module!
[INFO] Compiling 108 source files to <https://builds.apache.org/job/Jena_New_Tests/ws/jena-fuseki2/jena-fuseki-core/target/classes>
[INFO] 
[INFO] --- maven-resources-plugin:2.6:testResources (default-testResources) @ jena-fuseki-core
---
[INFO] Using 'UTF-8' encoding to copy filtered resources.
[INFO] skip non existing resourceDirectory <https://builds.apache.org/job/Jena_New_Tests/ws/jena-fuseki2/jena-fuseki-core/src/test/resources>
[INFO] Copying 3 resources
[INFO] 
[INFO] --- maven-compiler-plugin:3.1:testCompile (default-testCompile) @ jena-fuseki-core
---
[INFO] Changes detected - recompiling the module!
[INFO] Compiling 13 source files to <https://builds.apache.org/job/Jena_New_Tests/ws/jena-fuseki2/jena-fuseki-core/target/test-classes>
[INFO] 
[INFO] --- maven-surefire-plugin:2.16:test (default-test) @ jena-fuseki-core ---
[INFO] Surefire report directory: <https://builds.apache.org/job/Jena_New_Tests/ws/jena-fuseki2/jena-fuseki-core/target/surefire-reports>

-------------------------------------------------------
 T E S T S
-------------------------------------------------------
Running org.apache.jena.fuseki.TS_Fuseki
Tests run: 126, Failures: 0, Errors: 0, Skipped: 0, Time elapsed: 6.402 sec - in org.apache.jena.fuseki.TS_Fuseki

Results :

Tests run: 126, Failures: 0, Errors: 0, Skipped: 0

[JENKINS] Recording test results
[JENKINS] Archiving disabled
[INFO]                                                                         
[INFO] ------------------------------------------------------------------------
[INFO] Building Apache Jena - Fuseki WAR File 2.0.0-SNAPSHOT
[INFO] ------------------------------------------------------------------------
[INFO] 
[INFO] --- maven-clean-plugin:2.5:clean (default-clean) @ jena-fuseki-war ---
[INFO] Deleting <https://builds.apache.org/job/Jena_New_Tests/ws/jena-fuseki2/jena-fuseki-war/target>
[INFO] 
[INFO] --- maven-enforcer-plugin:1.3.1:enforce (enforce) @ jena-fuseki-war ---
[INFO] 
[INFO] --- maven-enforcer-plugin:1.3.1:enforce (enforce-java) @ jena-fuseki-war ---
[INFO] 
[INFO] --- maven-remote-resources-plugin:1.5:process (default) @ jena-fuseki-war ---
[INFO] 
[INFO] --- maven-resources-plugin:2.6:resources (default-resources) @ jena-fuseki-war ---
[INFO] Using 'UTF-8' encoding to copy filtered resources.
[INFO] skip non existing resourceDirectory <https://builds.apache.org/job/Jena_New_Tests/ws/jena-fuseki2/jena-fuseki-war/src/main/resources>
[INFO] Copying 3 resources
[INFO] 
[INFO] --- maven-compiler-plugin:3.1:compile (default-compile) @ jena-fuseki-war ---
[INFO] No sources to compile
[INFO] 
[INFO] --- maven-resources-plugin:2.6:testResources (default-testResources) @ jena-fuseki-war
---
[INFO] Using 'UTF-8' encoding to copy filtered resources.
[INFO] skip non existing resourceDirectory <https://builds.apache.org/job/Jena_New_Tests/ws/jena-fuseki2/jena-fuseki-war/src/test/resources>
[INFO] Copying 3 resources
[INFO] 
[INFO] --- maven-compiler-plugin:3.1:testCompile (default-testCompile) @ jena-fuseki-war ---
[INFO] No sources to compile
[INFO] 
[INFO] --- maven-surefire-plugin:2.16:test (default-test) @ jena-fuseki-war ---
[JENKINS] Recording test results
[JENKINS] Archiving disabled
[INFO]                                                                         
[INFO] ------------------------------------------------------------------------
[INFO] Building Apache Jena - Fuseki Server Standalone Jar 2.0.0-SNAPSHOT
[INFO] ------------------------------------------------------------------------
[INFO] 
[INFO] --- maven-clean-plugin:2.5:clean (default-clean) @ jena-fuseki-server ---
[INFO] Deleting <https://builds.apache.org/job/Jena_New_Tests/ws/jena-fuseki2/jena-fuseki-server/target>
[INFO] 
[INFO] --- maven-enforcer-plugin:1.3.1:enforce (enforce) @ jena-fuseki-server ---
[INFO] 
[INFO] --- maven-enforcer-plugin:1.3.1:enforce (enforce-java) @ jena-fuseki-server ---
[INFO] 
[INFO] --- maven-remote-resources-plugin:1.5:process (default) @ jena-fuseki-server ---
[INFO] 
[INFO] --- maven-resources-plugin:2.6:resources (default-resources) @ jena-fuseki-server ---
[INFO] Using 'UTF-8' encoding to copy filtered resources.
[INFO] skip non existing resourceDirectory <https://builds.apache.org/job/Jena_New_Tests/ws/jena-fuseki2/jena-fuseki-server/src/main/resources>
[INFO] Copying 3 resources
[INFO] 
[INFO] --- maven-compiler-plugin:3.1:compile (default-compile) @ jena-fuseki-server ---
[INFO] No sources to compile
[INFO] 
[INFO] --- maven-resources-plugin:2.6:testResources (default-testResources) @ jena-fuseki-server
---
[INFO] Using 'UTF-8' encoding to copy filtered resources.
[INFO] skip non existing resourceDirectory <https://builds.apache.org/job/Jena_New_Tests/ws/jena-fuseki2/jena-fuseki-server/src/test/resources>
[INFO] Copying 3 resources
[INFO] 
[INFO] --- maven-compiler-plugin:3.1:testCompile (default-testCompile) @ jena-fuseki-server
---
[INFO] No sources to compile
[INFO] 
[INFO] --- maven-surefire-plugin:2.16:test (default-test) @ jena-fuseki-server ---
[JENKINS] Recording test results
[JENKINS] Archiving disabled
[INFO]                                                                         
[INFO] ------------------------------------------------------------------------
[INFO] Building Apache Jena - Fuseki Binary Distribution 2.0.0-SNAPSHOT
[INFO] ------------------------------------------------------------------------
[INFO] 
[INFO] --- maven-clean-plugin:2.5:clean (default-clean) @ jena-fuseki-dist ---
[INFO] Deleting <https://builds.apache.org/job/Jena_New_Tests/ws/jena-fuseki2/jena-fuseki-dist/target>
[INFO] 
[INFO] --- maven-enforcer-plugin:1.3.1:enforce (enforce) @ jena-fuseki-dist ---
[INFO] 
[INFO] --- maven-enforcer-plugin:1.3.1:enforce (enforce-java) @ jena-fuseki-dist ---
[INFO] 
[INFO] --- maven-remote-resources-plugin:1.5:process (default) @ jena-fuseki-dist ---
[JENKINS] Archiving disabled
[INFO]                                                                         
[INFO] ------------------------------------------------------------------------
[INFO] Building Apache Jena - Security 2.12.2-SNAPSHOT
[INFO] ------------------------------------------------------------------------
[INFO] 
[INFO] --- maven-clean-plugin:2.5:clean (default-clean) @ jena-security ---
[INFO] Deleting <https://builds.apache.org/job/Jena_New_Tests/ws/jena-security/target>
[INFO] 
[INFO] --- maven-enforcer-plugin:1.3.1:enforce (enforce) @ jena-security ---
[INFO] 
[INFO] --- maven-enforcer-plugin:1.3.1:enforce (enforce-java) @ jena-security ---
[INFO] 
[INFO] --- maven-remote-resources-plugin:1.5:process (default) @ jena-security ---
[INFO] 
[INFO] --- maven-resources-plugin:2.6:resources (default-resources) @ jena-security ---
[INFO] Using 'UTF-8' encoding to copy filtered resources.
[INFO] skip non existing resourceDirectory <https://builds.apache.org/job/Jena_New_Tests/ws/jena-security/src/main/resources>
[INFO] Copying 3 resources
[INFO] 
[INFO] --- maven-compiler-plugin:3.1:compile (default-compile) @ jena-security ---
[INFO] Changes detected - recompiling the module!
[INFO] Compiling 62 source files to <https://builds.apache.org/job/Jena_New_Tests/ws/jena-security/target/classes>
[WARNING] <https://builds.apache.org/job/Jena_New_Tests/ws/jena-security/src/main/java/org/apache/jena/security/model/impl/SecuredAltImpl.java>:
Some input files use or override a deprecated API.
[WARNING] <https://builds.apache.org/job/Jena_New_Tests/ws/jena-security/src/main/java/org/apache/jena/security/model/impl/SecuredAltImpl.java>:
Recompile with -Xlint:deprecation for details.
[WARNING] <https://builds.apache.org/job/Jena_New_Tests/ws/jena-security/src/main/java/org/apache/jena/security/impl/CachedSecurityEvaluator.java>:
<https://builds.apache.org/job/Jena_New_Tests/ws/jena-security/src/main/java/org/apache/jena/security/impl/CachedSecurityEvaluator.java>
uses unchecked or unsafe operations.
[WARNING] <https://builds.apache.org/job/Jena_New_Tests/ws/jena-security/src/main/java/org/apache/jena/security/impl/CachedSecurityEvaluator.java>:
Recompile with -Xlint:unchecked for details.
[INFO] 
[INFO] --- maven-resources-plugin:2.6:testResources (default-testResources) @ jena-security
---
[INFO] Using 'UTF-8' encoding to copy filtered resources.
[INFO] Copying 5 resources
[INFO] Copying 3 resources
[INFO] 
[INFO] --- maven-compiler-plugin:3.1:testCompile (default-testCompile) @ jena-security ---
[INFO] Changes detected - recompiling the module!
[INFO] Compiling 32 source files to <https://builds.apache.org/job/Jena_New_Tests/ws/jena-security/target/test-classes>
[INFO] -------------------------------------------------------------
[WARNING] COMPILATION WARNING : 
[INFO] -------------------------------------------------------------
[WARNING] <https://builds.apache.org/job/Jena_New_Tests/ws/jena-security/src/test/java/org/apache/jena/security/graph/MemGraphTest.java>:
Some input files use or override a deprecated API.
[WARNING] <https://builds.apache.org/job/Jena_New_Tests/ws/jena-security/src/test/java/org/apache/jena/security/graph/MemGraphTest.java>:
Recompile with -Xlint:deprecation for details.
[INFO] 2 warnings 
[INFO] -------------------------------------------------------------
[INFO] -------------------------------------------------------------
[ERROR] COMPILATION ERROR : 
[INFO] -------------------------------------------------------------
[ERROR] <https://builds.apache.org/job/Jena_New_Tests/ws/jena-security/src/test/java/org/apache/jena/security/SecuredAssemblerTest.java>:[75,49]
cannot find symbol
  symbol:   class StaticSecurityEvaluator
  location: class org.apache.jena.security.SecuredAssemblerTest
[ERROR] <https://builds.apache.org/job/Jena_New_Tests/ws/jena-security/src/test/java/org/apache/jena/security/SecuredAssemblerTest.java>:[84,49]
cannot find symbol
  symbol:   class ModelBasedSecurityEvaluator
  location: class org.apache.jena.security.SecuredAssemblerTest
[INFO] 2 errors 
[INFO] -------------------------------------------------------------
[JENKINS] Archiving disabled
[INFO] ------------------------------------------------------------------------
[INFO] Reactor Summary:
[INFO] 
[INFO] Apache Jena - Parent .............................. SUCCESS [2.028s]
[INFO] Apache Jena - IRI ................................. SUCCESS [3.156s]
[INFO] Apache Jena - Core ................................ SUCCESS [54.844s]
[INFO] Apache Jena - ARQ (SPARQL 1.1 Query Engine) ....... SUCCESS [43.998s]
[INFO] Apache Jena - TDB (Native Triple Store) ........... SUCCESS [10.521s]
[INFO] Apache Jena - Libraries POM ....................... SUCCESS [0.283s]
[INFO] Apache Jena - SPARQL Text Search .................. SUCCESS [8.003s]
[INFO] Apache Jena - SPARQL Spatial Search ............... SUCCESS [5.313s]
[INFO] Apache Jena - Data Tables for RDF and SPARQL ...... SUCCESS [2.490s]
[INFO] Apache Jena - SDB (SQL based triple store) ........ SUCCESS [20.159s]
[INFO] Apache Jena - Fuseki1 (SPARQL 1.1 Server) ......... SUCCESS [5.878s]
[INFO] Apache Jena - Fuseki .............................. SUCCESS [0.269s]
[INFO] Apache Jena - Fuseki Server Engine ................ SUCCESS [8.476s]
[INFO] Apache Jena - Fuseki WAR File ..................... SUCCESS [0.866s]
[INFO] Apache Jena - Fuseki Server Standalone Jar ........ SUCCESS [0.833s]
[INFO] Apache Jena - Fuseki Binary Distribution .......... SUCCESS [0.478s]
[INFO] Apache Jena - Security ............................ FAILURE [1.447s]
[INFO] Apache Jena - JDBC Parent ......................... SKIPPED
[INFO] Apache Jena - JDBC Core API ....................... SKIPPED
[INFO] Apache Jena - JDBC Remote Endpoint Driver ......... SKIPPED
[INFO] Apache Jena - JDBC In-Memory Driver ............... SKIPPED
[INFO] Apache Jena - JDBC TDB Driver ..................... SKIPPED
[INFO] Apache Jena - JDBC Driver Bundle .................. SKIPPED
[INFO] Apache Jena - Maven Plugins, including schemagen .. SKIPPED
[INFO] Apache Jena - Distribution ........................ SKIPPED
[INFO] Apache Jena - Extras .............................. SKIPPED
[INFO] Apache Jena - Extras - Query Builder .............. SKIPPED
[INFO] Apache Jena ....................................... SKIPPED
[INFO] ------------------------------------------------------------------------
[INFO] BUILD FAILURE
[INFO] ------------------------------------------------------------------------
[INFO] Total time: 2:56.649s
[INFO] Finished at: Mon Jan 19 21:07:47 UTC 2015
[INFO] Final Memory: 64M/859M
[INFO] ------------------------------------------------------------------------
[JENKINS] Archiving disabled
[JENKINS] Archiving disabled
[JENKINS] Archiving disabled
[JENKINS] Archiving disabled
[JENKINS] Archiving disabled
[JENKINS] Archiving disabled
[JENKINS] Archiving disabled
[JENKINS] Archiving disabled
[JENKINS] Archiving disabled
[JENKINS] Archiving disabled
[JENKINS] Archiving disabled
[JENKINS] Archiving disabled
[JENKINS] Archiving disabled
[JENKINS] Archiving disabled
[JENKINS] Archiving disabled
[JENKINS] Archiving disabled
[JENKINS] Archiving disabled
[JENKINS] Archiving disabled
[JENKINS] Archiving disabled
[JENKINS] Archiving disabled
[JENKINS] Archiving disabled
[JENKINS] Archiving disabled
[JENKINS] Archiving disabled
[JENKINS] Archiving disabled
[JENKINS] Archiving disabled
[JENKINS] Archiving disabled
[JENKINS] Archiving disabled
Waiting for Jenkins to finish collecting data
[ERROR] Failed to execute goal org.apache.maven.plugins:maven-compiler-plugin:3.1:testCompile
(default-testCompile) on project jena-security: Compilation failure: Compilation failure:
[ERROR] <https://builds.apache.org/job/Jena_New_Tests/ws/jena-security/src/test/java/org/apache/jena/security/SecuredAssemblerTest.java>:[75,49]
cannot find symbol
[ERROR] symbol:   class StaticSecurityEvaluator
[ERROR] location: class org.apache.jena.security.SecuredAssemblerTest
[ERROR] <https://builds.apache.org/job/Jena_New_Tests/ws/jena-security/src/test/java/org/apache/jena/security/SecuredAssemblerTest.java>:[84,49]
cannot find symbol
[ERROR] symbol:   class ModelBasedSecurityEvaluator
[ERROR] location: class org.apache.jena.security.SecuredAssemblerTest
[ERROR] -> [Help 1]
[ERROR] 
[ERROR] To see the full stack trace of the errors, re-run Maven with the -e switch.
[ERROR] Re-run Maven using the -X switch to enable full debug logging.
[ERROR] 
[ERROR] For more information about the errors and possible solutions, please read the following
articles:
[ERROR] [Help 1] http://cwiki.apache.org/confluence/display/MAVEN/MojoFailureException
[ERROR] 
[ERROR] After correcting the problems, you can resume the build with the command
[ERROR]   mvn <goals> -rf :jena-security
channel stopped

Mime
View raw message