jena-commits mailing list archives

Site index · List index
Message view « Date » · « Thread »
Top « Date » · « Thread »
From Apache Jenkins Server <jenk...@builds.apache.org>
Subject Build failed in Jenkins: Jena_Development_Test_Windows #504
Date Sun, 11 Jan 2015 08:54:03 GMT
See <https://builds.apache.org/job/Jena_Development_Test_Windows/504/changes>

Changes:

[andy] JENA-846 : Add IRI.toURI.

[andy] JENA-846 : Implement IRI.toURI. Clean up exception declarations.

------------------------------------------
[...truncated 592 lines...]
[INFO] Changes detected - recompiling the module!
[INFO] Compiling 38 source files to F:\hudson\hudson-slave\workspace\Jena_Development_Test_Windows\jena-spatial\target\classes
[INFO] 
[INFO] --- maven-resources-plugin:2.6:testResources (default-testResources) @ jena-spatial
---
[INFO] Using 'UTF-8' encoding to copy filtered resources.
[INFO] Copying 9 resources
[INFO] Copying 3 resources
[INFO] 
[INFO] --- maven-compiler-plugin:3.1:testCompile (default-testCompile) @ jena-spatial ---
[INFO] Changes detected - recompiling the module!
[INFO] Compiling 37 source files to F:\hudson\hudson-slave\workspace\Jena_Development_Test_Windows\jena-spatial\target\test-classes
[INFO] 
[INFO] --- maven-surefire-plugin:2.16:test (default-test) @ jena-spatial ---
[INFO] Surefire report directory: F:\hudson\hudson-slave\workspace\Jena_Development_Test_Windows\jena-spatial\target\surefire-reports

-------------------------------------------------------
 T E S T S
-------------------------------------------------------
Running org.apache.jena.query.spatial.TS_Spatial
Tests run: 53, Failures: 0, Errors: 0, Skipped: 0, Time elapsed: 6.966 sec - in org.apache.jena.query.spatial.TS_Spatial

Results :

Tests run: 53, Failures: 0, Errors: 0, Skipped: 0

[JENKINS] Recording test results
[JENKINS] Archiving disabled
[INFO]                                                                         
[INFO] ------------------------------------------------------------------------
[INFO] Building Apache Jena - Data Tables for RDF and SPARQL 1.0.1-SNAPSHOT
[INFO] ------------------------------------------------------------------------
[INFO] 
[INFO] --- maven-clean-plugin:2.5:clean (default-clean) @ jena-csv ---
[INFO] Deleting F:\hudson\hudson-slave\workspace\Jena_Development_Test_Windows\jena-csv\target
[INFO] 
[INFO] --- maven-enforcer-plugin:1.3.1:enforce (enforce) @ jena-csv ---
[INFO] 
[INFO] --- maven-enforcer-plugin:1.3.1:enforce (enforce-java) @ jena-csv ---
[INFO] 
[INFO] --- maven-remote-resources-plugin:1.5:process (default) @ jena-csv ---
[INFO] 
[INFO] --- maven-resources-plugin:2.6:resources (default-resources) @ jena-csv ---
[INFO] Using 'UTF-8' encoding to copy filtered resources.
[INFO] Copying 0 resource
[INFO] Copying 3 resources
[INFO] 
[INFO] --- maven-compiler-plugin:3.1:compile (default-compile) @ jena-csv ---
[INFO] Changes detected - recompiling the module!
[INFO] Compiling 19 source files to F:\hudson\hudson-slave\workspace\Jena_Development_Test_Windows\jena-csv\target\classes
[INFO] 
[INFO] --- maven-resources-plugin:2.6:testResources (default-testResources) @ jena-csv ---
[INFO] Using 'UTF-8' encoding to copy filtered resources.
[INFO] Copying 5 resources
[INFO] Copying 3 resources
[INFO] 
[INFO] --- maven-compiler-plugin:3.1:testCompile (default-testCompile) @ jena-csv ---
[INFO] Changes detected - recompiling the module!
[INFO] Compiling 12 source files to F:\hudson\hudson-slave\workspace\Jena_Development_Test_Windows\jena-csv\target\test-classes
[INFO] 
[INFO] --- maven-surefire-plugin:2.16:test (default-test) @ jena-csv ---
[INFO] Surefire report directory: F:\hudson\hudson-slave\workspace\Jena_Development_Test_Windows\jena-csv\target\surefire-reports

-------------------------------------------------------
 T E S T S
-------------------------------------------------------
Running org.apache.jena.propertytable.TS_PropertyTable
Tests run: 60, Failures: 0, Errors: 0, Skipped: 0, Time elapsed: 1.787 sec - in org.apache.jena.propertytable.TS_PropertyTable

Results :

Tests run: 60, Failures: 0, Errors: 0, Skipped: 0

[JENKINS] Recording test results
[JENKINS] Archiving disabled
[INFO]                                                                         
[INFO] ------------------------------------------------------------------------
[INFO] Building Apache Jena - SDB (SQL based triple store) 1.5.2-SNAPSHOT
[INFO] ------------------------------------------------------------------------
[INFO] 
[INFO] --- maven-clean-plugin:2.5:clean (default-clean) @ jena-sdb ---
[INFO] Deleting F:\hudson\hudson-slave\workspace\Jena_Development_Test_Windows\jena-sdb\target
[INFO] 
[INFO] --- maven-enforcer-plugin:1.3.1:enforce (enforce) @ jena-sdb ---
[INFO] 
[INFO] --- maven-enforcer-plugin:1.3.1:enforce (enforce-java) @ jena-sdb ---
[INFO] 
[INFO] --- maven-remote-resources-plugin:1.5:process (default) @ jena-sdb ---
[INFO] 
[INFO] --- maven-resources-plugin:2.6:resources (default-resources) @ jena-sdb ---
[INFO] Using 'UTF-8' encoding to copy filtered resources.
[INFO] Copying 1 resource to com/hp/hpl/jena/sdb/
[INFO] Copying 3 resources
[INFO] 
[INFO] --- maven-compiler-plugin:3.1:compile (default-compile) @ jena-sdb ---
[INFO] Changes detected - recompiling the module!
[INFO] Compiling 348 source files to F:\hudson\hudson-slave\workspace\Jena_Development_Test_Windows\jena-sdb\target\classes
[INFO] 
[INFO] --- maven-resources-plugin:2.6:testResources (default-testResources) @ jena-sdb ---
[INFO] Using 'UTF-8' encoding to copy filtered resources.
[INFO] skip non existing resourceDirectory F:\hudson\hudson-slave\workspace\Jena_Development_Test_Windows\jena-sdb\src\test\resources
[INFO] Copying 3 resources
[INFO] 
[INFO] --- maven-compiler-plugin:3.1:testCompile (default-testCompile) @ jena-sdb ---
[INFO] Changes detected - recompiling the module!
[INFO] Compiling 68 source files to F:\hudson\hudson-slave\workspace\Jena_Development_Test_Windows\jena-sdb\target\test-classes
[INFO] 
[INFO] --- maven-surefire-plugin:2.16:test (default-test) @ jena-sdb ---
[INFO] Surefire report directory: F:\hudson\hudson-slave\workspace\Jena_Development_Test_Windows\jena-sdb\target\surefire-reports

-------------------------------------------------------
 T E S T S
-------------------------------------------------------
Running com.hp.hpl.jena.sdb.test.SDBTestAll
Tests run: 524, Failures: 0, Errors: 0, Skipped: 0, Time elapsed: 30.039 sec - in com.hp.hpl.jena.sdb.test.SDBTestAll

Results :

Tests run: 524, Failures: 0, Errors: 0, Skipped: 0

[JENKINS] Recording test results
[JENKINS] Archiving disabled
[INFO]                                                                         
[INFO] ------------------------------------------------------------------------
[INFO] Building Apache Jena - Fuseki1 (SPARQL 1.1 Server) 1.1.2-SNAPSHOT
[INFO] ------------------------------------------------------------------------
[INFO] 
[INFO] --- maven-clean-plugin:2.5:clean (default-clean) @ jena-fuseki ---
[INFO] Deleting F:\hudson\hudson-slave\workspace\Jena_Development_Test_Windows\jena-fuseki\target
[INFO] 
[INFO] --- maven-enforcer-plugin:1.3.1:enforce (enforce) @ jena-fuseki ---
[INFO] 
[INFO] --- maven-enforcer-plugin:1.3.1:enforce (enforce-java) @ jena-fuseki ---
[INFO] 
[INFO] --- maven-remote-resources-plugin:1.5:process (default) @ jena-fuseki ---
[INFO] 
[INFO] --- maven-resources-plugin:2.6:resources (default-resources) @ jena-fuseki ---
[INFO] Using 'UTF-8' encoding to copy filtered resources.
[INFO] Copying 0 resource
[INFO] Copying 1 resource
[INFO] Copying 3 resources
[INFO] 
[INFO] --- maven-compiler-plugin:3.1:compile (default-compile) @ jena-fuseki ---
[INFO] Changes detected - recompiling the module!
[INFO] Compiling 70 source files to F:\hudson\hudson-slave\workspace\Jena_Development_Test_Windows\jena-fuseki\target\classes
[INFO] 
[INFO] --- maven-resources-plugin:2.6:testResources (default-testResources) @ jena-fuseki
---
[INFO] Using 'UTF-8' encoding to copy filtered resources.
[INFO] Copying 1 resource
[INFO] Copying 3 resources
[INFO] 
[INFO] --- maven-compiler-plugin:3.1:testCompile (default-testCompile) @ jena-fuseki ---
[INFO] Changes detected - recompiling the module!
[INFO] Compiling 8 source files to F:\hudson\hudson-slave\workspace\Jena_Development_Test_Windows\jena-fuseki\target\test-classes
[INFO] 
[INFO] --- maven-surefire-plugin:2.16:test (default-test) @ jena-fuseki ---
[INFO] Surefire report directory: F:\hudson\hudson-slave\workspace\Jena_Development_Test_Windows\jena-fuseki\target\surefire-reports

-------------------------------------------------------
 T E S T S
-------------------------------------------------------
Running org.apache.jena.fuseki.TS_Fuseki
08:53:53 ERROR Server                    :: SPARQLServer: Failed to start server: Address
already in use: bind

Results :

Tests run: 0, Failures: 0, Errors: 0, Skipped: 0

[JENKINS] Recording test results
[JENKINS] Archiving disabled
[JENKINS] Archiving disabled
[JENKINS] Archiving disabled
[JENKINS] Archiving disabled
[JENKINS] Archiving disabled
[JENKINS] Archiving disabled
[JENKINS] Archiving disabled
[JENKINS] Archiving disabled
[JENKINS] Archiving disabled
[JENKINS] Archiving disabled
[JENKINS] Archiving disabled
[JENKINS] Archiving disabled
[JENKINS] Archiving disabled
[JENKINS] Archiving disabled
[JENKINS] Archiving disabled
[JENKINS] Archiving disabled
[JENKINS] Archiving disabled
[JENKINS] Archiving disabled
[JENKINS] Archiving disabled
[JENKINS] Archiving disabled
[JENKINS] Archiving disabled
[JENKINS] Archiving disabled
[JENKINS] Archiving disabled
[JENKINS] Archiving disabled
[JENKINS] Archiving disabled
[JENKINS] Archiving disabled
[JENKINS] Archiving disabled
[JENKINS] Archiving disabled
[INFO] ------------------------------------------------------------------------
[INFO] Reactor Summary:
[INFO] 
[INFO] Apache Jena - Parent .............................. SUCCESS [6.295s]
[INFO] Apache Jena - IRI ................................. SUCCESS [15.527s]
[INFO] Apache Jena - Core ................................ SUCCESS [1:41.112s]
[INFO] Apache Jena - ARQ (SPARQL 1.1 Query Engine) ....... SUCCESS [2:22.459s]
[INFO] Apache Jena - TDB (Native Triple Store) ........... SUCCESS [1:36.616s]
[INFO] Apache Jena - Libraries POM ....................... SUCCESS [0.959s]
[INFO] Apache Jena - SPARQL Text Search .................. SUCCESS [20.448s]
[INFO] Apache Jena - SPARQL Spatial Search ............... SUCCESS [12.012s]
[INFO] Apache Jena - Data Tables for RDF and SPARQL ...... SUCCESS [3.830s]
[INFO] Apache Jena - SDB (SQL based triple store) ........ SUCCESS [37.069s]
[INFO] Apache Jena - Fuseki1 (SPARQL 1.1 Server) ......... FAILURE [13.381s]
[INFO] Apache Jena - Fuseki, SPARQL 1.1 Server ........... SKIPPED
[INFO] Apache Jena - Fuseki Server Engine ................ SKIPPED
[INFO] Apache Jena - Fuseki WAR File ..................... SKIPPED
[INFO] Apache Jena - Fuseki Server Standalone Jar ........ SKIPPED
[INFO] Apache Jena - Fuseki Binary Distribution .......... SKIPPED
[INFO] Apache Jena - Security ............................ SKIPPED
[INFO] Apache Jena - JDBC Parent ......................... SKIPPED
[INFO] Apache Jena - JDBC Core API ....................... SKIPPED
[INFO] Apache Jena - JDBC Remote Endpoint Driver ......... SKIPPED
[INFO] Apache Jena - JDBC In-Memory Driver ............... SKIPPED
[INFO] Apache Jena - JDBC TDB Driver ..................... SKIPPED
[INFO] Apache Jena - JDBC Driver Bundle .................. SKIPPED
[INFO] Apache Jena - Maven Plugins, including schemagen .. SKIPPED
[INFO] Apache Jena - Distribution ........................ SKIPPED
[INFO] Apache Jena - Extras .............................. SKIPPED
[INFO] Apache Jena - Extras - Query Builder .............. SKIPPED
[INFO] Apache Jena ....................................... SKIPPED
[INFO] ------------------------------------------------------------------------
[INFO] BUILD FAILURE
[INFO] ------------------------------------------------------------------------
[INFO] Total time: 7:34.247s
[INFO] Finished at: Sun Jan 11 08:53:53 GMT 2015
[INFO] Final Memory: 75M/873M
[INFO] ------------------------------------------------------------------------
[ERROR] Failed to execute goal org.apache.maven.plugins:maven-surefire-plugin:2.16:test (default-test)
on project jena-fuseki: Execution default-test of goal org.apache.maven.plugins:maven-surefire-plugin:2.16:test
failed: The forked VM terminated without saying properly goodbye. VM crash or System.exit
called ?
[ERROR] Command wascmd.exe /X /C "f:\hudson\tools\java\latest-1.7-64\jre\bin\java -jar F:\hudson\hudson-slave\workspace\Jena_Development_Test_Windows\jena-fuseki\target\surefire\surefirebooter76420558951105210.jar
F:\hudson\hudson-slave\workspace\Jena_Development_Test_Windows\jena-fuseki\target\surefire\surefire5138463615728176016tmp
F:\hudson\hudson-slave\workspace\Jena_Development_Test_Windows\jena-fuseki\target\surefire\surefire_83560969768472011821tmp"
[ERROR] -> [Help 1]
[ERROR] 
[ERROR] To see the full stack trace of the errors, re-run Maven with the -e switch.
[ERROR] Re-run Maven using the -X switch to enable full debug logging.
[ERROR] 
[ERROR] For more information about the errors and possible solutions, please read the following
articles:
[ERROR] [Help 1] http://cwiki.apache.org/confluence/display/MAVEN/PluginExecutionException
[ERROR] 
[ERROR] After correcting the problems, you can resume the build with the command
[ERROR]   mvn <goals> -rf :jena-fuseki
Sending e-mails to: commits@jena.apache.org
Sending e-mails to: commits@jena.apache.org
channel stopped

Mime
View raw message