jena-commits mailing list archives

Site index · List index
Message view « Date » · « Thread »
Top « Date » · « Thread »
From Apache Jenkins Server <jenk...@builds.apache.org>
Subject Build failed in Jenkins: Jena_Development_Test_Java8 #143
Date Fri, 02 Jan 2015 19:18:54 GMT
See <https://builds.apache.org/job/Jena_Development_Test_Java8/143/changes>

Changes:

[andy] JENA-778 : Depracte TripleMatch and fixup

[andy] JENA-662 : Filename handling in FileModelAssembler

------------------------------------------
[...truncated 354 lines...]
Tests run: 2, Failures: 0, Errors: 0, Skipped: 0, Time elapsed: 0.002 sec - in com.hp.hpl.jena.tdb.base.recordfile.TS_RecordFile
Running com.hp.hpl.jena.tdb.index.TS_Index
Tests run: 89, Failures: 0, Errors: 0, Skipped: 0, Time elapsed: 0.737 sec - in com.hp.hpl.jena.tdb.index.TS_Index
Running com.hp.hpl.jena.tdb.TS_Factory
19:18:22 WARN  TDB                       :: Location <https://builds.apache.org/job/Jena_Development_Test_Java8/ws/jena-tdb/target/tdb-testing/DB/>
was not locked, if another JVM accessed this location simultaneously data corruption may have
occurred
Tests run: 5, Failures: 0, Errors: 0, Skipped: 0, Time elapsed: 0.099 sec - in com.hp.hpl.jena.tdb.TS_Factory
Running com.hp.hpl.jena.tdb.solver.TS_SolverTDB
Tests run: 10, Failures: 0, Errors: 0, Skipped: 0, Time elapsed: 0.284 sec - in com.hp.hpl.jena.tdb.solver.TS_SolverTDB
Running com.hp.hpl.jena.tdb.assembler.TS_TDBAssembler
Tests run: 7, Failures: 0, Errors: 0, Skipped: 0, Time elapsed: 0.42 sec - in com.hp.hpl.jena.tdb.assembler.TS_TDBAssembler
Running com.hp.hpl.jena.tdb.graph.TS_Graph
Tests run: 90, Failures: 0, Errors: 0, Skipped: 4, Time elapsed: 0.438 sec - in com.hp.hpl.jena.tdb.graph.TS_Graph
Running com.hp.hpl.jena.tdb.store.tupletable.TS_TupleTable
Tests run: 44, Failures: 0, Errors: 0, Skipped: 0, Time elapsed: 0.017 sec - in com.hp.hpl.jena.tdb.store.tupletable.TS_TupleTable
Running com.hp.hpl.jena.tdb.store.nodetable.TS_NodeTable
Tests run: 46, Failures: 0, Errors: 0, Skipped: 0, Time elapsed: 0.032 sec - in com.hp.hpl.jena.tdb.store.nodetable.TS_NodeTable
Running com.hp.hpl.jena.tdb.store.TS_Store
19:18:24 WARN  TDB                       :: Location <https://builds.apache.org/job/Jena_Development_Test_Java8/ws/jena-tdb/target/tdb-testing/DB/>
was not locked, if another JVM accessed this location simultaneously data corruption may have
occurred
Tests run: 201, Failures: 0, Errors: 0, Skipped: 0, Time elapsed: 1.56 sec - in com.hp.hpl.jena.tdb.store.TS_Store
Running com.hp.hpl.jena.tdb.setup.TS_TDBSetup
19:18:25 WARN  TDB                       :: Location <https://builds.apache.org/job/Jena_Development_Test_Java8/ws/jena-tdb/target/tdb-testing/DB/>
was not locked, if another JVM accessed this location simultaneously data corruption may have
occurred
Tests run: 28, Failures: 0, Errors: 0, Skipped: 0, Time elapsed: 0.107 sec - in com.hp.hpl.jena.tdb.setup.TS_TDBSetup
Running com.hp.hpl.jena.tdb.sys.TS_Sys
Tests run: 1, Failures: 0, Errors: 0, Skipped: 0, Time elapsed: 0 sec - in com.hp.hpl.jena.tdb.sys.TS_Sys
Running com.hp.hpl.jena.tdb.lib.TS_LibTDB
Tests run: 9, Failures: 0, Errors: 0, Skipped: 0, Time elapsed: 0.003 sec - in com.hp.hpl.jena.tdb.lib.TS_LibTDB
Running com.hp.hpl.jena.tdb.transaction.TS_TransactionTDB
19:18:26 WARN  TDB                       :: Location <https://builds.apache.org/job/Jena_Development_Test_Java8/ws/jena-tdb/target/tdb-testing/DB/>
was not locked, if another JVM accessed this location simultaneously data corruption may have
occurred
Tests run: 129, Failures: 0, Errors: 0, Skipped: 0, Time elapsed: 1.601 sec - in com.hp.hpl.jena.tdb.transaction.TS_TransactionTDB

Results :

Tests run: 819, Failures: 0, Errors: 0, Skipped: 8

[JENKINS] Recording test results
[JENKINS] Archiving disabled
[INFO]                                                                         
[INFO] ------------------------------------------------------------------------
[INFO] Building Apache Jena - Libraries POM 2.12.2-SNAPSHOT
[INFO] ------------------------------------------------------------------------
[INFO] 
[INFO] --- maven-clean-plugin:2.5:clean (default-clean) @ apache-jena-libs ---
[INFO] 
[INFO] --- maven-enforcer-plugin:1.3.1:enforce (enforce) @ apache-jena-libs ---
[INFO] 
[INFO] --- maven-enforcer-plugin:1.3.1:enforce (enforce-java) @ apache-jena-libs ---
[INFO] 
[INFO] --- maven-remote-resources-plugin:1.5:process (default) @ apache-jena-libs ---
[JENKINS] Archiving disabled
[INFO]                                                                         
[INFO] ------------------------------------------------------------------------
[INFO] Building Apache Jena - SPARQL Text Search 1.1.2-SNAPSHOT
[INFO] ------------------------------------------------------------------------
[INFO] 
[INFO] --- maven-clean-plugin:2.5:clean (default-clean) @ jena-text ---
[INFO] 
[INFO] --- maven-enforcer-plugin:1.3.1:enforce (enforce) @ jena-text ---
[INFO] 
[INFO] --- maven-enforcer-plugin:1.3.1:enforce (enforce-java) @ jena-text ---
[INFO] 
[INFO] --- maven-remote-resources-plugin:1.5:process (default) @ jena-text ---
[INFO] 
[INFO] --- maven-resources-plugin:2.6:resources (default-resources) @ jena-text ---
[INFO] Using 'UTF-8' encoding to copy filtered resources.
[INFO] Copying 1 resource
[INFO] Copying 2 resources
[INFO] Copying 3 resources
[INFO] 
[INFO] --- maven-compiler-plugin:3.1:compile (default-compile) @ jena-text ---
[INFO] Changes detected - recompiling the module!
[INFO] Compiling 29 source files to <https://builds.apache.org/job/Jena_Development_Test_Java8/ws/jena-text/target/classes>
[INFO] 
[INFO] --- maven-resources-plugin:2.6:testResources (default-testResources) @ jena-text ---
[INFO] Using 'UTF-8' encoding to copy filtered resources.
[INFO] Copying 1 resource
[INFO] Copying 3 resources
[INFO] 
[INFO] --- maven-compiler-plugin:3.1:testCompile (default-testCompile) @ jena-text ---
[INFO] Changes detected - recompiling the module!
[INFO] Compiling 22 source files to <https://builds.apache.org/job/Jena_Development_Test_Java8/ws/jena-text/target/test-classes>
[INFO] 
[INFO] --- maven-surefire-plugin:2.16:test (default-test) @ jena-text ---
[INFO] Surefire report directory: <https://builds.apache.org/job/Jena_Development_Test_Java8/ws/jena-text/target/surefire-reports>

-------------------------------------------------------
 T E S T S
-------------------------------------------------------
Running org.apache.jena.query.text.TS_Text
Tests run: 96, Failures: 0, Errors: 0, Skipped: 0, Time elapsed: 3.519 sec - in org.apache.jena.query.text.TS_Text

Results :

Tests run: 96, Failures: 0, Errors: 0, Skipped: 0

[JENKINS] Recording test results
[JENKINS] Archiving disabled
[INFO]                                                                         
[INFO] ------------------------------------------------------------------------
[INFO] Building Apache Jena - SPARQL Spatial Search 1.1.2-SNAPSHOT
[INFO] ------------------------------------------------------------------------
[INFO] 
[INFO] --- maven-clean-plugin:2.5:clean (default-clean) @ jena-spatial ---
[INFO] 
[INFO] --- maven-enforcer-plugin:1.3.1:enforce (enforce) @ jena-spatial ---
[INFO] 
[INFO] --- maven-enforcer-plugin:1.3.1:enforce (enforce-java) @ jena-spatial ---
[INFO] 
[INFO] --- maven-remote-resources-plugin:1.5:process (default) @ jena-spatial ---
[INFO] 
[INFO] --- maven-resources-plugin:2.6:resources (default-resources) @ jena-spatial ---
[INFO] Using 'UTF-8' encoding to copy filtered resources.
[INFO] Copying 1 resource
[INFO] Copying 0 resource
[INFO] Copying 3 resources
[INFO] 
[INFO] --- maven-compiler-plugin:3.1:compile (default-compile) @ jena-spatial ---
[INFO] Changes detected - recompiling the module!
[INFO] Compiling 38 source files to <https://builds.apache.org/job/Jena_Development_Test_Java8/ws/jena-spatial/target/classes>
[INFO] 
[INFO] --- maven-resources-plugin:2.6:testResources (default-testResources) @ jena-spatial
---
[INFO] Using 'UTF-8' encoding to copy filtered resources.
[INFO] Copying 9 resources
[INFO] Copying 3 resources
[INFO] 
[INFO] --- maven-compiler-plugin:3.1:testCompile (default-testCompile) @ jena-spatial ---
[INFO] Changes detected - recompiling the module!
[INFO] Compiling 37 source files to <https://builds.apache.org/job/Jena_Development_Test_Java8/ws/jena-spatial/target/test-classes>
[INFO] 
[INFO] --- maven-surefire-plugin:2.16:test (default-test) @ jena-spatial ---
[INFO] Surefire report directory: <https://builds.apache.org/job/Jena_Development_Test_Java8/ws/jena-spatial/target/surefire-reports>

-------------------------------------------------------
 T E S T S
-------------------------------------------------------
Running org.apache.jena.query.spatial.TS_Spatial
Tests run: 53, Failures: 0, Errors: 0, Skipped: 0, Time elapsed: 2.988 sec - in org.apache.jena.query.spatial.TS_Spatial

Results :

Tests run: 53, Failures: 0, Errors: 0, Skipped: 0

[JENKINS] Recording test results
[JENKINS] Archiving disabled
[INFO]                                                                         
[INFO] ------------------------------------------------------------------------
[INFO] Building Apache Jena - Data Tables for RDF and SPARQL 1.0.1-SNAPSHOT
[INFO] ------------------------------------------------------------------------
[INFO] 
[INFO] --- maven-clean-plugin:2.5:clean (default-clean) @ jena-csv ---
[INFO] 
[INFO] --- maven-enforcer-plugin:1.3.1:enforce (enforce) @ jena-csv ---
[INFO] 
[INFO] --- maven-enforcer-plugin:1.3.1:enforce (enforce-java) @ jena-csv ---
[INFO] 
[INFO] --- maven-remote-resources-plugin:1.5:process (default) @ jena-csv ---
[INFO] 
[INFO] --- maven-resources-plugin:2.6:resources (default-resources) @ jena-csv ---
[INFO] Using 'UTF-8' encoding to copy filtered resources.
[INFO] skip non existing resourceDirectory <https://builds.apache.org/job/Jena_Development_Test_Java8/ws/jena-csv/src/main/resources>
[INFO] Copying 3 resources
[INFO] 
[INFO] --- maven-compiler-plugin:3.1:compile (default-compile) @ jena-csv ---
[INFO] Changes detected - recompiling the module!
[INFO] Compiling 19 source files to <https://builds.apache.org/job/Jena_Development_Test_Java8/ws/jena-csv/target/classes>
[INFO] -------------------------------------------------------------
[WARNING] COMPILATION WARNING : 
[INFO] -------------------------------------------------------------
[WARNING] <https://builds.apache.org/job/Jena_Development_Test_Java8/ws/jena-csv/src/main/java/org/apache/jena/propertytable/graph/GraphPropertyTable.java>:
<https://builds.apache.org/job/Jena_Development_Test_Java8/ws/jena-csv/src/main/java/org/apache/jena/propertytable/graph/GraphPropertyTable.java>
uses or overrides a deprecated API.
[WARNING] <https://builds.apache.org/job/Jena_Development_Test_Java8/ws/jena-csv/src/main/java/org/apache/jena/propertytable/graph/GraphPropertyTable.java>:
Recompile with -Xlint:deprecation for details.
[INFO] 2 warnings 
[INFO] -------------------------------------------------------------
[INFO] -------------------------------------------------------------
[ERROR] COMPILATION ERROR : 
[INFO] -------------------------------------------------------------
[ERROR] <https://builds.apache.org/job/Jena_Development_Test_Java8/ws/jena-csv/src/main/java/org/apache/jena/propertytable/graph/GraphPropertyTable.java>:[47,8]
org.apache.jena.propertytable.graph.GraphPropertyTable is not abstract and does not override
abstract method graphBaseFind(com.hp.hpl.jena.graph.Triple) in com.hp.hpl.jena.graph.impl.GraphBase
[INFO] 1 error
[INFO] -------------------------------------------------------------
[JENKINS] Archiving disabled
[JENKINS] Archiving disabled
[JENKINS] Archiving disabled
[JENKINS] Archiving disabled
[JENKINS] Archiving disabled
[JENKINS] Archiving disabled
[JENKINS] Archiving disabled
[JENKINS] Archiving disabled
[JENKINS] Archiving disabled
[JENKINS] Archiving disabled
[JENKINS] Archiving disabled
[JENKINS] Archiving disabled
[JENKINS] Archiving disabled
[JENKINS] Archiving disabled
[JENKINS] Archiving disabled
[JENKINS] Archiving disabled
[JENKINS] Archiving disabled
[JENKINS] Archiving disabled
[JENKINS] Archiving disabled
[JENKINS] Archiving disabled
[JENKINS] Archiving disabled
[JENKINS] Archiving disabled
[JENKINS] Archiving disabled
[JENKINS] Archiving disabled[INFO] ------------------------------------------------------------------------
[INFO] Reactor Summary:
[INFO] 
[INFO] Apache Jena - Parent .............................. SUCCESS [2.676s]
[INFO] Apache Jena - IRI ................................. SUCCESS [17.586s]
[INFO] Apache Jena - Core ................................ SUCCESS [41.261s]
[INFO] Apache Jena - ARQ (SPARQL 1.1 Query Engine) ....... SUCCESS [48.415s]
[INFO] Apache Jena - TDB (Native Triple Store) ........... SUCCESS [10.177s]
[INFO] Apache Jena - Libraries POM ....................... SUCCESS [0.561s]
[INFO] Apache Jena - SPARQL Text Search .................. SUCCESS [7.479s]
[INFO] Apache Jena - SPARQL Spatial Search ............... SUCCESS [5.555s]
[INFO] Apache Jena - Data Tables for RDF and SPARQL ...... FAILURE [0.989s]
[INFO] Apache Jena - SDB (SQL based triple store) ........ SKIPPED
[INFO] Apache Jena - Fuseki1 (SPARQL 1.1 Server) ......... SKIPPED
[INFO] Apache Jena - Fuseki2 (SPARQL 1.1 Server) ......... SKIPPED
[INFO] Apache Jena - Security ............................ SKIPPED
[INFO] Apache Jena - JDBC Parent ......................... SKIPPED
[INFO] Apache Jena - JDBC Core API ....................... SKIPPED
[INFO] Apache Jena - JDBC Remote Endpoint Driver ......... SKIPPED
[INFO] Apache Jena - JDBC In-Memory Driver ............... SKIPPED
[INFO] Apache Jena - JDBC TDB Driver ..................... SKIPPED
[INFO] Apache Jena - JDBC Driver Bundle .................. SKIPPED
[INFO] Apache Jena - Maven Plugins, including schemagen .. SKIPPED
[INFO] Apache Jena - Distribution ........................ SKIPPED
[INFO] Apache Jena - Extras .............................. SKIPPED
[INFO] Apache Jena - Extras - Query Builder .............. SKIPPED
[INFO] Apache Jena ....................................... SKIPPED
[INFO] ------------------------------------------------------------------------
[INFO] BUILD FAILURE
[INFO] ------------------------------------------------------------------------
[INFO] Total time: 2:25.591s
[INFO] Finished at: Fri Jan 02 19:18:50 UTC 2015

[INFO] Final Memory: 54M/349M
[INFO] ------------------------------------------------------------------------
[ERROR] Failed to execute goal org.apache.maven.plugins:maven-compiler-plugin:3.1:compile
(default-compile) on project jena-csv: Compilation failure
[ERROR] <https://builds.apache.org/job/Jena_Development_Test_Java8/ws/jena-csv/src/main/java/org/apache/jena/propertytable/graph/GraphPropertyTable.java>:[47,8]
org.apache.jena.propertytable.graph.GraphPropertyTable is not abstract and does not override
abstract method graphBaseFind(com.hp.hpl.jena.graph.Triple) in com.hp.hpl.jena.graph.impl.GraphBase
[ERROR] -> [Help 1]
[ERROR] 
[ERROR] To see the full stack trace of the errors, re-run Maven with the -e switch.
[ERROR] Re-run Maven using the -X switch to enable full debug logging.
[ERROR] 
[ERROR] For more information about the errors and possible solutions, please read the following
articles:
[ERROR] [Help 1] http://cwiki.apache.org/confluence/display/MAVEN/MojoFailureException
[ERROR] 
[ERROR] After correcting the problems, you can resume the build with the command
[ERROR]   mvn <goals> -rf :jena-csv
Sending e-mails to: commits@jena.apache.org
channel stopped

Mime
View raw message