jena-commits mailing list archives

Site index · List index
Message view « Date » · « Thread »
Top « Date » · « Thread »
From Apache Jenkins Server <jenk...@builds.apache.org>
Subject Build failed in Jenkins: Jena_Development_Deploy #833
Date Wed, 14 Jan 2015 10:01:39 GMT
See <https://builds.apache.org/job/Jena_Development_Deploy/833/changes>

Changes:

[claude] Changes to implement JENA-847

[sallen] JENA-848 : Fix concurrency control for in-process Lucene index

------------------------------------------
[...truncated 1931 lines...]
[INFO] Exclude: **/run/**/*
[INFO] Exclude: **/*.classpath
[INFO] 17 resources included (use -debug for more details)
[INFO] Rat check: Summary of files. Unapproved: 0 unknown: 0 generated: 0 approved: 15 licence.
[INFO] 
[INFO] --- maven-install-plugin:2.5.1:install (default-install) @ jena-fuseki-dist ---
[INFO] Installing <https://builds.apache.org/job/Jena_Development_Deploy/ws/jena-fuseki2/jena-fuseki-dist/pom.xml>
to /home/jenkins/jenkins-slave/maven-repositories/0/org/apache/jena/jena-fuseki-dist/2.0.0-SNAPSHOT/jena-fuseki-dist-2.0.0-SNAPSHOT.pom
[INFO] Installing <https://builds.apache.org/job/Jena_Development_Deploy/ws/jena-fuseki2/jena-fuseki-dist/target/jena-fuseki-dist-2.0.0-SNAPSHOT.zip>
to /home/jenkins/jenkins-slave/maven-repositories/0/org/apache/jena/jena-fuseki-dist/2.0.0-SNAPSHOT/jena-fuseki-dist-2.0.0-SNAPSHOT.zip
[INFO] Installing <https://builds.apache.org/job/Jena_Development_Deploy/ws/jena-fuseki2/jena-fuseki-dist/target/jena-fuseki-dist-2.0.0-SNAPSHOT.tar.gz>
to /home/jenkins/jenkins-slave/maven-repositories/0/org/apache/jena/jena-fuseki-dist/2.0.0-SNAPSHOT/jena-fuseki-dist-2.0.0-SNAPSHOT.tar.gz
[INFO] 
[INFO] --- maven-deploy-plugin:2.8.1:deploy (default-deploy) @ jena-fuseki-dist ---
[INFO] Downloading: https://repository.apache.org/content/repositories/snapshots/org/apache/jena/jena-fuseki-dist/2.0.0-SNAPSHOT/maven-metadata.xml
[INFO] Downloaded: https://repository.apache.org/content/repositories/snapshots/org/apache/jena/jena-fuseki-dist/2.0.0-SNAPSHOT/maven-metadata.xml
(961 B at 0.6 KB/sec)
[INFO] Uploading: https://repository.apache.org/content/repositories/snapshots/org/apache/jena/jena-fuseki-dist/2.0.0-SNAPSHOT/jena-fuseki-dist-2.0.0-20150114.100140-11.pom
[INFO] Uploaded: https://repository.apache.org/content/repositories/snapshots/org/apache/jena/jena-fuseki-dist/2.0.0-SNAPSHOT/jena-fuseki-dist-2.0.0-20150114.100140-11.pom
(3 KB at 10.8 KB/sec)
[INFO] Downloading: https://repository.apache.org/content/repositories/snapshots/org/apache/jena/jena-fuseki-dist/maven-metadata.xml
[INFO] Downloaded: https://repository.apache.org/content/repositories/snapshots/org/apache/jena/jena-fuseki-dist/maven-metadata.xml
(291 B at 0.9 KB/sec)
[INFO] Uploading: https://repository.apache.org/content/repositories/snapshots/org/apache/jena/jena-fuseki-dist/2.0.0-SNAPSHOT/maven-metadata.xml
[INFO] Uploaded: https://repository.apache.org/content/repositories/snapshots/org/apache/jena/jena-fuseki-dist/2.0.0-SNAPSHOT/maven-metadata.xml
(961 B at 2.0 KB/sec)
[INFO] Uploading: https://repository.apache.org/content/repositories/snapshots/org/apache/jena/jena-fuseki-dist/maven-metadata.xml
[INFO] Uploaded: https://repository.apache.org/content/repositories/snapshots/org/apache/jena/jena-fuseki-dist/maven-metadata.xml
(291 B at 0.1 KB/sec)
[INFO] Uploading: https://repository.apache.org/content/repositories/snapshots/org/apache/jena/jena-fuseki-dist/2.0.0-SNAPSHOT/jena-fuseki-dist-2.0.0-20150114.100140-11.zip
[INFO] Uploaded: https://repository.apache.org/content/repositories/snapshots/org/apache/jena/jena-fuseki-dist/2.0.0-SNAPSHOT/jena-fuseki-dist-2.0.0-20150114.100140-11.zip
(37874 KB at 3802.2 KB/sec)
[INFO] Uploading: https://repository.apache.org/content/repositories/snapshots/org/apache/jena/jena-fuseki-dist/2.0.0-SNAPSHOT/maven-metadata.xml
[INFO] Uploaded: https://repository.apache.org/content/repositories/snapshots/org/apache/jena/jena-fuseki-dist/2.0.0-SNAPSHOT/maven-metadata.xml
(961 B at 1.6 KB/sec)
[INFO] Uploading: https://repository.apache.org/content/repositories/snapshots/org/apache/jena/jena-fuseki-dist/2.0.0-SNAPSHOT/jena-fuseki-dist-2.0.0-20150114.100140-11.tar.gz
[INFO] Uploaded: https://repository.apache.org/content/repositories/snapshots/org/apache/jena/jena-fuseki-dist/2.0.0-SNAPSHOT/jena-fuseki-dist-2.0.0-20150114.100140-11.tar.gz
(35769 KB at 4306.9 KB/sec)
[INFO] Uploading: https://repository.apache.org/content/repositories/snapshots/org/apache/jena/jena-fuseki-dist/2.0.0-SNAPSHOT/maven-metadata.xml
[INFO] Uploaded: https://repository.apache.org/content/repositories/snapshots/org/apache/jena/jena-fuseki-dist/2.0.0-SNAPSHOT/maven-metadata.xml
(961 B at 1.9 KB/sec)
[JENKINS] Archiving disabled
[INFO]                                                                         
[INFO] ------------------------------------------------------------------------
[INFO] Building Apache Jena - Security 2.12.2-SNAPSHOT
[INFO] ------------------------------------------------------------------------
[INFO] 
[INFO] --- maven-clean-plugin:2.5:clean (default-clean) @ jena-security ---
[INFO] Deleting <https://builds.apache.org/job/Jena_Development_Deploy/ws/jena-security/target>
[INFO] 
[INFO] --- maven-enforcer-plugin:1.3.1:enforce (enforce) @ jena-security ---
[INFO] 
[INFO] --- maven-enforcer-plugin:1.3.1:enforce (enforce-java) @ jena-security ---
[INFO] 
[INFO] --- maven-remote-resources-plugin:1.5:process (default) @ jena-security ---
[INFO] 
[INFO] --- maven-resources-plugin:2.6:resources (default-resources) @ jena-security ---
[INFO] Using 'UTF-8' encoding to copy filtered resources.
[INFO] skip non existing resourceDirectory <https://builds.apache.org/job/Jena_Development_Deploy/ws/jena-security/src/main/resources>
[INFO] Copying 3 resources
[INFO] 
[INFO] --- maven-compiler-plugin:3.1:compile (default-compile) @ jena-security ---
[INFO] Changes detected - recompiling the module!
[INFO] Compiling 62 source files to <https://builds.apache.org/job/Jena_Development_Deploy/ws/jena-security/target/classes>
[WARNING] <https://builds.apache.org/job/Jena_Development_Deploy/ws/jena-security/src/main/java/org/apache/jena/security/model/impl/SecuredAltImpl.java>:
Some input files use or override a deprecated API.
[WARNING] <https://builds.apache.org/job/Jena_Development_Deploy/ws/jena-security/src/main/java/org/apache/jena/security/model/impl/SecuredAltImpl.java>:
Recompile with -Xlint:deprecation for details.
[WARNING] <https://builds.apache.org/job/Jena_Development_Deploy/ws/jena-security/src/main/java/org/apache/jena/security/impl/CachedSecurityEvaluator.java>:
<https://builds.apache.org/job/Jena_Development_Deploy/ws/jena-security/src/main/java/org/apache/jena/security/impl/CachedSecurityEvaluator.java>
uses unchecked or unsafe operations.
[WARNING] <https://builds.apache.org/job/Jena_Development_Deploy/ws/jena-security/src/main/java/org/apache/jena/security/impl/CachedSecurityEvaluator.java>:
Recompile with -Xlint:unchecked for details.
[INFO] 
[INFO] --- maven-resources-plugin:2.6:testResources (default-testResources) @ jena-security
---
[INFO] Using 'UTF-8' encoding to copy filtered resources.
[INFO] Copying 5 resources
[INFO] Copying 3 resources
[INFO] 
[INFO] --- maven-compiler-plugin:3.1:testCompile (default-testCompile) @ jena-security ---
[INFO] Changes detected - recompiling the module!
[INFO] Compiling 32 source files to <https://builds.apache.org/job/Jena_Development_Deploy/ws/jena-security/target/test-classes>
[WARNING] <https://builds.apache.org/job/Jena_Development_Deploy/ws/jena-security/src/test/java/org/apache/jena/security/graph/MemGraphTest.java>:
Some input files use or override a deprecated API.
[WARNING] <https://builds.apache.org/job/Jena_Development_Deploy/ws/jena-security/src/test/java/org/apache/jena/security/graph/MemGraphTest.java>:
Recompile with -Xlint:deprecation for details.
[INFO] 
[INFO] --- maven-surefire-plugin:2.16:test (default-test) @ jena-security ---
[INFO] Surefire report directory: <https://builds.apache.org/job/Jena_Development_Deploy/ws/jena-security/target/surefire-reports>

-------------------------------------------------------
 T E S T S
-------------------------------------------------------
Running org.apache.jena.security.contract.graph.SecuredGraphListenerTest
10:02:07 WARN  riot                      :: [line: 7, col: 43] {W106} Unknown rdf:parseType:
'daml:collection' (treated as 'Literal'.
10:02:07 WARN  riot                      :: [line: 7, col: 43] {W106} Unknown rdf:parseType:
'daml:collection' (treated as 'Literal'.
10:02:07 WARN  riot                      :: [line: 7, col: 43] {W106} Unknown rdf:parseType:
'daml:collection' (treated as 'Literal'.
10:02:07 WARN  riot                      :: [line: 7, col: 43] {W106} Unknown rdf:parseType:
'daml:collection' (treated as 'Literal'.
Tests run: 54, Failures: 0, Errors: 0, Skipped: 0, Time elapsed: 1.286 sec - in org.apache.jena.security.contract.graph.SecuredGraphListenerTest
Running org.apache.jena.security.graph.SecuredPrefixMappingTest
Tests run: 384, Failures: 0, Errors: 0, Skipped: 0, Time elapsed: 0.369 sec - in org.apache.jena.security.graph.SecuredPrefixMappingTest
Running org.apache.jena.security.graph.BulkUpdateHandlerTest
Tests run: 64, Failures: 0, Errors: 0, Skipped: 0, Time elapsed: 0.083 sec - in org.apache.jena.security.graph.BulkUpdateHandlerTest
Running org.apache.jena.security.graph.MemGraphTest
Tests run: 384, Failures: 0, Errors: 0, Skipped: 0, Time elapsed: 0.253 sec - in org.apache.jena.security.graph.MemGraphTest
Running org.apache.jena.security.graph.GraphEventManagerTest
Tests run: 96, Failures: 0, Errors: 0, Skipped: 0, Time elapsed: 0.068 sec - in org.apache.jena.security.graph.GraphEventManagerTest
Running org.apache.jena.security.graph.TDBGraphTest
Tests run: 384, Failures: 0, Errors: 0, Skipped: 0, Time elapsed: 1.253 sec - in org.apache.jena.security.graph.TDBGraphTest
Running org.apache.jena.security.SecuredAssemblerTest
Tests run: 3, Failures: 0, Errors: 0, Skipped: 0, Time elapsed: 0.339 sec - in org.apache.jena.security.SecuredAssemblerTest
Running org.apache.jena.security.model.SecuredBagTest
10:02:10 WARN  LiteralLabelImpl          :: inventing a datatype for class com.hp.hpl.jena.rdf.model.impl.ResourceImpl
Tests run: 704, Failures: 0, Errors: 0, Skipped: 0, Time elapsed: 0.793 sec - in org.apache.jena.security.model.SecuredBagTest
Running org.apache.jena.security.model.SecuredSeqTest
10:02:11 WARN  LiteralLabelImpl          :: inventing a datatype for class com.hp.hpl.jena.rdf.model.impl.LiteralImpl
Tests run: 1280, Failures: 0, Errors: 0, Skipped: 0, Time elapsed: 0.895 sec - in org.apache.jena.security.model.SecuredSeqTest
Running org.apache.jena.security.model.SecuredRDFNodeTest
Tests run: 128, Failures: 0, Errors: 0, Skipped: 0, Time elapsed: 0.032 sec - in org.apache.jena.security.model.SecuredRDFNodeTest
Running org.apache.jena.security.model.SecuredRDFListTest
Tests run: 1408, Failures: 0, Errors: 0, Skipped: 0, Time elapsed: 0.86 sec - in org.apache.jena.security.model.SecuredRDFListTest
Running org.apache.jena.security.model.SecuredModelTest
Tests run: 1696, Failures: 0, Errors: 0, Skipped: 0, Time elapsed: 0.623 sec - in org.apache.jena.security.model.SecuredModelTest
Running org.apache.jena.security.model.SecuredStatementTest
Tests run: 320, Failures: 0, Errors: 0, Skipped: 0, Time elapsed: 0.136 sec - in org.apache.jena.security.model.SecuredStatementTest
Running org.apache.jena.security.model.SecuredLiteralTest
Tests run: 704, Failures: 0, Errors: 0, Skipped: 0, Time elapsed: 0.248 sec - in org.apache.jena.security.model.SecuredLiteralTest
Running org.apache.jena.security.model.SecuredResourceTest
Tests run: 544, Failures: 0, Errors: 0, Skipped: 0, Time elapsed: 0.188 sec - in org.apache.jena.security.model.SecuredResourceTest
Running org.apache.jena.security.model.SecuredPropertyTest
Tests run: 576, Failures: 0, Errors: 0, Skipped: 0, Time elapsed: 0.233 sec - in org.apache.jena.security.model.SecuredPropertyTest
Running org.apache.jena.security.model.SecuredReifiedStatementTest
Tests run: 576, Failures: 0, Errors: 0, Skipped: 0, Time elapsed: 0.243 sec - in org.apache.jena.security.model.SecuredReifiedStatementTest
Running org.apache.jena.security.model.SecuredAltTest
Tests run: 1376, Failures: 0, Errors: 0, Skipped: 0, Time elapsed: 0.612 sec - in org.apache.jena.security.model.SecuredAltTest
Running org.apache.jena.security.model.SecuredModelDetailTest
Tests run: 5, Failures: 0, Errors: 0, Skipped: 0, Time elapsed: 0.007 sec - in org.apache.jena.security.model.SecuredModelDetailTest
Running org.apache.jena.security.query.QueryEngineTest
Tests run: 2, Failures: 0, Errors: 0, Skipped: 0, Time elapsed: 0.22 sec - in org.apache.jena.security.query.QueryEngineTest
Running org.apache.jena.security.query.rewriter.OpRewriterTest
Tests run: 2, Failures: 0, Errors: 0, Skipped: 0, Time elapsed: 0 sec - in org.apache.jena.security.query.rewriter.OpRewriterTest

Results :

Tests run: 10690, Failures: 0, Errors: 0, Skipped: 0

[JENKINS] Recording test results
[INFO] 
[INFO] --- maven-jar-plugin:2.4:jar (default-jar) @ jena-security ---
[INFO] Building jar: <https://builds.apache.org/job/Jena_Development_Deploy/ws/jena-security/target/jena-security-2.12.2-SNAPSHOT.jar>
[INFO] 
[INFO] --- maven-site-plugin:3.3:attach-descriptor (attach-descriptor) @ jena-security ---
[INFO] 
[INFO] --- maven-javadoc-plugin:2.9.1:jar (attach-javadocs) @ jena-security ---
[ERROR] Error fetching link: <https://builds.apache.org/job/Jena_Development_Deploy/ws/apache-jena-libs/target/apidocs/package-list.>
Ignored it.
[INFO] 
1 warning
[WARNING] Javadoc Warnings
[WARNING] <https://builds.apache.org/job/Jena_Development_Deploy/ws/jena-security/src/main/java/org/apache/jena/security/SecurityEvaluatorAssembler.java>:108:
warning - @prefix is an unknown tag.
[INFO] Building jar: <https://builds.apache.org/job/Jena_Development_Deploy/ws/jena-security/target/jena-security-2.12.2-SNAPSHOT-javadoc.jar>
[INFO] 
[INFO] --- maven-jar-plugin:2.4:test-jar (default) @ jena-security ---
[INFO] Building jar: <https://builds.apache.org/job/Jena_Development_Deploy/ws/jena-security/target/jena-security-2.12.2-SNAPSHOT-tests.jar>
[INFO] 
[INFO] --- apache-rat-plugin:0.11:check (rat-checks) @ jena-security ---
[INFO] 51 implicit excludes (use -debug for more details).
[INFO] Exclude: **/src-examples/data/*
[INFO] Exclude: **/dist/ABOUT
[INFO] Exclude: **/SEE_FUSEKI2
[INFO] Exclude: **/src/main/webapp/css/*
[INFO] Exclude: **/src/main/webapp/fonts/*
[INFO] Exclude: **/src/main/webapp/js/**/*
[INFO] Exclude: **/vocabularies/*
[INFO] Exclude: **/Vocabularies/*
[INFO] Exclude: **/src/main/**/*.html
[INFO] Exclude: **/src/**/package-info.java
[INFO] Exclude: **/DEPENDENCIES
[INFO] Exclude: **/*.txt
[INFO] Exclude: **/*.md
[INFO] Exclude: **/META-INF/services/*
[INFO] Exclude: **/src/test/resources/**/*
[INFO] Exclude: **/testing/**/*
[INFO] Exclude: **/log4j.properties
[INFO] Exclude: **/log4j-testing.properties
[INFO] Exclude: **/derby.log
[INFO] Exclude: **/DB/**/*
[INFO] Exclude: **/tdb*.cfg
[INFO] Exclude: **/run/**/*
[INFO] Exclude: **/*.classpath
[INFO] 98 resources included (use -debug for more details)
[INFO] Rat check: Summary of files. Unapproved: 1 unknown: 1 generated: 0 approved: 95 licence.
[JENKINS] Archiving disabled
[JENKINS] Archiving disabled
[JENKINS] Archiving disabled
[JENKINS] Archiving disabled
[JENKINS] Archiving disabled
[JENKINS] Archiving disabled
[JENKINS] Archiving disabled
[JENKINS] Archiving disabled
[JENKINS] Archiving disabled
[JENKINS] Archiving disabled
[JENKINS] Archiving disabled
[JENKINS] Archiving disabled
[JENKINS] Archiving disabled
[JENKINS] Archiving disabled
[JENKINS] Archiving disabled
[JENKINS] Archiving disabled
[JENKINS] Archiving disabled
[JENKINS] Archiving disabled
[JENKINS] Archiving disabled
[JENKINS] Archiving disabled
[JENKINS] Archiving disabled
[JENKINS] Archiving disabled
[JENKINS] Archiving disabled
[JENKINS] Archiving disabled
[JENKINS] Archiving disabled
[JENKINS] Archiving disabled
[JENKINS] Archiving disabled
[JENKINS] Archiving disabled[INFO] ------------------------------------------------------------------------
[INFO] Reactor Summary:
[INFO] 
[INFO] Apache Jena - Parent .............................. SUCCESS [10.651s]
[INFO] Apache Jena - IRI ................................. SUCCESS [14.873s]
[INFO] Apache Jena - Core ................................ SUCCESS [1:22.706s]
[INFO] Apache Jena - ARQ (SPARQL 1.1 Query Engine) ....... SUCCESS [1:25.295s]
[INFO] Apache Jena - TDB (Native Triple Store) ........... SUCCESS [26.458s]
[INFO] Apache Jena - Libraries POM ....................... SUCCESS [5.007s]
[INFO] Apache Jena - SPARQL Text Search .................. SUCCESS [22.747s]
[INFO] Apache Jena - SPARQL Spatial Search ............... SUCCESS [15.880s]
[INFO] Apache Jena - Data Tables for RDF and SPARQL ...... SUCCESS [12.802s]
[INFO] Apache Jena - SDB (SQL based triple store) ........ SUCCESS [47.415s]
[INFO] Apache Jena - Fuseki1 (SPARQL 1.1 Server) ......... SUCCESS [45.050s]
[INFO] Apache Jena - Fuseki, SPARQL 1.1 Server ........... SUCCESS [3.531s]
[INFO] Apache Jena - Fuseki Server Engine ................ SUCCESS [17.119s]
[INFO] Apache Jena - Fuseki WAR File ..................... SUCCESS [13.119s]
[INFO] Apache Jena - Fuseki Server Standalone Jar ........ SUCCESS [16.213s]
[INFO] Apache Jena - Fuseki Binary Distribution .......... SUCCESS [29.671s]
[INFO] Apache Jena - Security ............................ FAILURE [20.684s]
[INFO] Apache Jena - JDBC Parent ......................... SKIPPED
[INFO] Apache Jena - JDBC Core API ....................... SKIPPED
[INFO] Apache Jena - JDBC Remote Endpoint Driver ......... SKIPPED
[INFO] Apache Jena - JDBC In-Memory Driver ............... SKIPPED
[INFO] Apache Jena - JDBC TDB Driver ..................... SKIPPED
[INFO] Apache Jena - JDBC Driver Bundle .................. SKIPPED
[INFO] Apache Jena - Maven Plugins, including schemagen .. SKIPPED
[INFO] Apache Jena - Distribution ........................ SKIPPED
[INFO] Apache Jena - Extras .............................. SKIPPED
[INFO] Apache Jena - Extras - Query Builder .............. SKIPPED
[INFO] Apache Jena ....................................... SKIPPED
[INFO] ------------------------------------------------------------------------
[INFO] BUILD FAILURE
[INFO] ------------------------------------------------------------------------
[INFO] Total time: 8:11.397s
[INFO] Finished at: Wed Jan 14 10:02:34 UTC 2015

[INFO] Final Memory: 72M/284M
[INFO] ------------------------------------------------------------------------
[ERROR] Failed to execute goal org.apache.rat:apache-rat-plugin:0.11:check (rat-checks) on
project jena-security: Too many files with unapproved license: 1 See RAT report in: <https://builds.apache.org/job/Jena_Development_Deploy/ws/jena-security/target/rat.txt>
-> [Help 1]
[ERROR] 
[ERROR] To see the full stack trace of the errors, re-run Maven with the -e switch.
[ERROR] Re-run Maven using the -X switch to enable full debug logging.
[ERROR] 
[ERROR] For more information about the errors and possible solutions, please read the following
articles:
[ERROR] [Help 1] http://cwiki.apache.org/confluence/display/MAVEN/MojoFailureException
[ERROR] 
[ERROR] After correcting the problems, you can resume the build with the command
[ERROR]   mvn <goals> -rf :jena-security
channel stopped

Mime
View raw message