jena-commits mailing list archives

Site index · List index
Message view « Date » · « Thread »
Top « Date » · « Thread »
From Apache Jenkins Server <jenk...@builds.apache.org>
Subject Build failed in Jenkins: Jena_Development_Deploy #726
Date Thu, 23 Oct 2014 07:56:22 GMT
See <https://builds.apache.org/job/Jena_Development_Deploy/726/changes>

Changes:

[rvesse] Work towards enabling automatic RAT checks

[rvesse] Work on getting rat:check to pass

[rvesse] RAT checks passing for Jena Core

[rvesse] Get remaining modules to pass RAT checks

[andy] Add license

[andy] Add license headers

[andy] Add license headers

[andy] Remove old stuff

[andy] Remove exclusions that no longer need excluding

[andy] Clarift position of 'testing' files

------------------------------------------
Started by an SCM change
Building remotely on ubuntu-6 (docker Ubuntu ubuntu) in workspace <https://builds.apache.org/job/Jena_Development_Deploy/ws/>
Cloning the remote Git repository
Cloning repository git://git.apache.org/jena.git
 > git init <https://builds.apache.org/job/Jena_Development_Deploy/ws/>
Fetching upstream changes from git://git.apache.org/jena.git
 > git --version
 > git fetch --tags --progress git://git.apache.org/jena.git +refs/heads/*:refs/remotes/origin/*
 > git config remote.origin.url git://git.apache.org/jena.git
 > git config remote.origin.fetch +refs/heads/*:refs/remotes/origin/*
 > git config remote.origin.url git://git.apache.org/jena.git
Fetching upstream changes from git://git.apache.org/jena.git
 > git fetch --tags --progress git://git.apache.org/jena.git +refs/heads/*:refs/remotes/origin/*
 > git rev-parse origin/master^{commit}
Checking out Revision 6252acede5822d8ffacec141d20c88028c25836c (origin/master)
 > git config core.sparsecheckout
 > git checkout -f 6252acede5822d8ffacec141d20c88028c25836c
 > git rev-list 17a2537bbe5fe7858e1d854c690e72a0108bd532
Parsing POMs
Failed to transfer Could not find metadata org.apache.jena:jena-parent:11-SNAPSHOT/maven-metadata.xml
in Nexus (http://repository.apache.org/snapshots)
ERROR: Failed to parse POMs
java.io.IOException: remote file operation failed: <https://builds.apache.org/job/Jena_Development_Deploy/ws/>
at hudson.remoting.Channel@4c1e596d:ubuntu-6
	at hudson.FilePath.act(FilePath.java:910)
	at hudson.FilePath.act(FilePath.java:887)
	at hudson.maven.MavenModuleSetBuild$MavenModuleSetBuildExecution.parsePoms(MavenModuleSetBuild.java:953)
	at hudson.maven.MavenModuleSetBuild$MavenModuleSetBuildExecution.doRun(MavenModuleSetBuild.java:681)
	at hudson.model.AbstractBuild$AbstractBuildExecution.run(AbstractBuild.java:585)
	at hudson.model.Run.execute(Run.java:1676)
	at hudson.maven.MavenModuleSetBuild.run(MavenModuleSetBuild.java:529)
	at hudson.model.ResourceController.execute(ResourceController.java:88)
	at hudson.model.Executor.run(Executor.java:231)
Caused by: hudson.remoting.ProxyException: hudson.maven.MavenModuleSetBuild$MavenExecutionException:
org.apache.maven.project.ProjectBuildingException: Some problems were encountered while processing
the POMs:
[FATAL] Non-resolvable parent POM: Could not find artifact org.apache.jena:jena-parent:pom:11-SNAPSHOT
in Nexus (http://repository.apache.org/snapshots) and 'parent.relativePath' points at no local
POM @ line 26, column 11

	at hudson.maven.MavenModuleSetBuild$PomParser.invoke(MavenModuleSetBuild.java:1357)
	at hudson.maven.MavenModuleSetBuild$PomParser.invoke(MavenModuleSetBuild.java:1091)
	at hudson.FilePath$FileCallableWrapper.call(FilePath.java:2462)
	at hudson.remoting.UserRequest.perform(UserRequest.java:118)
	at hudson.remoting.UserRequest.perform(UserRequest.java:48)
	at hudson.remoting.Request$2.run(Request.java:328)
	at hudson.remoting.InterceptingExecutorService$1.call(InterceptingExecutorService.java:72)
	at java.util.concurrent.FutureTask.run(FutureTask.java:262)
	at java.util.concurrent.ThreadPoolExecutor.runWorker(ThreadPoolExecutor.java:1145)
	at java.util.concurrent.ThreadPoolExecutor$Worker.run(ThreadPoolExecutor.java:615)
Failed to transfer Could not find artifact org.apache.jena:jena-parent:pom:11-SNAPSHOT in
Nexus (http://repository.apache.org/snapshots)	at java.lang.Thread.run(Thread.java:745)
Caused by: hudson.remoting.ProxyException: org.apache.maven.project.ProjectBuildingException:
Some problems were encountered while processing the POMs:
[FATAL] Non-resolvable parent POM: Could not find artifact org.apache.jena:jena-parent:pom:11-SNAPSHOT
in Nexus (http://repository.apache.org/snapshots) and 'parent.relativePath' points at no local
POM @ line 26, column 11

	at org.apache.maven.project.DefaultProjectBuilder.build(DefaultProjectBuilder.java:364)
	at hudson.maven.MavenEmbedder.buildProjects(MavenEmbedder.java:361)
	at hudson.maven.MavenEmbedder.readProjects(MavenEmbedder.java:331)
	at hudson.maven.MavenModuleSetBuild$PomParser.invoke(MavenModuleSetBuild.java:1294)
	... 10 more


Mime
View raw message