jena-commits mailing list archives

Site index · List index
Message view « Date » · « Thread »
Top « Date » · « Thread »
From Apache Jenkins Server <jenk...@builds.apache.org>
Subject Build failed in Jenkins: Jena_Development_Test #1414
Date Fri, 05 Sep 2014 15:29:21 GMT
See <https://builds.apache.org/job/Jena_Development_Test/1414/changes>

Changes:

[andy] SystemParamsBuidler (renaming)

------------------------------------------
[...truncated 257 lines...]
Tests run: 127, Failures: 0, Errors: 0, Skipped: 0, Time elapsed: 0.032 sec - in com.hp.hpl.jena.sparql.syntax.TS_SSE
Running com.hp.hpl.jena.sparql.syntax.TS_Serialization
Tests run: 42, Failures: 0, Errors: 0, Skipped: 0, Time elapsed: 0.01 sec - in com.hp.hpl.jena.sparql.syntax.TS_Serialization
Running com.hp.hpl.jena.sparql.negation.TS_Negation
Tests run: 12, Failures: 0, Errors: 0, Skipped: 0, Time elapsed: 0.076 sec - in com.hp.hpl.jena.sparql.negation.TS_Negation
Running com.hp.hpl.jena.sparql.transaction.TS_Transaction
Tests run: 23, Failures: 0, Errors: 0, Skipped: 5, Time elapsed: 0.013 sec - in com.hp.hpl.jena.sparql.transaction.TS_Transaction
Running com.hp.hpl.jena.sparql.TC_DAWG
Tests run: 467, Failures: 0, Errors: 0, Skipped: 0, Time elapsed: 0.917 sec - in com.hp.hpl.jena.sparql.TC_DAWG
Running com.hp.hpl.jena.sparql.core.TS_Core
Tests run: 95, Failures: 0, Errors: 0, Skipped: 0, Time elapsed: 3.56 sec - in com.hp.hpl.jena.sparql.core.TS_Core
Running com.hp.hpl.jena.sparql.resultset.TS_ResultSet
Tests run: 136, Failures: 0, Errors: 0, Skipped: 0, Time elapsed: 0.102 sec - in com.hp.hpl.jena.sparql.resultset.TS_ResultSet
Running com.hp.hpl.jena.sparql.lang.TS_Lang
Tests run: 55, Failures: 0, Errors: 0, Skipped: 0, Time elapsed: 0.016 sec - in com.hp.hpl.jena.sparql.lang.TS_Lang
Running com.hp.hpl.jena.sparql.function.user.TS_UserFunctions
Tests run: 22, Failures: 0, Errors: 0, Skipped: 0, Time elapsed: 0.01 sec - in com.hp.hpl.jena.sparql.function.user.TS_UserFunctions
Running com.hp.hpl.jena.sparql.util.TS_Util
Tests run: 79, Failures: 0, Errors: 0, Skipped: 0, Time elapsed: 0.041 sec - in com.hp.hpl.jena.sparql.util.TS_Util
Running com.hp.hpl.jena.sparql.solver.TS_Solver
Tests run: 23, Failures: 0, Errors: 0, Skipped: 0, Time elapsed: 0.017 sec - in com.hp.hpl.jena.sparql.solver.TS_Solver
Running com.hp.hpl.jena.sparql.expr.TS_Expr
Tests run: 1084, Failures: 0, Errors: 0, Skipped: 0, Time elapsed: 0.326 sec - in com.hp.hpl.jena.sparql.expr.TS_Expr
Running com.hp.hpl.jena.sparql.graph.TS_Graph
Tests run: 64, Failures: 0, Errors: 0, Skipped: 0, Time elapsed: 0.036 sec - in com.hp.hpl.jena.sparql.graph.TS_Graph
Running com.hp.hpl.jena.sparql.TC_Scripted
Tests run: 995, Failures: 0, Errors: 0, Skipped: 0, Time elapsed: 1.392 sec - in com.hp.hpl.jena.sparql.TC_Scripted
Running com.hp.hpl.jena.query.TS_ParamString
Tests run: 140, Failures: 0, Errors: 0, Skipped: 0, Time elapsed: 0.068 sec - in com.hp.hpl.jena.query.TS_ParamString
Running arq.TS_Cmd
Tests run: 7, Failures: 0, Errors: 0, Skipped: 0, Time elapsed: 0.003 sec - in arq.TS_Cmd

Results :

Tests run: 6914, Failures: 0, Errors: 0, Skipped: 5

[JENKINS] Recording test results
[JENKINS] Archiving disabled
[INFO]                                                                         
[INFO] ------------------------------------------------------------------------
[INFO] Building Apache Jena - TDB (Native Triple Store) 1.1.1-SNAPSHOT
[INFO] ------------------------------------------------------------------------
[INFO] 
[INFO] --- maven-clean-plugin:2.5:clean (default-clean) @ jena-tdb ---
[INFO] 
[INFO] --- maven-enforcer-plugin:1.3.1:enforce (enforce) @ jena-tdb ---
[INFO] 
[INFO] --- maven-enforcer-plugin:1.3.1:enforce (enforce-java) @ jena-tdb ---
[INFO] 
[INFO] --- maven-remote-resources-plugin:1.5:process (default) @ jena-tdb ---
[INFO] 
[INFO] --- maven-resources-plugin:2.6:resources (default-resources) @ jena-tdb ---
[INFO] Using 'UTF-8' encoding to copy filtered resources.
[INFO] Copying 0 resource
[INFO] Copying 1 resource
[INFO] Copying 3 resources
[INFO] 
[INFO] --- maven-compiler-plugin:3.1:compile (default-compile) @ jena-tdb ---
[INFO] Changes detected - recompiling the module!
[INFO] Compiling 263 source files to <https://builds.apache.org/job/Jena_Development_Test/ws/trunk/jena-tdb/target/classes>
[INFO] -------------------------------------------------------------
[ERROR] COMPILATION ERROR : 
[INFO] -------------------------------------------------------------
[ERROR] <https://builds.apache.org/job/Jena_Development_Test/ws/trunk/jena-tdb/src/main/java/com/hp/hpl/jena/tdb/store/StorageConfig.java>:[27,33]
cannot find symbol
  symbol:   class SystemParams
  location: package com.hp.hpl.jena.tdb.setup
[ERROR] <https://builds.apache.org/job/Jena_Development_Test/ws/trunk/jena-tdb/src/main/java/com/hp/hpl/jena/tdb/store/StorageConfig.java>:[32,18]
cannot find symbol
  symbol:   class SystemParams
  location: class com.hp.hpl.jena.tdb.store.StorageConfig
[ERROR] <https://builds.apache.org/job/Jena_Development_Test/ws/trunk/jena-tdb/src/main/java/com/hp/hpl/jena/tdb/store/StorageConfig.java>:[39,45]
cannot find symbol
  symbol:   class SystemParams
  location: class com.hp.hpl.jena.tdb.store.StorageConfig
[ERROR] <https://builds.apache.org/job/Jena_Development_Test/ws/trunk/jena-tdb/src/main/java/com/hp/hpl/jena/tdb/setup/DatasetBuilderStd.java>:[56,13]
cannot find symbol
  symbol:   class SystemParams
  location: class com.hp.hpl.jena.tdb.setup.DatasetBuilderStd
[ERROR] <https://builds.apache.org/job/Jena_Development_Test/ws/trunk/jena-tdb/src/main/java/com/hp/hpl/jena/tdb/setup/DatasetBuilderStd.java>:[114,53]
cannot find symbol
  symbol:   class SystemParams
  location: class com.hp.hpl.jena.tdb.setup.DatasetBuilderStd
[ERROR] <https://builds.apache.org/job/Jena_Development_Test/ws/trunk/jena-tdb/src/main/java/com/hp/hpl/jena/tdb/setup/DatasetBuilderStd.java>:[126,54]
cannot find symbol
  symbol:   class SystemParams
  location: class com.hp.hpl.jena.tdb.setup.DatasetBuilderStd
[ERROR] <https://builds.apache.org/job/Jena_Development_Test/ws/trunk/jena-tdb/src/main/java/com/hp/hpl/jena/tdb/setup/DatasetBuilder.java>:[32,53]
cannot find symbol
  symbol:   class SystemParams
  location: interface com.hp.hpl.jena.tdb.setup.DatasetBuilder
[ERROR] <https://builds.apache.org/job/Jena_Development_Test/ws/trunk/jena-tdb/src/main/java/com/hp/hpl/jena/tdb/mgt/TDBSystemInfo.java>:[21,33]
cannot find symbol
  symbol:   class SystemParams
  location: package com.hp.hpl.jena.tdb.setup
[ERROR] <https://builds.apache.org/job/Jena_Development_Test/ws/trunk/jena-tdb/src/main/java/com/hp/hpl/jena/tdb/mgt/TDBSystemInfo.java>:[26,20]
cannot find symbol
  symbol:   class SystemParams
  location: class com.hp.hpl.jena.tdb.mgt.TDBSystemInfo
[ERROR] <https://builds.apache.org/job/Jena_Development_Test/ws/trunk/jena-tdb/src/main/java/com/hp/hpl/jena/tdb/nodetable/NodeTableFactory.java>:[27,33]
cannot find symbol
  symbol:   class SystemParams
  location: package com.hp.hpl.jena.tdb.setup
[ERROR] <https://builds.apache.org/job/Jena_Development_Test/ws/trunk/jena-tdb/src/main/java/com/hp/hpl/jena/tdb/sys/SetupTDB.java>:[49,33]
cannot find symbol
  symbol:   class SystemParams
  location: package com.hp.hpl.jena.tdb.setup
[ERROR] <https://builds.apache.org/job/Jena_Development_Test/ws/trunk/jena-tdb/src/main/java/com/hp/hpl/jena/tdb/sys/SetupTDB.java>:[71,20]
cannot find symbol
  symbol:   class SystemParams
  location: class com.hp.hpl.jena.tdb.sys.SetupTDB
[ERROR] <https://builds.apache.org/job/Jena_Development_Test/ws/trunk/jena-tdb/src/main/java/com/hp/hpl/jena/tdb/setup/DatasetBuilderBasic.java>:[50,13]
cannot find symbol
  symbol:   class SystemParams
  location: class com.hp.hpl.jena.tdb.setup.DatasetBuilderBasic
[ERROR] <https://builds.apache.org/job/Jena_Development_Test/ws/trunk/jena-tdb/src/main/java/com/hp/hpl/jena/tdb/setup/DatasetBuilderBasic.java>:[60,54]
cannot find symbol
  symbol:   class SystemParams
  location: class com.hp.hpl.jena.tdb.setup.DatasetBuilderBasic
[ERROR] <https://builds.apache.org/job/Jena_Development_Test/ws/trunk/jena-tdb/src/main/java/com/hp/hpl/jena/tdb/setup/DatasetBuilderStd.java>:[116,22]
cannot find symbol
  symbol:   variable SystemParams
  location: class com.hp.hpl.jena.tdb.setup.DatasetBuilderStd
[ERROR] <https://builds.apache.org/job/Jena_Development_Test/ws/trunk/jena-tdb/src/main/java/com/hp/hpl/jena/tdb/mgt/TDBSystemInfo.java>:[26,42]
cannot find symbol
  symbol:   variable SystemParams
  location: class com.hp.hpl.jena.tdb.mgt.TDBSystemInfo
[ERROR] <https://builds.apache.org/job/Jena_Development_Test/ws/trunk/jena-tdb/src/main/java/com/hp/hpl/jena/tdb/nodetable/NodeTableFactory.java>:[47,9]
cannot find symbol
  symbol:   class SystemParams
  location: class com.hp.hpl.jena.tdb.nodetable.NodeTableFactory
[ERROR] <https://builds.apache.org/job/Jena_Development_Test/ws/trunk/jena-tdb/src/main/java/com/hp/hpl/jena/tdb/nodetable/NodeTableFactory.java>:[47,31]
cannot find symbol
  symbol:   variable SystemParams
  location: class com.hp.hpl.jena.tdb.nodetable.NodeTableFactory
[ERROR] <https://builds.apache.org/job/Jena_Development_Test/ws/trunk/jena-tdb/src/main/java/com/hp/hpl/jena/tdb/sys/SetupTDB.java>:[71,42]
cannot find symbol
  symbol:   variable SystemParams
  location: class com.hp.hpl.jena.tdb.sys.SetupTDB
[ERROR] <https://builds.apache.org/job/Jena_Development_Test/ws/trunk/jena-tdb/src/main/java/com/hp/hpl/jena/tdb/setup/DatasetBuilderBasic.java>:[66,22]
cannot find symbol
  symbol:   variable SystemParams
  location: class com.hp.hpl.jena.tdb.setup.DatasetBuilderBasic
[INFO] 20 errors 
[INFO] -------------------------------------------------------------
[JENKINS] Archiving disabled
[JENKINS] Archiving disabled
[JENKINS] Archiving disabled
[JENKINS] Archiving disabled
[JENKINS] Archiving disabled
[JENKINS] Archiving disabled
[JENKINS] Archiving disabled
[JENKINS] Archiving disabled
[JENKINS] Archiving disabled
[JENKINS] Archiving disabled
[JENKINS] Archiving disabled
[JENKINS] Archiving disabled
[JENKINS] Archiving disabled
[JENKINS] Archiving disabled
[JENKINS] Archiving disabled
[JENKINS] Archiving disabled
[JENKINS] Archiving disabled
[JENKINS] Archiving disabled
[JENKINS] Archiving disabled
[JENKINS] Archiving disabled
[JENKINS] Archiving disabled[INFO] ------------------------------------------------------------------------
[INFO] Reactor Summary:
[INFO] 
[INFO] Apache Jena - Parent .............................. SUCCESS [26.051s]
[INFO] Apache Jena - IRI ................................. SUCCESS [20.481s]
[INFO] Apache Jena - Core ................................ SUCCESS [47.659s]
[INFO] Apache Jena - ARQ (SPARQL 1.1 Query Engine) ....... SUCCESS [51.493s]
[INFO] Apache Jena - TDB (Native Triple Store) ........... FAILURE [2.887s]
[INFO] Apache Jena - Libraries POM ....................... SKIPPED
[INFO] Apache Jena - SPARQL Text Search .................. SKIPPED
[INFO] Apache Jena - SPARQL Spatial Search ............... SKIPPED
[INFO] Apache Jena - SDB (SQL based triple store) ........ SKIPPED
[INFO] Apache Jena - Fuseki (SPARQL 1.1 Server) .......... SKIPPED
[INFO] Apache Jena - Security ............................ SKIPPED
[INFO] Apache Jena - JDBC Parent ......................... SKIPPED
[INFO] Apache Jena - JDBC Core API ....................... SKIPPED
[INFO] Apache Jena - JDBC Remote Endpoint Driver ......... SKIPPED
[INFO] Apache Jena - JDBC In-Memory Driver ............... SKIPPED
[INFO] Apache Jena - JDBC TDB Driver ..................... SKIPPED
[INFO] Apache Jena - JDBC Driver Bundle .................. SKIPPED
[INFO] Apache Jena - Maven Plugins, including schemagen .. SKIPPED
[INFO] Apache Jena - Distribution ........................ SKIPPED
[INFO] Apache Jena ....................................... SKIPPED
[INFO] ------------------------------------------------------------------------
[INFO] BUILD FAILURE
[INFO] ------------------------------------------------------------------------
[INFO] Total time: 2:46.732s
[INFO] Finished at: Fri Sep 05 15:29:08 UTC 2014

[INFO] Final Memory: 40M/397M
[INFO] ------------------------------------------------------------------------
[ERROR] Failed to execute goal org.apache.maven.plugins:maven-compiler-plugin:3.1:compile
(default-compile) on project jena-tdb: Compilation failure: Compilation failure:
[ERROR] <https://builds.apache.org/job/Jena_Development_Test/ws/trunk/jena-tdb/src/main/java/com/hp/hpl/jena/tdb/store/StorageConfig.java>:[27,33]
cannot find symbol
[ERROR] symbol:   class SystemParams
[ERROR] location: package com.hp.hpl.jena.tdb.setup
[ERROR] <https://builds.apache.org/job/Jena_Development_Test/ws/trunk/jena-tdb/src/main/java/com/hp/hpl/jena/tdb/store/StorageConfig.java>:[32,18]
cannot find symbol
[ERROR] symbol:   class SystemParams
[ERROR] location: class com.hp.hpl.jena.tdb.store.StorageConfig
[ERROR] <https://builds.apache.org/job/Jena_Development_Test/ws/trunk/jena-tdb/src/main/java/com/hp/hpl/jena/tdb/store/StorageConfig.java>:[39,45]
cannot find symbol
[ERROR] symbol:   class SystemParams
[ERROR] location: class com.hp.hpl.jena.tdb.store.StorageConfig
[ERROR] <https://builds.apache.org/job/Jena_Development_Test/ws/trunk/jena-tdb/src/main/java/com/hp/hpl/jena/tdb/setup/DatasetBuilderStd.java>:[56,13]
cannot find symbol
[ERROR] symbol:   class SystemParams
[ERROR] location: class com.hp.hpl.jena.tdb.setup.DatasetBuilderStd
[ERROR] <https://builds.apache.org/job/Jena_Development_Test/ws/trunk/jena-tdb/src/main/java/com/hp/hpl/jena/tdb/setup/DatasetBuilderStd.java>:[114,53]
cannot find symbol
[ERROR] symbol:   class SystemParams
[ERROR] location: class com.hp.hpl.jena.tdb.setup.DatasetBuilderStd
[ERROR] <https://builds.apache.org/job/Jena_Development_Test/ws/trunk/jena-tdb/src/main/java/com/hp/hpl/jena/tdb/setup/DatasetBuilderStd.java>:[126,54]
cannot find symbol
[ERROR] symbol:   class SystemParams
[ERROR] location: class com.hp.hpl.jena.tdb.setup.DatasetBuilderStd
[ERROR] <https://builds.apache.org/job/Jena_Development_Test/ws/trunk/jena-tdb/src/main/java/com/hp/hpl/jena/tdb/setup/DatasetBuilder.java>:[32,53]
cannot find symbol
[ERROR] symbol:   class SystemParams
[ERROR] location: interface com.hp.hpl.jena.tdb.setup.DatasetBuilder
[ERROR] <https://builds.apache.org/job/Jena_Development_Test/ws/trunk/jena-tdb/src/main/java/com/hp/hpl/jena/tdb/mgt/TDBSystemInfo.java>:[21,33]
cannot find symbol
[ERROR] symbol:   class SystemParams
[ERROR] location: package com.hp.hpl.jena.tdb.setup
[ERROR] <https://builds.apache.org/job/Jena_Development_Test/ws/trunk/jena-tdb/src/main/java/com/hp/hpl/jena/tdb/mgt/TDBSystemInfo.java>:[26,20]
cannot find symbol
[ERROR] symbol:   class SystemParams
[ERROR] location: class com.hp.hpl.jena.tdb.mgt.TDBSystemInfo
[ERROR] <https://builds.apache.org/job/Jena_Development_Test/ws/trunk/jena-tdb/src/main/java/com/hp/hpl/jena/tdb/nodetable/NodeTableFactory.java>:[27,33]
cannot find symbol
[ERROR] symbol:   class SystemParams
[ERROR] location: package com.hp.hpl.jena.tdb.setup
[ERROR] <https://builds.apache.org/job/Jena_Development_Test/ws/trunk/jena-tdb/src/main/java/com/hp/hpl/jena/tdb/sys/SetupTDB.java>:[49,33]
cannot find symbol
[ERROR] symbol:   class SystemParams
[ERROR] location: package com.hp.hpl.jena.tdb.setup
[ERROR] <https://builds.apache.org/job/Jena_Development_Test/ws/trunk/jena-tdb/src/main/java/com/hp/hpl/jena/tdb/sys/SetupTDB.java>:[71,20]
cannot find symbol
[ERROR] symbol:   class SystemParams
[ERROR] location: class com.hp.hpl.jena.tdb.sys.SetupTDB
[ERROR] <https://builds.apache.org/job/Jena_Development_Test/ws/trunk/jena-tdb/src/main/java/com/hp/hpl/jena/tdb/setup/DatasetBuilderBasic.java>:[50,13]
cannot find symbol
[ERROR] symbol:   class SystemParams
[ERROR] location: class com.hp.hpl.jena.tdb.setup.DatasetBuilderBasic
[ERROR] <https://builds.apache.org/job/Jena_Development_Test/ws/trunk/jena-tdb/src/main/java/com/hp/hpl/jena/tdb/setup/DatasetBuilderBasic.java>:[60,54]
cannot find symbol
[ERROR] symbol:   class SystemParams
[ERROR] location: class com.hp.hpl.jena.tdb.setup.DatasetBuilderBasic
[ERROR] <https://builds.apache.org/job/Jena_Development_Test/ws/trunk/jena-tdb/src/main/java/com/hp/hpl/jena/tdb/setup/DatasetBuilderStd.java>:[116,22]
cannot find symbol
[ERROR] symbol:   variable SystemParams
[ERROR] location: class com.hp.hpl.jena.tdb.setup.DatasetBuilderStd
[ERROR] <https://builds.apache.org/job/Jena_Development_Test/ws/trunk/jena-tdb/src/main/java/com/hp/hpl/jena/tdb/mgt/TDBSystemInfo.java>:[26,42]
cannot find symbol
[ERROR] symbol:   variable SystemParams
[ERROR] location: class com.hp.hpl.jena.tdb.mgt.TDBSystemInfo
[ERROR] <https://builds.apache.org/job/Jena_Development_Test/ws/trunk/jena-tdb/src/main/java/com/hp/hpl/jena/tdb/nodetable/NodeTableFactory.java>:[47,9]
cannot find symbol
[ERROR] symbol:   class SystemParams
[ERROR] location: class com.hp.hpl.jena.tdb.nodetable.NodeTableFactory
[ERROR] <https://builds.apache.org/job/Jena_Development_Test/ws/trunk/jena-tdb/src/main/java/com/hp/hpl/jena/tdb/nodetable/NodeTableFactory.java>:[47,31]
cannot find symbol
[ERROR] symbol:   variable SystemParams
[ERROR] location: class com.hp.hpl.jena.tdb.nodetable.NodeTableFactory
[ERROR] <https://builds.apache.org/job/Jena_Development_Test/ws/trunk/jena-tdb/src/main/java/com/hp/hpl/jena/tdb/sys/SetupTDB.java>:[71,42]
cannot find symbol
[ERROR] symbol:   variable SystemParams
[ERROR] location: class com.hp.hpl.jena.tdb.sys.SetupTDB
[ERROR] <https://builds.apache.org/job/Jena_Development_Test/ws/trunk/jena-tdb/src/main/java/com/hp/hpl/jena/tdb/setup/DatasetBuilderBasic.java>:[66,22]
cannot find symbol
[ERROR] symbol:   variable SystemParams
[ERROR] location: class com.hp.hpl.jena.tdb.setup.DatasetBuilderBasic
[ERROR] -> [Help 1]
[ERROR] 
[ERROR] To see the full stack trace of the errors, re-run Maven with the -e switch.
[ERROR] Re-run Maven using the -X switch to enable full debug logging.
[ERROR] 
[ERROR] For more information about the errors and possible solutions, please read the following
articles:
[ERROR] [Help 1] http://cwiki.apache.org/confluence/display/MAVEN/MojoFailureException
[ERROR] 
[ERROR] After correcting the problems, you can resume the build with the command
[ERROR]   mvn <goals> -rf :jena-tdb
Sending e-mails to: commits@jena.apache.org
channel stopped

Mime
View raw message