jena-commits mailing list archives

Site index · List index
Message view « Date » · « Thread »
Top « Date » · « Thread »
From Apache Jenkins Server <jenk...@builds.apache.org>
Subject Build failed in Jenkins: Jena_Development_Test #1514
Date Tue, 23 Sep 2014 08:04:52 GMT
See <https://builds.apache.org/job/Jena_Development_Test/1514/>

------------------------------------------
[...truncated 392 lines...]
Tests run: 1, Failures: 0, Errors: 0, Skipped: 0, Time elapsed: 0.008 sec - in com.hp.hpl.jena.tdb.sys.TS_Sys
Running com.hp.hpl.jena.tdb.graph.TS_Graph
Tests run: 90, Failures: 0, Errors: 0, Skipped: 4, Time elapsed: 2.918 sec - in com.hp.hpl.jena.tdb.graph.TS_Graph
Running com.hp.hpl.jena.tdb.solver.TS_SolverTDB
Tests run: 10, Failures: 0, Errors: 0, Skipped: 0, Time elapsed: 0.214 sec - in com.hp.hpl.jena.tdb.solver.TS_SolverTDB
Running com.hp.hpl.jena.tdb.base.file.TS_File
Tests run: 46, Failures: 0, Errors: 0, Skipped: 4, Time elapsed: 0.388 sec - in com.hp.hpl.jena.tdb.base.file.TS_File
Running com.hp.hpl.jena.tdb.base.objectfile.TS_ObjectFile
Tests run: 40, Failures: 0, Errors: 0, Skipped: 0, Time elapsed: 0.507 sec - in com.hp.hpl.jena.tdb.base.objectfile.TS_ObjectFile
Running com.hp.hpl.jena.tdb.base.record.TS_Record
Tests run: 54, Failures: 0, Errors: 0, Skipped: 0, Time elapsed: 0.248 sec - in com.hp.hpl.jena.tdb.base.record.TS_Record
Running com.hp.hpl.jena.tdb.base.block.TS_Block
Tests run: 18, Failures: 0, Errors: 0, Skipped: 0, Time elapsed: 0.211 sec - in com.hp.hpl.jena.tdb.base.block.TS_Block
Running com.hp.hpl.jena.tdb.base.recordfile.TS_RecordFile
Tests run: 2, Failures: 0, Errors: 0, Skipped: 0, Time elapsed: 0.018 sec - in com.hp.hpl.jena.tdb.base.recordfile.TS_RecordFile
Running com.hp.hpl.jena.tdb.assembler.TS_TDBAssembler
Tests run: 7, Failures: 0, Errors: 0, Skipped: 0, Time elapsed: 1.739 sec - in com.hp.hpl.jena.tdb.assembler.TS_TDBAssembler
Running com.hp.hpl.jena.tdb.transaction.TS_TransactionTDB
07:58:03 WARN  TDB                       :: Location <https://builds.apache.org/job/Jena_Development_Test/ws/jena-tdb/target/tdb-testing/DB/>
was not locked, if another JVM accessed this location simultaneously data corruption may have
occurred
Tests run: 129, Failures: 0, Errors: 0, Skipped: 0, Time elapsed: 12.372 sec - in com.hp.hpl.jena.tdb.transaction.TS_TransactionTDB
Running com.hp.hpl.jena.tdb.lib.TS_LibTDB
Tests run: 9, Failures: 0, Errors: 0, Skipped: 0, Time elapsed: 0.128 sec - in com.hp.hpl.jena.tdb.lib.TS_LibTDB

Results :

Tests run: 791, Failures: 0, Errors: 0, Skipped: 8

[JENKINS] Recording test results
[JENKINS] Archiving disabled
[INFO]                                                                         
[INFO] ------------------------------------------------------------------------
[INFO] Building Apache Jena - Libraries POM 2.12.1-SNAPSHOT
[INFO] ------------------------------------------------------------------------
[INFO] 
[INFO] --- maven-clean-plugin:2.5:clean (default-clean) @ apache-jena-libs ---
[INFO] Deleting <https://builds.apache.org/job/Jena_Development_Test/ws/apache-jena-libs/target>
[INFO] 
[INFO] --- maven-enforcer-plugin:1.3.1:enforce (enforce) @ apache-jena-libs ---
[INFO] 
[INFO] --- maven-enforcer-plugin:1.3.1:enforce (enforce-java) @ apache-jena-libs ---
[INFO] 
[INFO] --- maven-remote-resources-plugin:1.5:process (default) @ apache-jena-libs ---
[JENKINS] Archiving disabled
[INFO]                                                                         
[INFO] ------------------------------------------------------------------------
[INFO] Building Apache Jena - SPARQL Text Search 1.1.1-SNAPSHOT
[INFO] ------------------------------------------------------------------------
[INFO] 
[INFO] --- maven-clean-plugin:2.5:clean (default-clean) @ jena-text ---
[INFO] Deleting <https://builds.apache.org/job/Jena_Development_Test/ws/jena-text/target>
[INFO] 
[INFO] --- maven-enforcer-plugin:1.3.1:enforce (enforce) @ jena-text ---
[INFO] 
[INFO] --- maven-enforcer-plugin:1.3.1:enforce (enforce-java) @ jena-text ---
[INFO] 
[INFO] --- maven-remote-resources-plugin:1.5:process (default) @ jena-text ---
[INFO] 
[INFO] --- maven-resources-plugin:2.6:resources (default-resources) @ jena-text ---
[INFO] Using 'UTF-8' encoding to copy filtered resources.
[INFO] Copying 1 resource
[INFO] Copying 2 resources
[INFO] Copying 3 resources
[INFO] 
[INFO] --- maven-compiler-plugin:3.1:compile (default-compile) @ jena-text ---
[INFO] Changes detected - recompiling the module!
[INFO] Compiling 29 source files to <https://builds.apache.org/job/Jena_Development_Test/ws/jena-text/target/classes>
[INFO] 
[INFO] --- maven-resources-plugin:2.6:testResources (default-testResources) @ jena-text ---
[INFO] Using 'UTF-8' encoding to copy filtered resources.
[INFO] Copying 1 resource
[INFO] Copying 3 resources
[INFO] 
[INFO] --- maven-compiler-plugin:3.1:testCompile (default-testCompile) @ jena-text ---
[INFO] Changes detected - recompiling the module!
[INFO] Compiling 22 source files to <https://builds.apache.org/job/Jena_Development_Test/ws/jena-text/target/test-classes>
[INFO] 
[INFO] --- maven-surefire-plugin:2.16:test (default-test) @ jena-text ---
[INFO] Surefire report directory: <https://builds.apache.org/job/Jena_Development_Test/ws/jena-text/target/surefire-reports>

-------------------------------------------------------
 T E S T S
-------------------------------------------------------
Running org.apache.jena.query.text.TS_Text
Tests run: 93, Failures: 0, Errors: 0, Skipped: 0, Time elapsed: 47.07 sec - in org.apache.jena.query.text.TS_Text

Results :

Tests run: 93, Failures: 0, Errors: 0, Skipped: 0

[JENKINS] Recording test results
[JENKINS] Archiving disabled
[INFO]                                                                         
[INFO] ------------------------------------------------------------------------
[INFO] Building Apache Jena - SPARQL Spatial Search 1.1.1-SNAPSHOT
[INFO] ------------------------------------------------------------------------
[INFO] 
[INFO] --- maven-clean-plugin:2.5:clean (default-clean) @ jena-spatial ---
[INFO] Deleting <https://builds.apache.org/job/Jena_Development_Test/ws/jena-spatial/target>
[INFO] 
[INFO] --- maven-enforcer-plugin:1.3.1:enforce (enforce) @ jena-spatial ---
[INFO] 
[INFO] --- maven-enforcer-plugin:1.3.1:enforce (enforce-java) @ jena-spatial ---
[INFO] 
[INFO] --- maven-remote-resources-plugin:1.5:process (default) @ jena-spatial ---
[INFO] 
[INFO] --- maven-resources-plugin:2.6:resources (default-resources) @ jena-spatial ---
[INFO] Using 'UTF-8' encoding to copy filtered resources.
[INFO] Copying 1 resource
[INFO] Copying 0 resource
[INFO] Copying 3 resources
[INFO] 
[INFO] --- maven-compiler-plugin:3.1:compile (default-compile) @ jena-spatial ---
[INFO] Changes detected - recompiling the module!
[INFO] Compiling 37 source files to <https://builds.apache.org/job/Jena_Development_Test/ws/jena-spatial/target/classes>
[INFO] 
[INFO] --- maven-resources-plugin:2.6:testResources (default-testResources) @ jena-spatial
---
[INFO] Using 'UTF-8' encoding to copy filtered resources.
[INFO] Copying 9 resources
[INFO] Copying 3 resources
[INFO] 
[INFO] --- maven-compiler-plugin:3.1:testCompile (default-testCompile) @ jena-spatial ---
[INFO] Changes detected - recompiling the module!
[INFO] Compiling 37 source files to <https://builds.apache.org/job/Jena_Development_Test/ws/jena-spatial/target/test-classes>
[INFO] 
[INFO] --- maven-surefire-plugin:2.16:test (default-test) @ jena-spatial ---
[INFO] Surefire report directory: <https://builds.apache.org/job/Jena_Development_Test/ws/jena-spatial/target/surefire-reports>

-------------------------------------------------------
 T E S T S
-------------------------------------------------------
Running org.apache.jena.query.spatial.TS_Spatial
Tests run: 53, Failures: 0, Errors: 0, Skipped: 0, Time elapsed: 40.923 sec - in org.apache.jena.query.spatial.TS_Spatial

Results :

Tests run: 53, Failures: 0, Errors: 0, Skipped: 0

[JENKINS] Recording test results
[JENKINS] Archiving disabled
[INFO]                                                                         
[INFO] ------------------------------------------------------------------------
[INFO] Building Apache Jena - SDB (SQL based triple store) 1.5.1-SNAPSHOT
[INFO] ------------------------------------------------------------------------
[INFO] 
[INFO] --- maven-clean-plugin:2.5:clean (default-clean) @ jena-sdb ---
[INFO] Deleting <https://builds.apache.org/job/Jena_Development_Test/ws/jena-sdb/target>
[INFO] 
[INFO] --- maven-enforcer-plugin:1.3.1:enforce (enforce) @ jena-sdb ---
[INFO] 
[INFO] --- maven-enforcer-plugin:1.3.1:enforce (enforce-java) @ jena-sdb ---
[INFO] 
[INFO] --- maven-remote-resources-plugin:1.5:process (default) @ jena-sdb ---
[INFO] 
[INFO] --- maven-resources-plugin:2.6:resources (default-resources) @ jena-sdb ---
[INFO] Using 'UTF-8' encoding to copy filtered resources.
[INFO] Copying 1 resource to com/hp/hpl/jena/sdb/
[INFO] Copying 3 resources
[INFO] 
[INFO] --- maven-compiler-plugin:3.1:compile (default-compile) @ jena-sdb ---
[INFO] Changes detected - recompiling the module!
[INFO] Compiling 348 source files to <https://builds.apache.org/job/Jena_Development_Test/ws/jena-sdb/target/classes>
[INFO] 
[INFO] --- maven-resources-plugin:2.6:testResources (default-testResources) @ jena-sdb ---
[INFO] Using 'UTF-8' encoding to copy filtered resources.
[INFO] skip non existing resourceDirectory <https://builds.apache.org/job/Jena_Development_Test/ws/jena-sdb/src/test/resources>
[INFO] Copying 3 resources
[INFO] 
[INFO] --- maven-compiler-plugin:3.1:testCompile (default-testCompile) @ jena-sdb ---
[INFO] Changes detected - recompiling the module!
[INFO] Compiling 68 source files to <https://builds.apache.org/job/Jena_Development_Test/ws/jena-sdb/target/test-classes>
[INFO] 
[INFO] --- maven-surefire-plugin:2.16:test (default-test) @ jena-sdb ---
[INFO] Surefire report directory: <https://builds.apache.org/job/Jena_Development_Test/ws/jena-sdb/target/surefire-reports>

-------------------------------------------------------
 T E S T S
-------------------------------------------------------
Running com.hp.hpl.jena.sdb.test.SDBTestAll
Killed

Results :

Tests run: 0, Failures: 0, Errors: 0, Skipped: 0

[JENKINS] Recording test results
[JENKINS] Archiving disabled
[JENKINS] Archiving disabled
[JENKINS] Archiving disabled
[JENKINS] Archiving disabled
[JENKINS] Archiving disabled
[JENKINS] Archiving disabled
[JENKINS] Archiving disabled
[JENKINS] Archiving disabled
[JENKINS] Archiving disabled
[JENKINS] Archiving disabled
[JENKINS] Archiving disabled
[JENKINS] Archiving disabled
[JENKINS] Archiving disabled
[JENKINS] Archiving disabled
[JENKINS] Archiving disabled
[JENKINS] Archiving disabled
[JENKINS] Archiving disabled
[JENKINS] Archiving disabled
[JENKINS] Archiving disabled
[JENKINS] Archiving disabled
[JENKINS] Archiving disabled
[INFO] ------------------------------------------------------------------------
[INFO] Reactor Summary:
[INFO] 
[INFO] Apache Jena - Parent .............................. SUCCESS [53.836s]
[INFO] Apache Jena - IRI ................................. SUCCESS [1:12.115s]
[INFO] Apache Jena - Core ................................ SUCCESS [5:53.182s]
[INFO] Apache Jena - ARQ (SPARQL 1.1 Query Engine) ....... SUCCESS [5:15.332s]
[INFO] Apache Jena - TDB (Native Triple Store) ........... SUCCESS [1:15.418s]
[INFO] Apache Jena - Libraries POM ....................... SUCCESS [2.541s]
[INFO] Apache Jena - SPARQL Text Search .................. SUCCESS [1:02.623s]
[INFO] Apache Jena - SPARQL Spatial Search ............... SUCCESS [53.709s]
[INFO] Apache Jena - SDB (SQL based triple store) ........ FAILURE [2:20.069s]
[INFO] Apache Jena - Fuseki (SPARQL 1.1 Server) .......... SKIPPED
[INFO] Apache Jena - Security ............................ SKIPPED
[INFO] Apache Jena - JDBC Parent ......................... SKIPPED
[INFO] Apache Jena - JDBC Core API ....................... SKIPPED
[INFO] Apache Jena - JDBC Remote Endpoint Driver ......... SKIPPED
[INFO] Apache Jena - JDBC In-Memory Driver ............... SKIPPED
[INFO] Apache Jena - JDBC TDB Driver ..................... SKIPPED
[INFO] Apache Jena - JDBC Driver Bundle .................. SKIPPED
[INFO] Apache Jena - Maven Plugins, including schemagen .. SKIPPED
[INFO] Apache Jena - Distribution ........................ SKIPPED
[INFO] Apache Jena ....................................... SKIPPED
[INFO] ------------------------------------------------------------------------
[INFO] BUILD FAILURE
[INFO] ------------------------------------------------------------------------
[INFO] Total time: 19:23.612s
[INFO] Finished at: Tue Sep 23 08:02:47 UTC 2014
[INFO] Final Memory: 43M/400M
[INFO] ------------------------------------------------------------------------
[ERROR] Failed to execute goal org.apache.maven.plugins:maven-surefire-plugin:2.16:test (default-test)
on project jena-sdb: Execution default-test of goal org.apache.maven.plugins:maven-surefire-plugin:2.16:test
failed: The forked VM terminated without saying properly goodbye. VM crash or System.exit
called ?
[ERROR] Command was/bin/sh -c cd <https://builds.apache.org/job/Jena_Development_Test/ws/jena-sdb>
&& /home/jenkins/tools/java/jdk1.7.0_25-32/jre/bin/java -jar <https://builds.apache.org/job/Jena_Development_Test/ws/jena-sdb/target/surefire/surefirebooter2396948472094542993.jar>
<https://builds.apache.org/job/Jena_Development_Test/ws/jena-sdb/target/surefire/surefire5201617713635285863tmp>
<https://builds.apache.org/job/Jena_Development_Test/ws/jena-sdb/target/surefire/surefire_66034962636951412404tmp>
[ERROR] -> [Help 1]
[ERROR] 
[ERROR] To see the full stack trace of the errors, re-run Maven with the -e switch.
[ERROR] Re-run Maven using the -X switch to enable full debug logging.
[ERROR] 
[ERROR] For more information about the errors and possible solutions, please read the following
articles:
[ERROR] [Help 1] http://cwiki.apache.org/confluence/display/MAVEN/PluginExecutionException
[ERROR] 
[ERROR] After correcting the problems, you can resume the build with the command
[ERROR]   mvn <goals> -rf :jena-sdb
channel stopped

Mime
View raw message